Hi,
Late on night i have finished at 85% SST extension, you can speak and the extension write the sentence on
an edit box. This extension will go to clickstore;
Stay tuned
Don't have an account yet? Then register once and completely free of charge and use our wide range of topics, features and great options. As a registered member on our site, you can use all functions to actively participate in community life. Write posts, open topics, upload your pictures, put your videos online, talk to other members and help us to constantly improve our project and grow together! So, what are you waiting for? Become a part of us today!
Login or registerTo get support for a technical issue such as installing the software, to query a purchase that you've made/would like to make, or anything other than using our software, please visit our Customer Service Desk:
Open a TicketHi,
Late on night i have finished at 85% SST extension, you can speak and the extension write the sentence on
an edit box. This extension will go to clickstore;
Stay tuned
Hi,
If you want to test this extension with example ;
Work properly in my device.
FAILURE: Build failed with an exception.
* Where:
Settings file 'C:\Users\Administrator\AppData\Local\Temp\And74B4.tmp\settings.gradle'
* What went wrong:
Could not compile settings file 'C:\Users\Administrator\AppData\Local\Temp\And74B4.tmp\settings.gradle'.
> startup failed:
General error during semantic analysis: Unsupported class file major version 60
java.lang.IllegalArgumentException: Unsupported class file major version 60
at groovyjarjarasm.asm.ClassReader.<init>(ClassReader.java:196)
at groovyjarjarasm.asm.ClassReader.<init>(ClassReader.java:177)
at groovyjarjarasm.asm.ClassReader.<init>(ClassReader.java:163)
at groovyjarjarasm.asm.ClassReader.<init>(ClassReader.java:284)
at org.codehaus.groovy.ast.decompiled.AsmDecompiler.parseClass(AsmDecompiler.java:81)
at org.codehaus.groovy.control.ClassNodeResolver.findDecompiled(ClassNodeResolver.java:251)
at org.codehaus.groovy.control.ClassNodeResolver.tryAsLoaderClassOrScript(ClassNodeResolver.java:189)
at org.codehaus.groovy.control.ClassNodeResolver.findClassNode(ClassNodeResolver.java:169)
at org.codehaus.groovy.control.ClassNodeResolver.resolveName(ClassNodeResolver.java:125)
at org.codehaus.groovy.ast.decompiled.AsmReferenceResolver.resolveClassNullable(AsmReferenceResolver.java:57)
at org.codehaus.groovy.ast.decompiled.AsmReferenceResolver.resolveClass(AsmReferenceResolver.java:44)
at org.codehaus.groovy.ast.decompiled.AsmReferenceResolver.resolveNonArrayType(AsmReferenceResolver.java:79)
at org.codehaus.groovy.ast.decompiled.AsmReferenceResolver.resolveType(AsmReferenceResolver.java:70)
at org.codehaus.groovy.ast.decompiled.MemberSignatureParser.createMethodNode(MemberSignatureParser.java:57)
at org.codehaus.groovy.ast.decompiled.DecompiledClassNode$2.get(DecompiledClassNode.java:234)
at org.codehaus.groovy.ast.decompiled.DecompiledClassNode$2.get(DecompiledClassNode.java:231)
at org.codehaus.groovy.ast.decompiled.DecompiledClassNode.createMethodNode(DecompiledClassNode.java:242)
at org.codehaus.groovy.ast.decompiled.DecompiledClassNode.lazyInitMembers(DecompiledClassNode.java:199)
at org.codehaus.groovy.ast.decompiled.DecompiledClassNode.getDeclaredMethods(DecompiledClassNode.java:122)
at org.codehaus.groovy.ast.ClassNode.getMethods(ClassNode.java:912)
at org.codehaus.groovy.ast.ClassNode.tryFindPossibleMethod(ClassNode.java:1280)
at org.codehaus.groovy.control.StaticImportVisitor.transformMethodCallExpression(StaticImportVisitor.java:252)
at org.codehaus.groovy.control.StaticImportVisitor.transform(StaticImportVisitor.java:113)
at org.codehaus.groovy.ast.ClassCodeExpressionTransformer.visitExpressionStatement(ClassCodeExpressionTransformer.java:142)
at org.codehaus.groovy.ast.stmt.ExpressionStatement.visit(ExpressionStatement.java:40)
at org.codehaus.groovy.ast.ClassCodeVisitorSupport.visitClassCodeContainer(ClassCodeVisitorSupport.java:110)
at org.codehaus.groovy.ast.ClassCodeVisitorSupport.visitConstructorOrMethod(ClassCodeVisitorSupport.java:121)
at org.codehaus.groovy.ast.ClassCodeExpressionTransformer.visitConstructorOrMethod(ClassCodeExpressionTransformer.java:53)
at org.codehaus.groovy.control.StaticImportVisitor.visitConstructorOrMethod(StaticImportVisitor.java:89)
at org.codehaus.groovy.ast.ClassCodeVisitorSupport.visitConstructor(ClassCodeVisitorSupport.java:128)
at org.codehaus.groovy.ast.ClassNode.visitContents(ClassNode.java:1099)
at org.codehaus.groovy.ast.ClassCodeVisitorSupport.visitClass(ClassCodeVisitorSupport.java:54)
at org.codehaus.groovy.control.StaticImportVisitor.visitClass(StaticImportVisitor.java:83)
at org.codehaus.groovy.control.CompilationUnit$14.call(CompilationUnit.java:708)
at org.codehaus.groovy.control.CompilationUnit.applyToPrimaryClassNodes(CompilationUnit.java:1084)
at org.codehaus.groovy.control.CompilationUnit.doPhaseOperation(CompilationUnit.java:640)
at org.codehaus.groovy.control.CompilationUnit.processPhaseOperations(CompilationUnit.java:618)
at org.codehaus.groovy.control.CompilationUnit.compile(CompilationUnit.java:595)
at groovy.lang.GroovyClassLoader.doParseClass(GroovyClassLoader.java:401)
at groovy.lang.GroovyClassLoader.access$300(GroovyClassLoader.java:89)
at groovy.lang.GroovyClassLoader$5.provide(GroovyClassLoader.java:341)
at groovy.lang.GroovyClassLoader$5.provide(GroovyClassLoader.java:338)
at org.codehaus.groovy.runtime.memoize.ConcurrentCommonCache.getAndPut(ConcurrentCommonCache.java:147)
at groovy.lang.GroovyClassLoader.parseClass(GroovyClassLoader.java:336)
at org.gradle.groovy.scripts.internal.DefaultScriptCompilationHandler.compileScript(DefaultScriptCompilationHandler.java:139)
at org.gradle.groovy.scripts.internal.DefaultScriptCompilationHandler.compileToDir(DefaultScriptCompilationHandler.java:95)
at org.gradle.groovy.scripts.internal.BuildOperationBackedScriptCompilationHandler$2.run(BuildOperationBackedScriptCompilationHandler.java:54)
at org.gradle.internal.operations.DefaultBuildOperationRunner$1.execute(DefaultBuildOperationRunner.java:29)
at org.gradle.internal.operations.DefaultBuildOperationRunner$1.execute(DefaultBuildOperationRunner.java:26)
at org.gradle.internal.operations.DefaultBuildOperationRunner$3.execute(DefaultBuildOperationRunner.java:75)
at org.gradle.internal.operations.DefaultBuildOperationRunner$3.execute(DefaultBuildOperationRunner.java:68)
at org.gradle.internal.operations.DefaultBuildOperationRunner.execute(DefaultBuildOperationRunner.java:153)
at org.gradle.internal.operations.DefaultBuildOperationRunner.execute(DefaultBuildOperationRunner.java:68)
at org.gradle.internal.operations.DefaultBuildOperationRunner.run(DefaultBuildOperationRunner.java:56)
at org.gradle.internal.operations.DefaultBuildOperationExecutor.lambda$run$1(DefaultBuildOperationExecutor.java:71)
at org.gradle.internal.operations.UnmanagedBuildOperationWrapper.runWithUnmanagedSupport(UnmanagedBuildOperationWrapper.java:45)
at org.gradle.internal.operations.DefaultBuildOperationExecutor.run(DefaultBuildOperationExecutor.java:71)
at org.gradle.groovy.scripts.internal.BuildOperationBackedScriptCompilationHandler.compileToDir(BuildOperationBackedScriptCompilationHandler.java:51)
at org.gradle.groovy.scripts.internal.FileCacheBackedScriptClassCompiler$CompileToCrossBuildCacheAction.execute(FileCacheBackedScriptClassCompiler.java:190)
at org.gradle.groovy.scripts.internal.FileCacheBackedScriptClassCompiler$CompileToCrossBuildCacheAction.execute(FileCacheBackedScriptClassCompiler.java:170)
at org.gradle.groovy.scripts.internal.FileCacheBackedScriptClassCompiler$ProgressReportingInitializer.execute(FileCacheBackedScriptClassCompiler.java:211)
at org.gradle.groovy.scripts.internal.FileCacheBackedScriptClassCompiler$ProgressReportingInitializer.execute(FileCacheBackedScriptClassCompiler.java:194)
at org.gradle.cache.internal.DefaultPersistentDirectoryCache$Initializer.initialize(DefaultPersistentDirectoryCache.java:100)
at org.gradle.cache.internal.FixedSharedModeCrossProcessCacheAccess$1.run(FixedSharedModeCrossProcessCacheAccess.java:86)
at org.gradle.cache.internal.DefaultFileLockManager$DefaultFileLock.doWriteAction(DefaultFileLockManager.java:215)
at org.gradle.cache.internal.DefaultFileLockManager$DefaultFileLock.writeFile(DefaultFileLockManager.java:205)
at org.gradle.cache.internal.FixedSharedModeCrossProcessCacheAccess.open(FixedSharedModeCrossProcessCacheAccess.java:83)
at org.gradle.cache.internal.DefaultCacheAccess.open(DefaultCacheAccess.java:139)
at org.gradle.cache.internal.DefaultPersistentDirectoryStore.open(DefaultPersistentDirectoryStore.java:78)
at org.gradle.cache.internal.DefaultPersistentDirectoryStore.open(DefaultPersistentDirectoryStore.java:42)
at org.gradle.cache.internal.DefaultCacheFactory.doOpen(DefaultCacheFactory.java:95)
at org.gradle.cache.internal.DefaultCacheFactory.open(DefaultCacheFactory.java:68)
at org.gradle.cache.internal.DefaultCacheRepository$PersistentCacheBuilder.open(DefaultCacheRepository.java:126)
at org.gradle.groovy.scripts.internal.FileCacheBackedScriptClassCompiler.compile(FileCacheBackedScriptClassCompiler.java:116)
at org.gradle.groovy.scripts.internal.CrossBuildInMemoryCachingScriptClassCache.getOrCompile(CrossBuildInMemoryCachingScriptClassCache.java:50)
at org.gradle.groovy.scripts.internal.BuildScopeInMemoryCachingScriptClassCompiler.compile(BuildScopeInMemoryCachingScriptClassCompiler.java:50)
at org.gradle.groovy.scripts.DefaultScriptCompilerFactory$ScriptCompilerImpl.compile(DefaultScriptCompilerFactory.java:49)
at org.gradle.configuration.DefaultScriptPluginFactory$ScriptPluginImpl.apply(DefaultScriptPluginFactory.java:125)
at org.gradle.configuration.BuildOperationScriptPlugin$1.run(BuildOperationScriptPlugin.java:65)
at org.gradle.internal.operations.DefaultBuildOperationRunner$1.execute(DefaultBuildOperationRunner.java:29)
at org.gradle.internal.operations.DefaultBuildOperationRunner$1.execute(DefaultBuildOperationRunner.java:26)
at org.gradle.internal.operations.DefaultBuildOperationRunner$3.execute(DefaultBuildOperationRunner.java:75)
at org.gradle.internal.operations.DefaultBuildOperationRunner$3.execute(DefaultBuildOperationRunner.java:68)
at org.gradle.internal.operations.DefaultBuildOperationRunner.execute(DefaultBuildOperationRunner.java:153)
at org.gradle.internal.operations.DefaultBuildOperationRunner.execute(DefaultBuildOperationRunner.java:68)
at org.gradle.internal.operations.DefaultBuildOperationRunner.run(DefaultBuildOperationRunner.java:56)
at org.gradle.internal.operations.DefaultBuildOperationExecutor.lambda$run$1(DefaultBuildOperationExecutor.java:71)
at org.gradle.internal.operations.UnmanagedBuildOperationWrapper.runWithUnmanagedSupport(UnmanagedBuildOperationWrapper.java:45)
at org.gradle.internal.operations.DefaultBuildOperationExecutor.run(DefaultBuildOperationExecutor.java:71)
at org.gradle.configuration.BuildOperationScriptPlugin.lambda$apply$0(BuildOperationScriptPlugin.java:62)
at org.gradle.configuration.internal.DefaultUserCodeApplicationContext.apply(DefaultUserCodeApplicationContext.java:43)
at org.gradle.configuration.BuildOperationScriptPlugin.apply(BuildOperationScriptPlugin.java:62)
at org.gradle.initialization.ScriptEvaluatingSettingsProcessor.applySettingsScript(ScriptEvaluatingSettingsProcessor.java:74)
at org.gradle.initialization.ScriptEvaluatingSettingsProcessor.process(ScriptEvaluatingSettingsProcessor.java:67)
at org.gradle.initialization.SettingsEvaluatedCallbackFiringSettingsProcessor.process(SettingsEvaluatedCallbackFiringSettingsProcessor.java:34)
at org.gradle.initialization.RootBuildCacheControllerSettingsProcessor.process(RootBuildCacheControllerSettingsProcessor.java:36)
at org.gradle.initialization.BuildOperationSettingsProcessor$2.call(BuildOperationSettingsProcessor.java:50)
at org.gradle.initialization.BuildOperationSettingsProcessor$2.call(BuildOperationSettingsProcessor.java:47)
at org.gradle.internal.operations.DefaultBuildOperationRunner$CallableBuildOperationWorker.execute(DefaultBuildOperationRunner.java:200)
at org.gradle.internal.operations.DefaultBuildOperationRunner$CallableBuildOperationWorker.execute(DefaultBuildOperationRunner.java:195)
at org.gradle.internal.operations.DefaultBuildOperationRunner$3.execute(DefaultBuildOperationRunner.java:75)
at org.gradle.internal.operations.DefaultBuildOperationRunner$3.execute(DefaultBuildOperationRunner.java:68)
at org.gradle.internal.operations.DefaultBuildOperationRunner.execute(DefaultBuildOperationRunner.java:153)
at org.gradle.internal.operations.DefaultBuildOperationRunner.execute(DefaultBuildOperationRunner.java:68)
at org.gradle.internal.operations.DefaultBuildOperationRunner.call(DefaultBuildOperationRunner.java:62)
at org.gradle.internal.operations.DefaultBuildOperationExecutor.lambda$call$2(DefaultBuildOperationExecutor.java:76)
at org.gradle.internal.operations.UnmanagedBuildOperationWrapper.callWithUnmanagedSupport(UnmanagedBuildOperationWrapper.java:54)
at org.gradle.internal.operations.DefaultBuildOperationExecutor.call(DefaultBuildOperationExecutor.java:76)
at org.gradle.initialization.BuildOperationSettingsProcessor.process(BuildOperationSettingsProcessor.java:47)
at org.gradle.initialization.DefaultSettingsLoader.findSettingsAndLoadIfAppropriate(DefaultSettingsLoader.java:120)
at org.gradle.initialization.DefaultSettingsLoader.findAndLoadSettings(DefaultSettingsLoader.java:58)
at org.gradle.initialization.SettingsAttachingSettingsLoader.findAndLoadSettings(SettingsAttachingSettingsLoader.java:35)
at org.gradle.internal.composite.CommandLineIncludedBuildSettingsLoader.findAndLoadSettings(CommandLineIncludedBuildSettingsLoader.java:34)
at org.gradle.internal.composite.ChildBuildRegisteringSettingsLoader.findAndLoadSettings(ChildBuildRegisteringSettingsLoader.java:52)
at org.gradle.internal.composite.CompositeBuildSettingsLoader.findAndLoadSettings(CompositeBuildSettingsLoader.java:35)
at org.gradle.initialization.DefaultSettingsPreparer.prepareSettings(DefaultSettingsPreparer.java:36)
at org.gradle.initialization.BuildOperationFiringSettingsPreparer$LoadBuild.doLoadBuild(BuildOperationFiringSettingsPreparer.java:59)
at org.gradle.initialization.BuildOperationFiringSettingsPreparer$LoadBuild.run(BuildOperationFiringSettingsPreparer.java:54)
at org.gradle.internal.operations.DefaultBuildOperationRunner$1.execute(DefaultBuildOperationRunner.java:29)
at org.gradle.internal.operations.DefaultBuildOperationRunner$1.execute(DefaultBuildOperationRunner.java:26)
at org.gradle.internal.operations.DefaultBuildOperationRunner$3.execute(DefaultBuildOperationRunner.java:75)
at org.gradle.internal.operations.DefaultBuildOperationRunner$3.execute(DefaultBuildOperationRunner.java:68)
at org.gradle.internal.operations.DefaultBuildOperationRunner.execute(DefaultBuildOperationRunner.java:153)
at org.gradle.internal.operations.DefaultBuildOperationRunner.execute(DefaultBuildOperationRunner.java:68)
at org.gradle.internal.operations.DefaultBuildOperationRunner.run(DefaultBuildOperationRunner.java:56)
at org.gradle.internal.operations.DefaultBuildOperationExecutor.lambda$run$1(DefaultBuildOperationExecutor.java:71)
at org.gradle.internal.operations.UnmanagedBuildOperationWrapper.runWithUnmanagedSupport(UnmanagedBuildOperationWrapper.java:45)
at org.gradle.internal.operations.DefaultBuildOperationExecutor.run(DefaultBuildOperationExecutor.java:71)
at org.gradle.initialization.BuildOperationFiringSettingsPreparer.prepareSettings(BuildOperationFiringSettingsPreparer.java:42)
at org.gradle.initialization.DefaultGradleLauncher.prepareSettings(DefaultGradleLauncher.java:220)
at org.gradle.initialization.DefaultGradleLauncher.doClassicBuildStages(DefaultGradleLauncher.java:161)
at org.gradle.initialization.DefaultGradleLauncher.doBuildStages(DefaultGradleLauncher.java:150)
at org.gradle.initialization.DefaultGradleLauncher.executeTasks(DefaultGradleLauncher.java:126)
at org.gradle.internal.invocation.GradleBuildController$1.create(GradleBuildController.java:72)
at org.gradle.internal.invocation.GradleBuildController$1.create(GradleBuildController.java:67)
at org.gradle.internal.work.DefaultWorkerLeaseService.withLocks(DefaultWorkerLeaseService.java:178)
at org.gradle.internal.invocation.GradleBuildController.doBuild(GradleBuildController.java:67)
at org.gradle.internal.invocation.GradleBuildController.run(GradleBuildController.java:56)
at org.gradle.tooling.internal.provider.ExecuteBuildActionRunner.run(ExecuteBuildActionRunner.java:31)
at org.gradle.launcher.exec.ChainingBuildActionRunner.run(ChainingBuildActionRunner.java:35)
at org.gradle.launcher.exec.BuildOutcomeReportingBuildActionRunner.run(BuildOutcomeReportingBuildActionRunner.java:63)
at org.gradle.tooling.internal.provider.ValidatingBuildActionRunner.run(ValidatingBuildActionRunner.java:32)
at org.gradle.tooling.internal.provider.FileSystemWatchingBuildActionRunner.run(FileSystemWatchingBuildActionRunner.java:67)
at org.gradle.launcher.exec.BuildCompletionNotifyingBuildActionRunner.run(BuildCompletionNotifyingBuildActionRunner.java:41)
at org.gradle.launcher.exec.RunAsBuildOperationBuildActionRunner$3.call(RunAsBuildOperationBuildActionRunner.java:49)
at org.gradle.launcher.exec.RunAsBuildOperationBuildActionRunner$3.call(RunAsBuildOperationBuildActionRunner.java:44)
at org.gradle.internal.operations.DefaultBuildOperationRunner$CallableBuildOperationWorker.execute(DefaultBuildOperationRunner.java:200)
at org.gradle.internal.operations.DefaultBuildOperationRunner$CallableBuildOperationWorker.execute(DefaultBuildOperationRunner.java:195)
at org.gradle.internal.operations.DefaultBuildOperationRunner$3.execute(DefaultBuildOperationRunner.java:75)
at org.gradle.internal.operations.DefaultBuildOperationRunner$3.execute(DefaultBuildOperationRunner.java:68)
at org.gradle.internal.operations.DefaultBuildOperationRunner.execute(DefaultBuildOperationRunner.java:153)
at org.gradle.internal.operations.DefaultBuildOperationRunner.execute(DefaultBuildOperationRunner.java:68)
at org.gradle.internal.operations.DefaultBuildOperationRunner.call(DefaultBuildOperationRunner.java:62)
at org.gradle.internal.operations.DefaultBuildOperationExecutor.lambda$call$2(DefaultBuildOperationExecutor.java:76)
at org.gradle.internal.operations.UnmanagedBuildOperationWrapper.callWithUnmanagedSupport(UnmanagedBuildOperationWrapper.java:54)
at org.gradle.internal.operations.DefaultBuildOperationExecutor.call(DefaultBuildOperationExecutor.java:76)
at org.gradle.launcher.exec.RunAsBuildOperationBuildActionRunner.run(RunAsBuildOperationBuildActionRunner.java:44)
at org.gradle.launcher.exec.InProcessBuildActionExecuter.lambda$execute$0(InProcessBuildActionExecuter.java:54)
at org.gradle.composite.internal.DefaultRootBuildState.run(DefaultRootBuildState.java:87)
at org.gradle.launcher.exec.InProcessBuildActionExecuter.execute(InProcessBuildActionExecuter.java:53)
at org.gradle.launcher.exec.InProcessBuildActionExecuter.execute(InProcessBuildActionExecuter.java:29)
at org.gradle.launcher.exec.BuildTreeScopeLifecycleBuildActionExecuter.lambda$execute$0(BuildTreeScopeLifecycleBuildActionExecuter.java:33)
at org.gradle.internal.buildtree.BuildTreeState.run(BuildTreeState.java:49)
at org.gradle.launcher.exec.BuildTreeScopeLifecycleBuildActionExecuter.execute(BuildTreeScopeLifecycleBuildActionExecuter.java:32)
at org.gradle.launcher.exec.BuildTreeScopeLifecycleBuildActionExecuter.execute(BuildTreeScopeLifecycleBuildActionExecuter.java:27)
at org.gradle.tooling.internal.provider.ContinuousBuildActionExecuter.execute(ContinuousBuildActionExecuter.java:104)
at org.gradle.tooling.internal.provider.ContinuousBuildActionExecuter.execute(ContinuousBuildActionExecuter.java:55)
at org.gradle.tooling.internal.provider.SubscribableBuildActionExecuter.execute(SubscribableBuildActionExecuter.java:64)
at org.gradle.tooling.internal.provider.SubscribableBuildActionExecuter.execute(SubscribableBuildActionExecuter.java:37)
at org.gradle.tooling.internal.provider.SessionScopeLifecycleBuildActionExecuter.lambda$execute$0(SessionScopeLifecycleBuildActionExecuter.java:54)
at org.gradle.internal.session.BuildSessionState.run(BuildSessionState.java:67)
at org.gradle.tooling.internal.provider.SessionScopeLifecycleBuildActionExecuter.execute(SessionScopeLifecycleBuildActionExecuter.java:50)
at org.gradle.tooling.internal.provider.SessionScopeLifecycleBuildActionExecuter.execute(SessionScopeLifecycleBuildActionExecuter.java:36)
at org.gradle.tooling.internal.provider.GradleThreadBuildActionExecuter.execute(GradleThreadBuildActionExecuter.java:36)
at org.gradle.tooling.internal.provider.GradleThreadBuildActionExecuter.execute(GradleThreadBuildActionExecuter.java:25)
at org.gradle.tooling.internal.provider.StartParamsValidatingActionExecuter.execute(StartParamsValidatingActionExecuter.java:59)
at org.gradle.tooling.internal.provider.StartParamsValidatingActionExecuter.execute(StartParamsValidatingActionExecuter.java:31)
at org.gradle.tooling.internal.provider.SessionFailureReportingActionExecuter.execute(SessionFailureReportingActionExecuter.java:55)
at org.gradle.tooling.internal.provider.SessionFailureReportingActionExecuter.execute(SessionFailureReportingActionExecuter.java:41)
at org.gradle.tooling.internal.provider.SetupLoggingActionExecuter.execute(SetupLoggingActionExecuter.java:47)
at org.gradle.tooling.internal.provider.SetupLoggingActionExecuter.execute(SetupLoggingActionExecuter.java:31)
at org.gradle.launcher.daemon.server.exec.ExecuteBuild.doBuild(ExecuteBuild.java:65)
at org.gradle.launcher.daemon.server.exec.BuildCommandOnly.execute(BuildCommandOnly.java:37)
at org.gradle.launcher.daemon.server.api.DaemonCommandExecution.proceed(DaemonCommandExecution.java:104)
at org.gradle.launcher.daemon.server.exec.WatchForDisconnection.execute(WatchForDisconnection.java:39)
at org.gradle.launcher.daemon.server.api.DaemonCommandExecution.proceed(DaemonCommandExecution.java:104)
at org.gradle.launcher.daemon.server.exec.ResetDeprecationLogger.execute(ResetDeprecationLogger.java:29)
at org.gradle.launcher.daemon.server.api.DaemonCommandExecution.proceed(DaemonCommandExecution.java:104)
at org.gradle.launcher.daemon.server.exec.RequestStopIfSingleUsedDaemon.execute(RequestStopIfSingleUsedDaemon.java:35)
at org.gradle.launcher.daemon.server.api.DaemonCommandExecution.proceed(DaemonCommandExecution.java:104)
at org.gradle.launcher.daemon.server.exec.ForwardClientInput$2.create(ForwardClientInput.java:78)
at org.gradle.launcher.daemon.server.exec.ForwardClientInput$2.create(ForwardClientInput.java:75)
at org.gradle.util.Swapper.swap(Swapper.java:38)
at org.gradle.launcher.daemon.server.exec.ForwardClientInput.execute(ForwardClientInput.java:75)
at org.gradle.launcher.daemon.server.api.DaemonCommandExecution.proceed(DaemonCommandExecution.java:104)
at org.gradle.launcher.daemon.server.exec.LogAndCheckHealth.execute(LogAndCheckHealth.java:55)
at org.gradle.launcher.daemon.server.api.DaemonCommandExecution.proceed(DaemonCommandExecution.java:104)
at org.gradle.launcher.daemon.server.exec.LogToClient.doBuild(LogToClient.java:63)
at org.gradle.launcher.daemon.server.exec.BuildCommandOnly.execute(BuildCommandOnly.java:37)
at org.gradle.launcher.daemon.server.api.DaemonCommandExecution.proceed(DaemonCommandExecution.java:104)
at org.gradle.launcher.daemon.server.exec.EstablishBuildEnvironment.doBuild(EstablishBuildEnvironment.java:84)
at org.gradle.launcher.daemon.server.exec.BuildCommandOnly.execute(BuildCommandOnly.java:37)
at org.gradle.launcher.daemon.server.api.DaemonCommandExecution.proceed(DaemonCommandExecution.java:104)
at org.gradle.launcher.daemon.server.exec.StartBuildOrRespondWithBusy$1.run(StartBuildOrRespondWithBusy.java:52)
at org.gradle.launcher.daemon.server.DaemonStateCoordinator$1.run(DaemonStateCoordinator.java:297)
at org.gradle.internal.concurrent.ExecutorPolicy$CatchAndRecordFailures.onExecute(ExecutorPolicy.java:64)
at org.gradle.internal.concurrent.ManagedExecutorImpl$1.run(ManagedExecutorImpl.java:48)
at Please login to see this link.
at Please login to see this link.
at org.gradle.internal.concurrent.ThreadFactoryImpl$ManagedThreadRunnable.run(ThreadFactoryImpl.java:56)
at Please login to see this link.
1 error
* Try:
Run with --stacktrace option to get the stack trace. Run with --info or --debug option to get more log output. Run with --scan to get full insights.
* Get more help at Please login to see this link.
BUILD FAILED in 778ms
Oh my god! Take my money! Testing now!
For those Wondering how to install this STT Object.
Below are the Paths for WINDOWS 10.
C:\Program Files (x86)\Clickteam Fusion Developer 2.5\Extensions\Sptotext.mfx
C:\Program Files (x86)\Clickteam Fusion Developer 2.5\Data\Runtime\Android\Sptotext.zip
Hope this helps. Testing now!
294.10 Build Error
> Task :app:preBuild UP-TO-DATE> Task :app:preReleaseBuild UP-TO-DATE> Task :app:compileReleaseAidl NO-SOURCE> Task :app:compileReleaseRenderscript NO-SOURCE> Task :app:generateReleaseBuildConfig> Task :app:javaPreCompileRelease> Task :app:writeReleaseApplicationId> Task :app:analyticsRecordingRelease> Task :app:checkReleaseAarMetadata> Task :app:generateReleaseResValues> Task :app:generateReleaseResources> Task :app:createReleaseCompatibleScreenManifests> Task :app:extractDeepLinksRelease> Task :app:processReleaseMainManifest> Task :app:processReleaseManifest> Task :app:processReleaseManifestForPackage> Task :app:mergeReleaseJniLibFolders> Task :app:mergeReleaseResources> Task :app:mergeReleaseShaders> Task :app:compileReleaseShaders NO-SOURCE> Task :app:generateReleaseAssets UP-TO-DATE> Task :app:mergeReleaseAssets> Task :app:compressReleaseAssets> Task :app:checkReleaseDuplicateClasses> Task :app:processReleaseJavaRes NO-SOURCE> Task :app:mergeReleaseNativeLibs> Task :app:desugarReleaseFileDependencies
> Task :app:stripReleaseDebugSymbolsUnable to strip the following libraries, packaging them as they are: libES1Renderer.so, libES2Renderer.so, libES3Renderer.so, libRuntimeNative.so, libgdx.so.
> Task :app:extractReleaseNativeSymbolTablesUnable to extract native debug metadata from C:\Users\VBE\AppData\Local\Temp\And8C13.tmp\app\build\intermediates\merged_native_libs\release\out\lib\arm64-v8a\libES1Renderer.so because unable to locate the objcopy executable for the arm64-v8a ABI.Unable to extract native debug metadata from C:\Users\VBE\AppData\Local\Temp\And8C13.tmp\app\build\intermediates\merged_native_libs\release\out\lib\arm64-v8a\libES2Renderer.so because unable to locate the objcopy executable for the arm64-v8a ABI.Unable to extract native debug metadata from C:\Users\VBE\AppData\Local\Temp\And8C13.tmp\app\build\intermediates\merged_native_libs\release\out\lib\arm64-v8a\libES3Renderer.so because unable to locate the objcopy executable for the arm64-v8a ABI.Unable to extract native debug metadata from C:\Users\VBE\AppData\Local\Temp\And8C13.tmp\app\build\intermediates\merged_native_libs\release\out\lib\arm64-v8a\libgdx.so because unable to locate the objcopy executable for the arm64-v8a ABI.Unable to extract native debug metadata from C:\Users\VBE\AppData\Local\Temp\And8C13.tmp\app\build\intermediates\merged_native_libs\release\out\lib\arm64-v8a\libRuntimeNative.so because unable to locate the objcopy executable for the arm64-v8a ABI.Unable to extract native debug metadata from C:\Users\VBE\AppData\Local\Temp\And8C13.tmp\app\build\intermediates\merged_native_libs\release\out\lib\armeabi-v7a\libES1Renderer.so because unable to locate the objcopy executable for the armeabi-v7a ABI.Unable to extract native debug metadata from C:\Users\VBE\AppData\Local\Temp\And8C13.tmp\app\build\intermediates\merged_native_libs\release\out\lib\armeabi-v7a\libES2Renderer.so because unable to locate the objcopy executable for the armeabi-v7a ABI.Unable to extract native debug metadata from C:\Users\VBE\AppData\Local\Temp\And8C13.tmp\app\build\intermediates\merged_native_libs\release\out\lib\armeabi-v7a\libES3Renderer.so because unable to locate the objcopy executable for the armeabi-v7a ABI.Unable to extract native debug metadata from C:\Users\VBE\AppData\Local\Temp\And8C13.tmp\app\build\intermediates\merged_native_libs\release\out\lib\armeabi-v7a\libgdx.so because unable to locate the objcopy executable for the armeabi-v7a ABI.Unable to extract native debug metadata from C:\Users\VBE\AppData\Local\Temp\And8C13.tmp\app\build\intermediates\merged_native_libs\release\out\lib\armeabi-v7a\libRuntimeNative.so because unable to locate the objcopy executable for the armeabi-v7a ABI.Unable to extract native debug metadata from C:\Users\VBE\AppData\Local\Temp\And8C13.tmp\app\build\intermediates\merged_native_libs\release\out\lib\x86\libES1Renderer.so because unable to locate the objcopy executable for the x86 ABI.Unable to extract native debug metadata from C:\Users\VBE\AppData\Local\Temp\And8C13.tmp\app\build\intermediates\merged_native_libs\release\out\lib\x86\libES2Renderer.so because unable to locate the objcopy executable for the x86 ABI.Unable to extract native debug metadata from C:\Users\VBE\AppData\Local\Temp\And8C13.tmp\app\build\intermediates\merged_native_libs\release\out\lib\x86\libES3Renderer.so because unable to locate the objcopy executable for the x86 ABI.Unable to extract native debug metadata from C:\Users\VBE\AppData\Local\Temp\And8C13.tmp\app\build\intermediates\merged_native_libs\release\out\lib\x86\libgdx.so because unable to locate the objcopy executable for the x86 ABI.Unable to extract native debug metadata from C:\Users\VBE\AppData\Local\Temp\And8C13.tmp\app\build\intermediates\merged_native_libs\release\out\lib\x86\libRuntimeNative.so because unable to locate the objcopy executable for the x86 ABI.Unable to extract native debug metadata from C:\Users\VBE\AppData\Local\Temp\And8C13.tmp\app\build\intermediates\merged_native_libs\release\out\lib\x86_64\libES1Renderer.so because unable to locate the objcopy executable for the x86_64 ABI.Unable to extract native debug metadata from C:\Users\VBE\AppData\Local\Temp\And8C13.tmp\app\build\intermediates\merged_native_libs\release\out\lib\x86_64\libES2Renderer.so because unable to locate the objcopy executable for the x86_64 ABI.Unable to extract native debug metadata from C:\Users\VBE\AppData\Local\Temp\And8C13.tmp\app\build\intermediates\merged_native_libs\release\out\lib\x86_64\libES3Renderer.so because unable to locate the objcopy executable for the x86_64 ABI.Unable to extract native debug metadata from C:\Users\VBE\AppData\Local\Temp\And8C13.tmp\app\build\intermediates\merged_native_libs\release\out\lib\x86_64\libgdx.so because unable to locate the objcopy executable for the x86_64 ABI.Unable to extract native debug metadata from C:\Users\VBE\AppData\Local\Temp\And8C13.tmp\app\build\intermediates\merged_native_libs\release\out\lib\x86_64\libRuntimeNative.so because unable to locate the objcopy executable for the x86_64 ABI.
> Task :app:mergeReleaseJavaResource> Task :app:mergeReleaseNativeDebugMetadata NO-SOURCE> Task :app:collectReleaseDependencies> Task :app:sdkReleaseDependencyData> Task :app:validateSigningRelease> Task :app:writeReleaseAppMetadata> Task :app:writeReleaseSigningConfigVersions> Task :app:mergeExtDexReleaseaapt2.exe W 11-21 02:23:42 1512 1876 LoadedArsc.cpp:682] Unknown chunk type '200'.
> Task :app:processReleaseResources
> Task :app:compileReleaseJavaWithJavacC:\Users\VBE\AppData\Local\Temp\And8C13.tmp\app\src\main\java\Extensions\CRunSptotext.java:109: error: incompatible types: WeakReference<Context> cannot be converted to Context my_spr = SpeechRecognizer.createSpeechRecognizer(MMFRuntime.appContext); ^Note: Some input files use or override a deprecated API.Note: Recompile with -Xlint:deprecation for details.Note: Some input files use unchecked or unsafe operations.Note: Recompile with -Xlint:unchecked for details.Note: Some messages have been simplified; recompile with -Xdiags:verbose to get full output1 error
> Task :app:compileReleaseJavaWithJavac FAILED
FAILURE: Build failed with an exception.
* What went wrong:Execution failed for task ':app:compileReleaseJavaWithJavac'.> Compilation failed; see the compiler error output for details.
* Try:Run with --stacktrace option to get the stack trace. Run with --info or --debug option to get more log output. Run with --scan to get full insights.
* Get more help at https://help.gradle.org
BUILD FAILED in 5s30 actionable tasks: 30 executed
Display More
Works perfectly on the Best Version of Fusion 293.10 X) Can't keep my wallet shut much longer bud.
Hi,
If you want to test this extension with example ;
Any updates? I am like a kid at a toy store that isn't open yet, waiting on this release.
Hi, just looked the code quickly and perform some compilation changes , result it's working for me;
I must change some menu options on C++ part, but first you must test the extension if it's ok i will do the rest to release it;
.mfa example is inside strange thing anyway the scene contain a counter object to receive texte from extension otherwise you got black area on text object;
Be sure have the latest android studio and the sdk ... etc
Please login to see this attachment.
Please login to see this attachment.
Please login to see this attachment.
Regards
Are you using latest android studio JDK?, or OpenJDK?
this error---> java.lang.IllegalArgumentException: Unsupported class file major version 60
show me you are using java from oracle or an outdated java SDK
Hi, just looked the code quickly and perform some compilation changes , result it's working for me;
I must change some menu options on C++ part, but first you must test the extension if it's ok i will do the rest to release it;.mfa example is inside strange thing anyway the scene contain a counter object to receive texte from extension otherwise you got black area on text object;
Be sure have the latest android studio and the sdk ... etc
Regards
Well, it works somewhat well.
I found an issue with your TTS and STT object on the same app.
Basically, when you have both. The only text it wants to retrieve from the STT object is the " Listening " from I assume the STT Object's Default code.
I noticed this on the original STT you released too, when I added the TTS Object to the mix.
Basically, I set it up so that once STT was FINISHED LISTENING the TTS Object would Speak what the STT Object Heard. The only thing that the TTS Object would say is " Listening "
I emphasize the Capitalization as Important as it is Exactly typed out like this. I assume this is in your code somewhere.
This is what your Example does with TTS and STT in the same app.
I actually said," HELLO " which it seen and typed out but quickly changed it to "Listening" and Said," Listening" .
I added nothing to say," Listening" anywhere. It just magically pops up. This is why I assume it is in your Code Somewhere.
Please login to see this attachment.
I also noticed when referring anything to to STT Object it shows TTS in the Code.
TTSGetText$( "Android STT" )
Which this shows up when using the STT to Get Text.
I was expecting to see STTGetText#("Android STT") instead.
Last but not Least.
The TTS and STT objects look almost Identical.
Which,( personal preference ) is a pain as I keep clicking the wrong one or selecting the wrong one for a Project.
Please login to see this attachment.
So, if you want to use these. Feel Free! I made some new ones for you.
TTS
Please login to see this attachment.
STT
Please login to see this attachment.
Thank you, for the Hard work so far. These objects are awesome! Can't wait till they both work perfectly!
Don't worry, sooner or later I will finish both expansions so that they work perfectly.
Don't worry, sooner or later I will finish both expansions so that they work perfectly.
Well, I look Forward to it when you do. My Wallet is waiting on the Second one and I am still waiting on the first one I bought.
Both are Very Impressive for Fusion to begin with!
Thanks for your Hard work
Well, I got it working with a counter.
The whole hidden "Listening" text is now not showing or being spoken.
Nice work bud!
I sent you a message with the working .apk with both the STT and TTS working together.
Please login to see this attachment.
Ugh, Never mind. The event " IS STT FINISHED " is back to carrying on again.
Basically the first go works fine but the second try carries the event over from above.
Again the event of " IS STT FINISHED " is acting like an always event instead of a single trigger event like" HAS SAMPLE STOPPED ".
Not that it is important right now, but I have some ideas for this object I believe would make more people want it.
1) Give the ability to link the listening time to the user via a counter link or say an on / off button via an Object.
I.E. User clicks a button to start listening and the amount of time the listening happens is determined by a Linked counter, that counts down or up and stops at a specific value or an on / off button created by the user with and object. Object facing left is off / object facing right is on. This would allow Developers to create apps for Transcribing audio. Hello! $$$
2) Sounds or No Sounds
I.E. Listening start sound and ending sounds linked to samples in the app instead of what sounds like the default Google Android sounds, could be changed by user. -or- User chooses graphics to display the two events.
3) STT IS LISTENING
I.E. User could link this to a counter for time.
Just ideas bud. Main goal now though, is getting it running perfect with no counters.
I.E. STT IS FINISHED = Speech to Text has JUST Finished Listening. One Event!
Nevertheless, monumental on your part for what you have so far.
Honestly one of the greatest Objects I have seen for Android yet on Fusion.
The Second is the TTS object with the other issues I mentioned to you months ago.
However, Both are still awesome and I Thank you for putting in the work.
I will be supporting the work when you release the Object as complete like I did with the TTS object ( with issues still ) . lol
Great work so far!
Hi,
Late on night i have finished at 85% SST extension, you can speak and the extension write the sentence on
an edit box. This extension will go to clickstore;Stay tuned
Well, I managed to get it to Kind of work now with a Counter to force individual actions.
LINK to BETA STT to TTS app: Please login to see this link.
What I have found so far with the working app.
1) If you do not say anything. After 6 seconds. The STT Object forces," Listening " as what was heard.
2) If you say something the STT Object does not understand. Again, it forces the ," Listening " as what was heard.
Also
The Event Function of STT FAILED is almost impossible to get to register the event. I even linked it to the counter as number 5 with a 1 second delay as this 1 second delay is why the STT Object is now working in this app.
Basically, this is how I set it up.
1) When you press the " Start Listening " Button. The counter goes to 1
2) This starts the listening process for the given time of the STT Object ( Which I hope you add the ability to control this time as I counted 6 seconds before the app stops listening ).
3) Once the app has heard what was said. The event is to reset the timer to 0 and set the counter to 2
4) After 1 second has passed, the String is set to what was Heard and the timer is set to 0 again. Last the Counter is set to 3
5) Once the counter reaches 3 The TTS Engine kicks in on a " RUN THIS EVENT ONCE WHEN LOOPS " basis and speaks the string displayed. The Counter is now set to 4
Then the cycle repeats!
Here is the .mfa as well.
LINK: Please login to see this link.
Currently the Android app version ( LINK ABOVE ) will write out whatever is said as long as you keep talking. This is why Gigatron, I hope you add a function to eliminate the timer or at least link it to a timer in Fusion as this STT Object would be extremely useful for transcribing and other applications without that 6 second no audio timer thing in it. Which by the way, the time is far less if you start talking. So taking a breath will stop the listening function.
Honestly, it would most likely be easier if you just link everything to fusion as you will not have to worry about times and such.
I.E.
User clicks button to listen
User clicks button / a different button to stop listening
User clicks a button to get info heard or could be linked to a timer in fusion
Hope this helps you make this Object amazing. Thanks again!
Hi,
Just make a new version of STT; Build with the latest fusion Android runtime, and include .mfa example;
Tested with Android Studio and with installing .apk file on device S21(no sound when clicking Start Listen) S7 edge.
Have Fun (hope it's working for you) ;
Don’t have an account yet? Register yourself now and be a part of our community!
Almightyzentaco (Fusion 2.5 Tutorials)
Captain Quail (Firefly Tutorials)