User Tag List

Page 1 of 2 1 2 LastLast
Results 1 to 10 of 17

Thread: Error - exporting Android game on Build 292

  1. #1
    Clicker Fusion 2.5 (Steam)Fusion 2.5 Developer (Steam)Android Export Module (Steam)iOS Export Module (Steam)

    Join Date
    Oct 2016
    Location
    London
    Posts
    33
    Mentioned
    0 Post(s)
    Tagged
    0 Thread(s)

    Error - exporting Android game on Build 292

    Please help I've just finished my game then exported it and now i met with this error. I've installed update android studio and downloaded and install the 64-bit version 1.8 of the JDK. still getting this error.


    > Task :app:preBuild UP-TO-DATE
    > Task :app:preReleaseBuild
    > Task :app:compileReleaseAidl
    > Task :app:compileReleaseRenderscript
    > Task :app:checkReleaseManifest
    > Task :app:generateReleaseBuildConfig
    > Task :app:prepareLintJar
    > Task :app:generateReleaseSources
    > Task :app:javaPreCompileRelease
    > Task :app:mainApkListPersistenceRelease
    > Task :app:generateReleaseResValues
    > Task :app:generateReleaseResources
    > Task :app:mergeReleaseResources
    > Task :app:createReleaseCompatibleScreenManifests
    > Task :app:processReleaseManifest
    > Task :app:processReleaseResources

    > Task :app:compileReleaseJavaWithJavac
    C:\Users\user\AppData\Local\Temp\And9463.tmp\app\s rc\main\java\Extensions\CRunAdMob.java:44: error: package com.google.android.gms.ads does not exist
    import com.google.android.gms.ads.AdListener;
    ^
    C:\Users\user\AppData\Local\Temp\And9463.tmp\app\s rc\main\java\Extensions\CRunAdMob.java:45: error: package com.google.android.gms.ads.mediation does not exist
    import com.google.android.gms.ads.mediation.MediationAdap ter;
    ^
    C:\Users\user\AppData\Local\Temp\And9463.tmp\app\s rc\main\java\Extensions\CRunAdMob.java:46: error: package com.google.android.gms.ads.reward does not exist
    import com.google.android.gms.ads.reward.RewardItem;
    ^
    C:\Users\user\AppData\Local\Temp\And9463.tmp\app\s rc\main\java\Extensions\CRunAdMob.java:47: error: package com.google.android.gms.ads.reward does not exist
    import com.google.android.gms.ads.reward.RewardedVideoAdL istener;
    ^
    C:\Users\user\AppData\Local\Temp\And9463.tmp\app\s rc\main\java\Extensions\CRunAdMob.java:48: error: package com.google.android.gms.ads does not exist
    import com.google.android.gms.ads.AdRequest;
    ^
    C:\Users\user\AppData\Local\Temp\And9463.tmp\app\s rc\main\java\Extensions\CRunAdMob.java:49: error: package com.google.android.gms.ads does not exist
    import com.google.android.gms.ads.AdView;
    ^
    C:\Users\user\AppData\Local\Temp\And9463.tmp\app\s rc\main\java\Extensions\CRunAdMob.java:50: error: package com.google.android.gms.ads does not exist
    import com.google.android.gms.ads.InterstitialAd;
    ^
    C:\Users\user\AppData\Local\Temp\And9463.tmp\app\s rc\main\java\Extensions\CRunAdMob.java:51: error: package com.google.android.gms.ads does not exist
    import com.google.android.gms.ads.AdSize;
    ^
    C:\Users\user\AppData\Local\Temp\And9463.tmp\app\s rc\main\java\Extensions\CRunAdMob.java:52: error: package com.google.android.gms.ads does not exist
    import com.google.android.gms.ads.MobileAds;
    ^
    C:\Users\user\AppData\Local\Temp\And9463.tmp\app\s rc\main\java\Extensions\CRunAdMob.java:53: error: package com.google.android.gms.ads.reward does not exist
    import com.google.android.gms.ads.reward.RewardedVideoAd;
    ^
    C:\Users\user\AppData\Local\Temp\And9463.tmp\app\s rc\main\java\Extensions\CRunAdMob.java:174: error: cannot find symbol
    private AdView adView = null;
    ^
    symbol: class AdView
    location: class CRunAdMob
    C:\Users\user\AppData\Local\Temp\And9463.tmp\app\s rc\main\java\Extensions\CRunAdMob.java:175: error: cannot find symbol
    private InterstitialAd interstitial = null;
    ^
    symbol: class InterstitialAd
    location: class CRunAdMob
    C:\Users\user\AppData\Local\Temp\And9463.tmp\app\s rc\main\java\Extensions\CRunAdMob.java:176: error: cannot find symbol
    private RewardedVideoAd videoreward = null;
    ^
    symbol: class RewardedVideoAd
    location: class CRunAdMob
    C:\Users\user\AppData\Local\Temp\And9463.tmp\app\s rc\main\java\Extensions\CRunAdMob.java:114: error: cannot find symbol
    AdSize adSize;
    ^
    symbol: class AdSize
    location: class CRunAdMob.AdMobAds
    C:\Users\user\AppData\Local\Temp\And9463.tmp\app\s rc\main\java\Extensions\CRunAdMob.java:117: error: cannot find symbol
    int gender = AdRequest.GENDER_UNKNOWN;
    ^
    symbol: variable AdRequest
    location: class CRunAdMob.AdMobAds
    C:\Users\user\AppData\Local\Temp\And9463.tmp\app\s rc\main\java\Extensions\CRunAdMob.java:198: error: cannot find symbol
    case AdRequest.ERROR_CODE_INTERNAL_ERROR:
    ^
    symbol: variable AdRequest
    location: class CRunAdMob
    C:\Users\user\AppData\Local\Temp\And9463.tmp\app\s rc\main\java\Extensions\CRunAdMob.java:201: error: cannot find symbol
    case AdRequest.ERROR_CODE_INVALID_REQUEST:
    ^
    symbol: variable AdRequest
    location: class CRunAdMob
    C:\Users\user\AppData\Local\Temp\And9463.tmp\app\s rc\main\java\Extensions\CRunAdMob.java:204: error: cannot find symbol
    case AdRequest.ERROR_CODE_NETWORK_ERROR:
    ^
    symbol: variable AdRequest
    location: class CRunAdMob
    C:\Users\user\AppData\Local\Temp\And9463.tmp\app\s rc\main\java\Extensions\CRunAdMob.java:207: error: cannot find symbol
    case AdRequest.ERROR_CODE_NO_FILL:
    ^
    symbol: variable AdRequest
    location: class CRunAdMob
    C:\Users\user\AppData\Local\Temp\And9463.tmp\app\s rc\main\java\Extensions\CRunAdMob.java:224: error: cannot find symbol
    MobileAds.initialize(MMFRuntime.inst, IntersAds.AppID.replace("/", "~"));
    ^
    symbol: variable MobileAds
    location: class CRunAdMob
    C:\Users\user\AppData\Local\Temp\And9463.tmp\app\s rc\main\java\Extensions\CRunAdMob.java:225: error: cannot find symbol
    interstitial = new InterstitialAd(MMFRuntime.inst);
    ^
    symbol: class InterstitialAd
    location: class CRunAdMob
    C:\Users\user\AppData\Local\Temp\And9463.tmp\app\s rc\main\java\Extensions\CRunAdMob.java:228: error: package AdRequest does not exist
    final AdRequest.Builder builder = new AdRequest.Builder();
    ^
    C:\Users\user\AppData\Local\Temp\And9463.tmp\app\s rc\main\java\Extensions\CRunAdMob.java:228: error: package AdRequest does not exist
    final AdRequest.Builder builder = new AdRequest.Builder();
    ^
    C:\Users\user\AppData\Local\Temp\And9463.tmp\app\s rc\main\java\Extensions\CRunAdMob.java:243: error: cannot find symbol
    builder.addTestDevice(AdRequest.DEVICE_ID_EMULATOR );
    ^
    symbol: variable AdRequest
    location: class CRunAdMob
    C:\Users\user\AppData\Local\Temp\And9463.tmp\app\s rc\main\java\Extensions\CRunAdMob.java:284: error: cannot find symbol
    builder.addNetworkExtrasBundle(MediationAdapter.cl ass, bundle);
    ^
    symbol: class MediationAdapter
    location: class CRunAdMob
    C:\Users\user\AppData\Local\Temp\And9463.tmp\app\s rc\main\java\Extensions\CRunAdMob.java:290: error: cannot find symbol
    interstitial.setAdListener(new AdListener () {
    ^
    symbol: class AdListener
    location: class CRunAdMob
    C:\Users\user\AppData\Local\Temp\And9463.tmp\app\s rc\main\java\Extensions\CRunAdMob.java:337: error: cannot find symbol
    final AdRequest request = builder.build();
    ^
    symbol: class AdRequest
    location: class CRunAdMob
    C:\Users\user\AppData\Local\Temp\And9463.tmp\app\s rc\main\java\Extensions\CRunAdMob.java:375: error: cannot find symbol
    MobileAds.initialize(MMFRuntime.inst, xAds.AppID.replace("/", "~"));
    ^
    symbol: variable MobileAds
    location: class CRunAdMob
    C:\Users\user\AppData\Local\Temp\And9463.tmp\app\s rc\main\java\Extensions\CRunAdMob.java:378: error: cannot find symbol
    adView = new AdView(MMFRuntime.inst);
    ^
    symbol: class AdView
    location: class CRunAdMob
    C:\Users\user\AppData\Local\Temp\And9463.tmp\app\s rc\main\java\Extensions\CRunAdMob.java:418: error: package AdRequest does not exist
    final AdRequest.Builder builder = new AdRequest.Builder();
    ^
    C:\Users\user\AppData\Local\Temp\And9463.tmp\app\s rc\main\java\Extensions\CRunAdMob.java:418: error: package AdRequest does not exist
    final AdRequest.Builder builder = new AdRequest.Builder();
    ^
    C:\Users\user\AppData\Local\Temp\And9463.tmp\app\s rc\main\java\Extensions\CRunAdMob.java:434: error: cannot find symbol
    builder.addTestDevice(AdRequest.DEVICE_ID_EMULATOR );
    ^
    symbol: variable AdRequest
    location: class CRunAdMob
    C:\Users\user\AppData\Local\Temp\And9463.tmp\app\s rc\main\java\Extensions\CRunAdMob.java:477: error: cannot find symbol
    builder.addNetworkExtrasBundle(MediationAdapter.cl ass, bundle);
    ^
    symbol: class MediationAdapter
    location: class CRunAdMob
    C:\Users\user\AppData\Local\Temp\And9463.tmp\app\s rc\main\java\Extensions\CRunAdMob.java:482: error: cannot find symbol
    AdRequest request = builder.build();
    ^
    symbol: class AdRequest
    location: class CRunAdMob
    C:\Users\user\AppData\Local\Temp\And9463.tmp\app\s rc\main\java\Extensions\CRunAdMob.java:484: error: cannot find symbol
    adView.setAdListener(new AdListener () {
    ^
    symbol: class AdListener
    location: class CRunAdMob
    C:\Users\user\AppData\Local\Temp\And9463.tmp\app\s rc\main\java\Extensions\CRunAdMob.java:567: error: cannot find symbol
    MobileAds.initialize(MMFRuntime.inst, VideoAds.AppID.replace("/", "~"));
    ^
    symbol: variable MobileAds
    location: class CRunAdMob
    C:\Users\user\AppData\Local\Temp\And9463.tmp\app\s rc\main\java\Extensions\CRunAdMob.java:569: error: cannot find symbol
    videoreward = MobileAds.getRewardedVideoAdInstance((MMFRuntime.i nst));
    ^
    symbol: variable MobileAds
    location: class CRunAdMob
    C:\Users\user\AppData\Local\Temp\And9463.tmp\app\s rc\main\java\Extensions\CRunAdMob.java:571: error: package AdRequest does not exist
    final AdRequest.Builder builder = new AdRequest.Builder();
    ^
    C:\Users\user\AppData\Local\Temp\And9463.tmp\app\s rc\main\java\Extensions\CRunAdMob.java:571: error: package AdRequest does not exist
    final AdRequest.Builder builder = new AdRequest.Builder();
    ^
    C:\Users\user\AppData\Local\Temp\And9463.tmp\app\s rc\main\java\Extensions\CRunAdMob.java:586: error: cannot find symbol
    builder.addTestDevice(AdRequest.DEVICE_ID_EMULATOR );
    ^
    symbol: variable AdRequest
    location: class CRunAdMob
    C:\Users\user\AppData\Local\Temp\And9463.tmp\app\s rc\main\java\Extensions\CRunAdMob.java:627: error: cannot find symbol
    builder.addNetworkExtrasBundle(MediationAdapter.cl ass, bundle);
    ^
    symbol: class MediationAdapter
    location: class CRunAdMob
    C:\Users\user\AppData\Local\Temp\And9463.tmp\app\s rc\main\java\Extensions\CRunAdMob.java:633: error: cannot find symbol
    videoreward.setRewardedVideoAdListener(new RewardedVideoAdListener () {
    ^
    symbol: class RewardedVideoAdListener
    location: class CRunAdMob
    C:\Users\user\AppData\Local\Temp\And9463.tmp\app\s rc\main\java\Extensions\CRunAdMob.java:702: error: cannot find symbol
    AdRequest request = builder.build();
    ^
    symbol: class AdRequest
    location: class CRunAdMob
    C:\Users\user\AppData\Local\Temp\And9463.tmp\app\s rc\main\java\Extensions\CRunAdMob.java:787: error: cannot find symbol
    mmfAdMob.adSize = AdSize.BANNER;
    ^
    symbol: variable AdSize
    location: class CRunAdMob
    C:\Users\user\AppData\Local\Temp\And9463.tmp\app\s rc\main\java\Extensions\CRunAdMob.java:813: error: cannot find symbol
    mmfAdMob.adSize = AdSize.BANNER;
    ^
    symbol: variable AdSize
    location: class CRunAdMob
    C:\Users\user\AppData\Local\Temp\And9463.tmp\app\s rc\main\java\Extensions\CRunAdMob.java:816: error: cannot find symbol
    mmfAdMob.adSize = AdSize.MEDIUM_RECTANGLE;
    ^
    symbol: variable AdSize
    location: class CRunAdMob
    C:\Users\user\AppData\Local\Temp\And9463.tmp\app\s rc\main\java\Extensions\CRunAdMob.java:819: error: cannot find symbol
    mmfAdMob.adSize = AdSize.FULL_BANNER;
    ^
    symbol: variable AdSize
    location: class CRunAdMob
    C:\Users\user\AppData\Local\Temp\And9463.tmp\app\s rc\main\java\Extensions\CRunAdMob.java:822: error: cannot find symbol
    mmfAdMob.adSize = AdSize.LEADERBOARD;
    ^
    symbol: variable AdSize
    location: class CRunAdMob
    C:\Users\user\AppData\Local\Temp\And9463.tmp\app\s rc\main\java\Extensions\CRunAdMob.java:825: error: cannot find symbol
    mmfAdMob.adSize = AdSize.SMART_BANNER;
    ^
    symbol: variable AdSize
    location: class CRunAdMob
    C:\Users\user\AppData\Local\Temp\And9463.tmp\app\s rc\main\java\Extensions\CRunAdMob.java:1287: error: cannot find symbol
    mmfAdMob.adSize = AdSize.BANNER;
    ^
    symbol: variable AdSize
    location: class CRunAdMob
    C:\Users\user\AppData\Local\Temp\And9463.tmp\app\s rc\main\java\Extensions\CRunAdMob.java:1291: error: cannot find symbol
    mmfAdMob.adSize = AdSize.MEDIUM_RECTANGLE;
    ^
    symbol: variable AdSize
    location: class CRunAdMob
    C:\Users\user\AppData\Local\Temp\And9463.tmp\app\s rc\main\java\Extensions\CRunAdMob.java:1295: error: cannot find symbol
    mmfAdMob.adSize = AdSize.FULL_BANNER;
    ^
    symbol: variable AdSize
    location: class CRunAdMob
    C:\Users\user\AppData\Local\Temp\And9463.tmp\app\s rc\main\java\Extensions\CRunAdMob.java:1299: error: cannot find symbol
    mmfAdMob.adSize = AdSize.LEADERBOARD;
    ^
    symbol: variable AdSize
    location: class CRunAdMob
    C:\Users\user\AppData\Local\Temp\And9463.tmp\app\s rc\main\java\Extensions\CRunAdMob.java:1303: error: cannot find symbol
    mmfAdMob.adSize = AdSize.SMART_BANNER;
    ^
    symbol: variable AdSize
    location: class CRunAdMob
    C:\Users\user\AppData\Local\Temp\And9463.tmp\app\s rc\main\java\Extensions\CRunAdMob.java:1386: error: cannot find symbol
    mmfAdMob.gender = AdRequest.GENDER_UNKNOWN;
    ^
    symbol: variable AdRequest
    location: class CRunAdMob
    C:\Users\user\AppData\Local\Temp\And9463.tmp\app\s rc\main\java\Extensions\CRunAdMob.java:1389: error: cannot find symbol
    mmfAdMob.gender = AdRequest.GENDER_MALE;
    ^
    symbol: variable AdRequest
    location: class CRunAdMob
    C:\Users\user\AppData\Local\Temp\And9463.tmp\app\s rc\main\java\Extensions\CRunAdMob.java:1392: error: cannot find symbol
    mmfAdMob.gender = AdRequest.GENDER_FEMALE;
    ^
    symbol: variable AdRequest
    location: class CRunAdMob
    Note: Some input files use or override a deprecated API.
    Note: Recompile with -Xlint:deprecation for details.
    Note: Some input files use unchecked or unsafe operations.
    Note: Recompile with -Xlint:unchecked for details.
    57 errors

    > Task :app:compileReleaseJavaWithJavac FAILED

    FAILURE: Build failed with an exception.

    * What went wrong:
    Execution failed for task ':app:compileReleaseJavaWithJavac'.
    > Compilation failed; see the compiler error output for details.

    * Try:
    Run with --stacktrace option to get the stack trace. Run with --info or --debug option to get more log output. Run with --scan to get full insights.

    * Get more help at https://help.gradle.org

    BUILD FAILED in 26s
    14 actionable tasks: 14 executed

  2. #2
    Clicker Fusion 2.5Android Export ModuleHTML5 Export ModuleSWF Export Module

    Join Date
    Jun 2006
    Location
    Austria
    Posts
    108
    Mentioned
    0 Post(s)
    Tagged
    0 Thread(s)
    It works now for me - after updating the development environment.

  3. #3
    Clickteam Clickteam

    Join Date
    Jun 2006
    Location
    France
    Posts
    13,084
    Mentioned
    123 Post(s)
    Tagged
    2 Thread(s)
    Hmm, I see a change in AdMob that was not propagated to the update patch, I wonder if this could be the reason. I'll check with Fernando. EDIT: seems correct, must be another problem.

  4. #4
    Clickteam Clickteam

    Join Date
    Jun 2006
    Location
    France
    Posts
    13,084
    Mentioned
    123 Post(s)
    Tagged
    2 Thread(s)
    Ah another idea, what build API do you use? Use build API 28 if you are using an older API.

  5. #5
    Clicker Fusion 2.5 (Steam)Fusion 2.5 Developer (Steam)Android Export Module (Steam)iOS Export Module (Steam)

    Join Date
    Oct 2016
    Location
    London
    Posts
    33
    Mentioned
    0 Post(s)
    Tagged
    0 Thread(s)
    This is now poping up "you have not accepted the license agreements of the following sdk component"

  6. #6
    Clicker Fusion 2.5 (Steam)Fusion 2.5 Developer (Steam)Android Export Module (Steam)iOS Export Module (Steam)

    Join Date
    Oct 2016
    Location
    London
    Posts
    33
    Mentioned
    0 Post(s)
    Tagged
    0 Thread(s)
    Alright I'll try build with API28 currently I'm using build API 27.

  7. #7
    Clicker Fusion 2.5 (Steam)Fusion 2.5 Developer (Steam)Android Export Module (Steam)iOS Export Module (Steam)

    Join Date
    Oct 2016
    Location
    London
    Posts
    33
    Mentioned
    0 Post(s)
    Tagged
    0 Thread(s)
    Quote Originally Posted by Herbert View Post
    It works now for me - after updating the development environment.
    What do you mean after updating development environment you mean Android studio?

  8. #8
    Clickteam Clickteam

    Join Date
    Jun 2006
    Location
    France
    Posts
    13,084
    Mentioned
    123 Post(s)
    Tagged
    2 Thread(s)
    Quote Originally Posted by sonic921 View Post
    This is now poping up "you have not accepted the license agreements of the following sdk component"
    More info here or in the change log: https://community.clickteam.com/threads/105484-Android-Runtime-Build-292

  9. #9
    Clicker Fusion 2.5 (Steam)Fusion 2.5 Developer (Steam)Android Export Module (Steam)iOS Export Module (Steam)

    Join Date
    Oct 2016
    Location
    London
    Posts
    33
    Mentioned
    0 Post(s)
    Tagged
    0 Thread(s)
    Quote Originally Posted by Yves View Post
    Done that know the license is working, I followed: https://community.clickteam.com/threads/105484-Android-Runtime-Build-292 still getting an error.


    Starting a Gradle Daemon, 3 incompatible and 1 stopped Daemons could not be reused, use --status for details

    > Configure project :app
    Checking the license for package Android SDK Platform-Tools in C:\Users\user\AppData\Local\Android\android-sdk\licenses
    License for package Android SDK Platform-Tools accepted.
    Preparing "Install Android SDK Platform-Tools (revision: 28.0.2)".
    "Install Android SDK Platform-Tools (revision: 28.0.2)" ready.
    Installing Android SDK Platform-Tools in C:\Users\user\AppData\Local\Android\android-sdk\platform-tools
    "Install Android SDK Platform-Tools (revision: 28.0.2)" complete.
    "Install Android SDK Platform-Tools (revision: 28.0.2)" finished.

    > Task :app:preBuild UP-TO-DATE
    > Task :app:preReleaseBuild
    > Task :app:compileReleaseAidl
    > Task :app:compileReleaseRenderscript
    > Task :app:checkReleaseManifest
    > Task :app:generateReleaseBuildConfig
    > Task :app:prepareLintJar
    > Task :app:generateReleaseSources
    > Task :app:javaPreCompileRelease
    > Task :app:mainApkListPersistenceRelease
    > Task :app:generateReleaseResValues
    > Task :app:generateReleaseResources
    > Task :app:mergeReleaseResources
    > Task :app:createReleaseCompatibleScreenManifests
    > Task :app:processReleaseManifest
    > Task :app:processReleaseResources

    > Task :app:compileReleaseJavaWithJavac
    C:\Users\user\AppData\Local\Temp\AndB4F1.tmp\app\s rc\main\java\Extensions\CRunAdMob.java:44: error: package com.google.android.gms.ads does not exist
    import com.google.android.gms.ads.AdListener;
    ^
    C:\Users\user\AppData\Local\Temp\AndB4F1.tmp\app\s rc\main\java\Extensions\CRunAdMob.java:45: error: package com.google.android.gms.ads.mediation does not exist
    import com.google.android.gms.ads.mediation.MediationAdap ter;
    ^
    C:\Users\user\AppData\Local\Temp\AndB4F1.tmp\app\s rc\main\java\Extensions\CRunAdMob.java:46: error: package com.google.android.gms.ads.reward does not exist
    import com.google.android.gms.ads.reward.RewardItem;
    ^
    C:\Users\user\AppData\Local\Temp\AndB4F1.tmp\app\s rc\main\java\Extensions\CRunAdMob.java:47: error: package com.google.android.gms.ads.reward does not exist
    import com.google.android.gms.ads.reward.RewardedVideoAdL istener;
    ^
    C:\Users\user\AppData\Local\Temp\AndB4F1.tmp\app\s rc\main\java\Extensions\CRunAdMob.java:48: error: package com.google.android.gms.ads does not exist
    import com.google.android.gms.ads.AdRequest;
    ^
    C:\Users\user\AppData\Local\Temp\AndB4F1.tmp\app\s rc\main\java\Extensions\CRunAdMob.java:49: error: package com.google.android.gms.ads does not exist
    import com.google.android.gms.ads.AdView;
    ^
    C:\Users\user\AppData\Local\Temp\AndB4F1.tmp\app\s rc\main\java\Extensions\CRunAdMob.java:50: error: package com.google.android.gms.ads does not exist
    import com.google.android.gms.ads.InterstitialAd;
    ^
    C:\Users\user\AppData\Local\Temp\AndB4F1.tmp\app\s rc\main\java\Extensions\CRunAdMob.java:51: error: package com.google.android.gms.ads does not exist
    import com.google.android.gms.ads.AdSize;
    ^
    C:\Users\user\AppData\Local\Temp\AndB4F1.tmp\app\s rc\main\java\Extensions\CRunAdMob.java:52: error: package com.google.android.gms.ads does not exist
    import com.google.android.gms.ads.MobileAds;
    ^
    C:\Users\user\AppData\Local\Temp\AndB4F1.tmp\app\s rc\main\java\Extensions\CRunAdMob.java:53: error: package com.google.android.gms.ads.reward does not exist
    import com.google.android.gms.ads.reward.RewardedVideoAd;
    ^
    C:\Users\user\AppData\Local\Temp\AndB4F1.tmp\app\s rc\main\java\Extensions\CRunAdMob.java:174: error: cannot find symbol
    private AdView adView = null;
    ^
    symbol: class AdView
    location: class CRunAdMob
    C:\Users\user\AppData\Local\Temp\AndB4F1.tmp\app\s rc\main\java\Extensions\CRunAdMob.java:175: error: cannot find symbol
    private InterstitialAd interstitial = null;
    ^
    symbol: class InterstitialAd
    location: class CRunAdMob
    C:\Users\user\AppData\Local\Temp\AndB4F1.tmp\app\s rc\main\java\Extensions\CRunAdMob.java:176: error: cannot find symbol
    private RewardedVideoAd videoreward = null;
    ^
    symbol: class RewardedVideoAd
    location: class CRunAdMob
    C:\Users\user\AppData\Local\Temp\AndB4F1.tmp\app\s rc\main\java\Extensions\CRunAdMob.java:114: error: cannot find symbol
    AdSize adSize;
    ^
    symbol: class AdSize
    location: class CRunAdMob.AdMobAds
    C:\Users\user\AppData\Local\Temp\AndB4F1.tmp\app\s rc\main\java\Extensions\CRunAdMob.java:117: error: cannot find symbol
    int gender = AdRequest.GENDER_UNKNOWN;
    ^
    symbol: variable AdRequest
    location: class CRunAdMob.AdMobAds
    C:\Users\user\AppData\Local\Temp\AndB4F1.tmp\app\s rc\main\java\Extensions\CRunAdMob.java:198: error: cannot find symbol
    case AdRequest.ERROR_CODE_INTERNAL_ERROR:
    ^
    symbol: variable AdRequest
    location: class CRunAdMob
    C:\Users\user\AppData\Local\Temp\AndB4F1.tmp\app\s rc\main\java\Extensions\CRunAdMob.java:201: error: cannot find symbol
    case AdRequest.ERROR_CODE_INVALID_REQUEST:
    ^
    symbol: variable AdRequest
    location: class CRunAdMob
    C:\Users\user\AppData\Local\Temp\AndB4F1.tmp\app\s rc\main\java\Extensions\CRunAdMob.java:204: error: cannot find symbol
    case AdRequest.ERROR_CODE_NETWORK_ERROR:
    ^
    symbol: variable AdRequest
    location: class CRunAdMob
    C:\Users\user\AppData\Local\Temp\AndB4F1.tmp\app\s rc\main\java\Extensions\CRunAdMob.java:207: error: cannot find symbol
    case AdRequest.ERROR_CODE_NO_FILL:
    ^
    symbol: variable AdRequest
    location: class CRunAdMob
    C:\Users\user\AppData\Local\Temp\AndB4F1.tmp\app\s rc\main\java\Extensions\CRunAdMob.java:224: error: cannot find symbol
    MobileAds.initialize(MMFRuntime.inst, IntersAds.AppID.replace("/", "~"));
    ^
    symbol: variable MobileAds
    location: class CRunAdMob
    C:\Users\user\AppData\Local\Temp\AndB4F1.tmp\app\s rc\main\java\Extensions\CRunAdMob.java:225: error: cannot find symbol
    interstitial = new InterstitialAd(MMFRuntime.inst);
    ^
    symbol: class InterstitialAd
    location: class CRunAdMob
    C:\Users\user\AppData\Local\Temp\AndB4F1.tmp\app\s rc\main\java\Extensions\CRunAdMob.java:228: error: package AdRequest does not exist
    final AdRequest.Builder builder = new AdRequest.Builder();
    ^
    C:\Users\user\AppData\Local\Temp\AndB4F1.tmp\app\s rc\main\java\Extensions\CRunAdMob.java:228: error: package AdRequest does not exist
    final AdRequest.Builder builder = new AdRequest.Builder();
    ^
    C:\Users\user\AppData\Local\Temp\AndB4F1.tmp\app\s rc\main\java\Extensions\CRunAdMob.java:243: error: cannot find symbol
    builder.addTestDevice(AdRequest.DEVICE_ID_EMULATOR );
    ^
    symbol: variable AdRequest
    location: class CRunAdMob
    C:\Users\user\AppData\Local\Temp\AndB4F1.tmp\app\s rc\main\java\Extensions\CRunAdMob.java:284: error: cannot find symbol
    builder.addNetworkExtrasBundle(MediationAdapter.cl ass, bundle);
    ^
    symbol: class MediationAdapter
    location: class CRunAdMob
    C:\Users\user\AppData\Local\Temp\AndB4F1.tmp\app\s rc\main\java\Extensions\CRunAdMob.java:290: error: cannot find symbol
    interstitial.setAdListener(new AdListener () {
    ^
    symbol: class AdListener
    location: class CRunAdMob
    C:\Users\user\AppData\Local\Temp\AndB4F1.tmp\app\s rc\main\java\Extensions\CRunAdMob.java:337: error: cannot find symbol
    final AdRequest request = builder.build();
    ^
    symbol: class AdRequest
    location: class CRunAdMob
    C:\Users\user\AppData\Local\Temp\AndB4F1.tmp\app\s rc\main\java\Extensions\CRunAdMob.java:375: error: cannot find symbol
    MobileAds.initialize(MMFRuntime.inst, xAds.AppID.replace("/", "~"));
    ^
    symbol: variable MobileAds
    location: class CRunAdMob
    C:\Users\user\AppData\Local\Temp\AndB4F1.tmp\app\s rc\main\java\Extensions\CRunAdMob.java:378: error: cannot find symbol
    adView = new AdView(MMFRuntime.inst);
    ^
    symbol: class AdView
    location: class CRunAdMob
    C:\Users\user\AppData\Local\Temp\AndB4F1.tmp\app\s rc\main\java\Extensions\CRunAdMob.java:418: error: package AdRequest does not exist
    final AdRequest.Builder builder = new AdRequest.Builder();
    ^
    C:\Users\user\AppData\Local\Temp\AndB4F1.tmp\app\s rc\main\java\Extensions\CRunAdMob.java:418: error: package AdRequest does not exist
    final AdRequest.Builder builder = new AdRequest.Builder();
    ^
    C:\Users\user\AppData\Local\Temp\AndB4F1.tmp\app\s rc\main\java\Extensions\CRunAdMob.java:434: error: cannot find symbol
    builder.addTestDevice(AdRequest.DEVICE_ID_EMULATOR );
    ^
    symbol: variable AdRequest
    location: class CRunAdMob
    C:\Users\user\AppData\Local\Temp\AndB4F1.tmp\app\s rc\main\java\Extensions\CRunAdMob.java:477: error: cannot find symbol
    builder.addNetworkExtrasBundle(MediationAdapter.cl ass, bundle);
    ^
    symbol: class MediationAdapter
    location: class CRunAdMob
    C:\Users\user\AppData\Local\Temp\AndB4F1.tmp\app\s rc\main\java\Extensions\CRunAdMob.java:482: error: cannot find symbol
    AdRequest request = builder.build();
    ^
    symbol: class AdRequest
    location: class CRunAdMob
    C:\Users\user\AppData\Local\Temp\AndB4F1.tmp\app\s rc\main\java\Extensions\CRunAdMob.java:484: error: cannot find symbol
    adView.setAdListener(new AdListener () {
    ^
    symbol: class AdListener
    location: class CRunAdMob
    C:\Users\user\AppData\Local\Temp\AndB4F1.tmp\app\s rc\main\java\Extensions\CRunAdMob.java:567: error: cannot find symbol
    MobileAds.initialize(MMFRuntime.inst, VideoAds.AppID.replace("/", "~"));
    ^
    symbol: variable MobileAds
    location: class CRunAdMob
    C:\Users\user\AppData\Local\Temp\AndB4F1.tmp\app\s rc\main\java\Extensions\CRunAdMob.java:569: error: cannot find symbol
    videoreward = MobileAds.getRewardedVideoAdInstance((MMFRuntime.i nst));
    ^
    symbol: variable MobileAds
    location: class CRunAdMob
    C:\Users\user\AppData\Local\Temp\AndB4F1.tmp\app\s rc\main\java\Extensions\CRunAdMob.java:571: error: package AdRequest does not exist
    final AdRequest.Builder builder = new AdRequest.Builder();
    ^
    C:\Users\user\AppData\Local\Temp\AndB4F1.tmp\app\s rc\main\java\Extensions\CRunAdMob.java:571: error: package AdRequest does not exist
    final AdRequest.Builder builder = new AdRequest.Builder();
    ^
    C:\Users\user\AppData\Local\Temp\AndB4F1.tmp\app\s rc\main\java\Extensions\CRunAdMob.java:586: error: cannot find symbol
    builder.addTestDevice(AdRequest.DEVICE_ID_EMULATOR );
    ^
    symbol: variable AdRequest
    location: class CRunAdMob
    C:\Users\user\AppData\Local\Temp\AndB4F1.tmp\app\s rc\main\java\Extensions\CRunAdMob.java:627: error: cannot find symbol
    builder.addNetworkExtrasBundle(MediationAdapter.cl ass, bundle);
    ^
    symbol: class MediationAdapter
    location: class CRunAdMob
    C:\Users\user\AppData\Local\Temp\AndB4F1.tmp\app\s rc\main\java\Extensions\CRunAdMob.java:633: error: cannot find symbol
    videoreward.setRewardedVideoAdListener(new RewardedVideoAdListener () {
    ^
    symbol: class RewardedVideoAdListener
    location: class CRunAdMob
    C:\Users\user\AppData\Local\Temp\AndB4F1.tmp\app\s rc\main\java\Extensions\CRunAdMob.java:702: error: cannot find symbol
    AdRequest request = builder.build();
    ^
    symbol: class AdRequest
    location: class CRunAdMob
    C:\Users\user\AppData\Local\Temp\AndB4F1.tmp\app\s rc\main\java\Extensions\CRunAdMob.java:787: error: cannot find symbol
    mmfAdMob.adSize = AdSize.BANNER;
    ^
    symbol: variable AdSize
    location: class CRunAdMob
    C:\Users\user\AppData\Local\Temp\AndB4F1.tmp\app\s rc\main\java\Extensions\CRunAdMob.java:813: error: cannot find symbol
    mmfAdMob.adSize = AdSize.BANNER;
    ^
    symbol: variable AdSize
    location: class CRunAdMob
    C:\Users\user\AppData\Local\Temp\AndB4F1.tmp\app\s rc\main\java\Extensions\CRunAdMob.java:816: error: cannot find symbol
    mmfAdMob.adSize = AdSize.MEDIUM_RECTANGLE;
    ^
    symbol: variable AdSize
    location: class CRunAdMob
    C:\Users\user\AppData\Local\Temp\AndB4F1.tmp\app\s rc\main\java\Extensions\CRunAdMob.java:819: error: cannot find symbol
    mmfAdMob.adSize = AdSize.FULL_BANNER;
    ^
    symbol: variable AdSize
    location: class CRunAdMob
    C:\Users\user\AppData\Local\Temp\AndB4F1.tmp\app\s rc\main\java\Extensions\CRunAdMob.java:822: error: cannot find symbol
    mmfAdMob.adSize = AdSize.LEADERBOARD;
    ^
    symbol: variable AdSize
    location: class CRunAdMob
    C:\Users\user\AppData\Local\Temp\AndB4F1.tmp\app\s rc\main\java\Extensions\CRunAdMob.java:825: error: cannot find symbol
    mmfAdMob.adSize = AdSize.SMART_BANNER;
    ^
    symbol: variable AdSize
    location: class CRunAdMob
    C:\Users\user\AppData\Local\Temp\AndB4F1.tmp\app\s rc\main\java\Extensions\CRunAdMob.java:1287: error: cannot find symbol
    mmfAdMob.adSize = AdSize.BANNER;
    ^
    symbol: variable AdSize
    location: class CRunAdMob
    C:\Users\user\AppData\Local\Temp\AndB4F1.tmp\app\s rc\main\java\Extensions\CRunAdMob.java:1291: error: cannot find symbol
    mmfAdMob.adSize = AdSize.MEDIUM_RECTANGLE;
    ^
    symbol: variable AdSize
    location: class CRunAdMob
    C:\Users\user\AppData\Local\Temp\AndB4F1.tmp\app\s rc\main\java\Extensions\CRunAdMob.java:1295: error: cannot find symbol
    mmfAdMob.adSize = AdSize.FULL_BANNER;
    ^
    symbol: variable AdSize
    location: class CRunAdMob
    C:\Users\user\AppData\Local\Temp\AndB4F1.tmp\app\s rc\main\java\Extensions\CRunAdMob.java:1299: error: cannot find symbol
    mmfAdMob.adSize = AdSize.LEADERBOARD;
    ^
    symbol: variable AdSize
    location: class CRunAdMob
    C:\Users\user\AppData\Local\Temp\AndB4F1.tmp\app\s rc\main\java\Extensions\CRunAdMob.java:1303: error: cannot find symbol
    mmfAdMob.adSize = AdSize.SMART_BANNER;
    ^
    symbol: variable AdSize
    location: class CRunAdMob
    C:\Users\user\AppData\Local\Temp\AndB4F1.tmp\app\s rc\main\java\Extensions\CRunAdMob.java:1386: error: cannot find symbol
    mmfAdMob.gender = AdRequest.GENDER_UNKNOWN;
    ^
    symbol: variable AdRequest
    location: class CRunAdMob
    C:\Users\user\AppData\Local\Temp\AndB4F1.tmp\app\s rc\main\java\Extensions\CRunAdMob.java:1389: error: cannot find symbol
    mmfAdMob.gender = AdRequest.GENDER_MALE;
    ^
    symbol: variable AdRequest
    location: class CRunAdMob
    C:\Users\user\AppData\Local\Temp\AndB4F1.tmp\app\s rc\main\java\Extensions\CRunAdMob.java:1392: error: cannot find symbol
    mmfAdMob.gender = AdRequest.GENDER_FEMALE;
    ^
    symbol: variable AdRequest
    location: class CRunAdMob
    Note: Some input files use or override a deprecated API.
    Note: Recompile with -Xlint:deprecation for details.
    Note: Some input files use unchecked or unsafe operations.
    Note: Recompile with -Xlint:unchecked for details.
    57 errors

    > Task :app:compileReleaseJavaWithJavac FAILED

    FAILURE: Build failed with an exception.

    * What went wrong:
    Execution failed for task ':app:compileReleaseJavaWithJavac'.
    > Compilation failed; see the compiler error output for details.

    * Try:
    Run with --stacktrace option to get the stack trace. Run with --info or --debug option to get more log output. Run with --scan to get full insights.

    * Get more help at https://help.gradle.org

    BUILD FAILED in 3m 59s
    14 actionable tasks: 14 executed

  10. #10
    Clickteam Clickteam
    Fernando's Avatar
    Join Date
    Dec 2006
    Posts
    6,145
    Mentioned
    158 Post(s)
    Tagged
    3 Thread(s)
    it is possible to you connect to discord Clickteam

    I will send you a link by PM
    Regards,


    Fernando Vivolo

    ... new things are coming ...

Page 1 of 2 1 2 LastLast

Similar Threads

  1. error when exporting to android
    By PGUp in forum Fusion 2.5
    Replies: 0
    Last Post: 18th April 2017, 07:53 AM
  2. Can't export simple android game - build error fails
    By Duncansby in forum Android Export Module 2.5
    Replies: 5
    Last Post: 10th October 2016, 10:10 PM
  3. Android exporting to apk error:
    By G2_ in forum Android Export Module 2.5
    Replies: 11
    Last Post: 4th August 2016, 03:13 PM
  4. Android Exporter Error when exporting
    By Keith in forum Android Export Module 2.5
    Replies: 1
    Last Post: 3rd January 2016, 07:34 AM

Posting Permissions

  • You may not post new threads
  • You may not post replies
  • You may not post attachments
  • You may not edit your posts
  •