User Tag List

Page 3 of 3 FirstFirst 1 2 3
Results 21 to 24 of 24

Thread: Google Maps Extension. Is it still working?

  1. #21
    Clickteam Clickteam
    Fernando's Avatar
    Join Date
    Dec 2006
    Posts
    6,785
    Mentioned
    298 Post(s)
    Tagged
    4 Thread(s)
    mm do me a favor any chance you can install using extension manager?
    Regards,


    Fernando Vivolo

    ... new things are coming ...

  2. #22
    Clicker Fusion 2.5 DeveloperAndroid Export ModuleiOS Export ModuleUnicode Add-on

    Join Date
    Oct 2011
    Posts
    221
    Mentioned
    0 Post(s)
    Tagged
    0 Thread(s)
    Hi,
    When I add Google maps object to my project, the app will no longer compile.
    The Google maps object seems to be the latest, from 2020.
    I use API 29.
    I get the errors below, any advice how to fix this?

    Thanks!


    > Configure project :app
    WARNING: The option 'android.useDeprecatedNdk' is deprecated.
    The current default is 'false'.
    It has been removed from the current version of the Android Gradle plugin.
    NdkCompile is no longer supported

    > Task :app:preBuild UP-TO-DATE
    > Task :app:preDebugBuild UP-TO-DATE
    > Task :app:compileDebugAidl NO-SOURCE
    > Task :app:compileDebugRenderscript NO-SOURCE
    > Task :app:generateDebugBuildConfig
    > Task :app:generateDebugResValues
    > Task :app:generateDebugResources
    > Task :app:createDebugCompatibleScreenManifests
    > Task :app:extractDeepLinksDebug
    > Task :app:processDebugManifest
    > Task :app:mergeDebugShaders
    > Task :app:compileDebugShaders NO-SOURCE
    > Task :app:generateDebugAssets UP-TO-DATE
    > Task :app:mergeDebugAssets
    > Task :app:processDebugJavaRes NO-SOURCE
    > Task :app:checkDebugDuplicateClasses
    > Task :app:javaPreCompileDebug
    > Task :app:mergeDebugJniLibFolders
    > Task :app:validateSigningDebug
    > Task :app:mergeLibDexDebug
    > Task :app:mergeDebugResources
    > Task :app:processDebugResources

    > Task :app:compileDebugJavaWithJavac FAILED
    C:\Users\Yos\AppData\Local\Temp\And94CA.tmp\app\sr c\main\java\Extensions\CRunGMaps.java:270: error: cannot find symbol
    mMap = mMapView.getMap();
    ^
    symbol: method getMap()
    location: variable mMapView of type MapView
    C:\Users\Yos\AppData\Local\Temp\And94CA.tmp\app\sr c\main\java\Extensions\CRunGMaps.java:386: error: cannot find symbol
    mMap = mMapFrag.getMap();
    ^
    symbol: method getMap()
    location: variable mMapFrag of type MapFragment
    C:\Users\Yos\AppData\Local\Temp\And94CA.tmp\app\sr c\main\java\Extensions\CRunGMaps.java:705: error: cannot find symbol
    mMap = mMapFrag.getMap();
    ^
    symbol: method getMap()
    location: variable mMapFrag of type MapFragment
    C:\Users\Yos\AppData\Local\Temp\And94CA.tmp\app\sr c\main\java\Extensions\CRunGMaps.java:1836: error: cannot find symbol
    expRet.forceString(GooglePlayServicesUtil.getOpenS ourceSoftwareLicenseInfo(ho.getControlsContext())) ;
    ^
    symbol: method getOpenSourceSoftwareLicenseInfo(Context)
    location: class GooglePlayServicesUtil
    Note: Some input files use or override a deprecated API.
    Note: Recompile with -Xlint:deprecation for details.
    Note: Some input files use unchecked or unsafe operations.
    Note: Recompile with -Xlint:unchecked for details.
    4 errors

    > Task :app:mergeDebugNativeLibs
    > Task :app:mergeExtDexDebug
    > Task :app:mergeDebugJavaResource

    FAILURE: Build failed with an exception.

    * What went wrong:
    Execution failed for task ':app:compileDebugJavaWithJavac'.
    > Compilation failed; see the compiler error output for details.

    * Try:
    Run with --stacktrace option to get the stack trace. Run with --info or --debug option to get more log output. Run with --scan to get full insights.

    * Get more help at https://help.gradle.org

    BUILD FAILED in 5s
    18 actionable tasks: 18 executed

  3. #23
    Clickteam Clickteam
    Fernando's Avatar
    Join Date
    Dec 2006
    Posts
    6,785
    Mentioned
    298 Post(s)
    Tagged
    4 Thread(s)
    Hi, is working fine here with API build 29, min 4.3 and target 10

    Date must be 02/07/2019 for the actual version of Android
    Regards,


    Fernando Vivolo

    ... new things are coming ...

  4. #24
    Clicker Fusion 2.5 DeveloperAndroid Export ModuleiOS Export ModuleUnicode Add-on

    Join Date
    Oct 2011
    Posts
    221
    Mentioned
    0 Post(s)
    Tagged
    0 Thread(s)
    Thanks Fernando, using the manager I uninstalled and re-installed the object. Now it compiles with no issues.

Page 3 of 3 FirstFirst 1 2 3

Similar Threads

  1. Google Maps extension. como posso usa a extensão Google Maps?
    By marcorios7 in forum Android Export Module 2.5
    Replies: 7
    Last Post: 7th November 2015, 08:01 AM
  2. Replies: 1
    Last Post: 15th August 2015, 05:15 PM
  3. Google Maps extension for iOS
    By ADS_3000 in forum Extension Development
    Replies: 1
    Last Post: 3rd July 2015, 01:01 AM
  4. Google Maps
    By Fernando in forum Android Extensions
    Replies: 6
    Last Post: 11th August 2014, 11:25 PM
  5. Google Maps
    By mnovoa in forum Android Export Module 2.5
    Replies: 0
    Last Post: 30th March 2014, 11:53 PM

Posting Permissions

  • You may not post new threads
  • You may not post replies
  • You may not post attachments
  • You may not edit your posts
  •