User Tag List

Page 2 of 19 FirstFirst 1 2 3 4 12 ... LastLast
Results 11 to 20 of 185

Thread: Build 292.2 - Release version

  1. #11
    Clicker

    Fusion 2.5 DeveloperFusion 2.5+ DLCAndroid Export ModuleHTML5 Export ModuleiOS Export ModuleSWF Export ModuleMac Export Module
    CapitaineCaverne's Avatar
    Join Date
    Feb 2011
    Location
    Bretigny sur Orge
    Posts
    471
    Mentioned
    2 Post(s)
    Tagged
    0 Thread(s)
    Bonjour
    Merci pour c est super mis a jour Yves c est vraiment du +++++

  2. #12
    Clicker Fusion 2.5 MacFusion 2.5 DeveloperFusion 2.5 DeveloperFusion 2.5+ DLCAndroid Export ModuleHTML5 Export ModuleiOS Export ModuleUniversal Windows Platform Export ModuleSWF Export ModuleMac Export ModuleInstall Creator Pro
    Fusion 2.5 (Steam)Fusion 2.5 Developer (Steam)Android Export Module (Steam)HTML5 Export Module (Steam)iOS Export Module (Steam)Universal Windows Platform Export Module (Steam)
    AND's Avatar
    Join Date
    Nov 2013
    Location
    Greece
    Posts
    273
    Mentioned
    5 Post(s)
    Tagged
    0 Thread(s)
    Has build 292.0 stopped supporting iOS 9 & iOS 10? I can build apps for iOS 12, but the new builds from Xcode crash on my iOS 9 and iOS 10 devices

  3. #13
    Clickteam Clickteam

    Join Date
    Jun 2006
    Location
    France
    Posts
    12,750
    Mentioned
    61 Post(s)
    Tagged
    2 Thread(s)
    They are still supported. We'll check what happens, thanks!

  4. #14
    Clicker Fusion 2.5 DeveloperFusion 2.5+ DLCAndroid Export ModuleiOS Export Module
    conceptgame's Avatar
    Join Date
    Apr 2011
    Location
    Switzerland
    Posts
    738
    Mentioned
    10 Post(s)
    Tagged
    0 Thread(s)
    Really great job Yves! Félicitations, ça fait plaisir que tout le travail de fond commence à faire surface pour nous utilisateurs.

    I think all the information regarding the Android runtime and Gradle are very useful and would really fit a "troubleshooting" section of a sticky thread on the forum. I think it will be more visible for people looking for help if they encounter some issues.

  5. #15
    Clickteam Clickteam

    Join Date
    Jun 2006
    Location
    France
    Posts
    12,750
    Mentioned
    61 Post(s)
    Tagged
    2 Thread(s)
    Yes, when the update will be officially released.

  6. #16
    Clickteam Clickteam
    Fernando's Avatar
    Join Date
    Dec 2006
    Posts
    5,818
    Mentioned
    110 Post(s)
    Tagged
    2 Thread(s)
    Quote Originally Posted by AND View Post
    Has build 292.0 stopped supporting iOS 9 & iOS 10? I can build apps for iOS 12, but the new builds from Xcode crash on my iOS 9 and iOS 10 devices
    @AND can you post a crash report?
    Regards,


    Fernando Vivolo

    ... new things are coming ...

  7. #17
    Clicker Fusion 2.5 MacFusion 2.5 DeveloperFusion 2.5 DeveloperFusion 2.5+ DLCAndroid Export ModuleHTML5 Export ModuleiOS Export ModuleUniversal Windows Platform Export ModuleSWF Export ModuleMac Export ModuleInstall Creator Pro
    Fusion 2.5 (Steam)Fusion 2.5 Developer (Steam)Android Export Module (Steam)HTML5 Export Module (Steam)iOS Export Module (Steam)Universal Windows Platform Export Module (Steam)
    AND's Avatar
    Join Date
    Nov 2013
    Location
    Greece
    Posts
    273
    Mentioned
    5 Post(s)
    Tagged
    0 Thread(s)
    Quote Originally Posted by Fernando View Post
    @AND can you post a crash report?
    @Fernando - here are the crash reports

    iOS 10 https://drive.google.com/file/d/1MF5...ew?usp=sharing

    iOS 9 https://drive.google.com/file/d/1hr7...ew?usp=sharing

    They build and start to run, but then the screen goes immediately black and Xcode stops with the report, "Failed to make complete framebuffer object 0"

    When I revert back to CTF2.5 291.6 they build and run normally on the 2 devices

  8. #18
    Clicker Fusion 2.5 DeveloperFusion 2.5+ DLCAndroid Export ModuleHTML5 Export ModuleiOS Export ModuleUniversal Windows Platform Export ModuleXNA Export Module
    Dobermann's Avatar
    Join Date
    Feb 2009
    Location
    France
    Posts
    594
    Mentioned
    21 Post(s)
    Tagged
    0 Thread(s)
    I can't build Android APK with b292, i get this error message everytime:
    bug-292.png

    Tried another game project and for this one i got an error file:

    Welcome to Gradle 4.10.1!

    Here are the highlights of this release:
    - Incremental Java compilation by default
    - Periodic Gradle caches cleanup
    - Gradle Kotlin DSL 1.0-RC6
    - Nested included builds
    - SNAPSHOT plugin versions in the `plugins {}` block

    For more details see https://docs.gradle.org/4.10.1/release-notes.html

    Starting a Gradle Daemon (subsequent builds will be faster)

    FAILURE: Build failed with an exception.

    * What went wrong:
    A problem occurred configuring root project 'AndFEC9.tmp'.
    > Could not resolve all artifacts for configuration ':classpath'.
    > Could not resolve org.jetbrains.kotlin:kotlin-stdlib-jdk8:1.3.20.
    Required by:
    project : > com.android.tools.build:gradle:3.3.1
    project : > com.android.tools.build:gradle:3.3.1 > com.android.tools.build:builder:3.3.1
    project : > com.android.tools.build:gradle:3.3.1 > com.android.tools.analytics-library:shared:26.3.1
    project : > com.android.tools.build:gradle:3.3.1 > com.android.tools.lint:lint-gradle-api:26.3.1
    project : > com.android.tools.build:gradle:3.3.1 > com.android.tools.build:gradle-api:3.3.1
    project : > com.android.tools.build:gradle:3.3.1 > androidx.databinding:databinding-compiler-common:3.3.1
    project : > com.android.tools.build:gradle:3.3.1 > com.android.tools.build:builder:3.3.1 > com.android.tools:sdk-common:26.3.1
    project : > com.android.tools.build:gradle:3.3.1 > com.android.tools.build:builder:3.3.1 > com.android.tools:common:26.3.1
    project : > com.android.tools.build:gradle:3.3.1 > com.android.tools.build:builder:3.3.1 > com.android.tools.build:manifest-merger:26.3.1
    project : > com.android.tools.build:gradle:3.3.1 > com.android.tools.build:builder:3.3.1 > com.android.tools.analytics-library:tracker:26.3.1
    project : > com.android.tools.build:gradle:3.3.1 > com.android.tools.build:builder:3.3.1 > com.android.tools:sdklib:26.3.1 > com.android.tools:repository:26.3.1
    > Could not resolve org.jetbrains.kotlin:kotlin-stdlib-jdk8:1.3.20.
    > Could not get resource 'https://jcenter.bintray.com/org/jetbrains/kotlin/kotlin-stdlib-jdk8/1.3.20/kotlin-stdlib-jdk8-1.3.20.pom'.
    > Could not GET 'https://jcenter.bintray.com/org/jetbrains/kotlin/kotlin-stdlib-jdk8/1.3.20/kotlin-stdlib-jdk8-1.3.20.pom'. Received status code 502 from server: Bad Gateway
    > Could not resolve org.jetbrains.kotlin:kotlin-reflect:1.3.20.
    Required by:
    project : > com.android.tools.build:gradle:3.3.1 > com.android.tools.lint:lint-gradle-api:26.3.1
    project : > com.android.tools.build:gradle:3.3.1 > com.android.tools.build:builder:3.3.1 > com.android.tools:sdk-common:26.3.1
    > Skipped due to earlier error
    > Could not resolve org.jetbrains.kotlin:kotlin-stdlib:1.2.20.
    Required by:
    project : > com.android.tools.build:gradle:3.3.1 > com.android.tools.build.jetifier:jetifier-core:1.0.0-beta02
    project : > com.android.tools.build:gradle:3.3.1 > com.android.tools.build.jetifier:jetifier-processor:1.0.0-beta02
    > Skipped due to earlier error

    * Try:
    Run with --stacktrace option to get the stack trace. Run with --info or --debug option to get more log output. Run with --scan to get full insights.

    * Get more help at https://help.gradle.org

    BUILD FAILED in 31s
    Created a new blank project and got this:

    FAILURE: Build failed with an exception.

    * What went wrong:
    A problem occurred configuring root project 'And1BE.tmp'.
    > Could not resolve all artifacts for configuration ':classpath'.
    > Could not resolve org.jetbrains.kotlin:kotlin-stdlib:1.3.20.
    Required by:
    project : > com.android.tools.build:gradle:3.3.1 > org.jetbrains.kotlin:kotlin-stdlib-jdk8:1.3.20
    project : > com.android.tools.build:gradle:3.3.1 > com.android.tools.lint:lint-gradle-api:26.3.1 > org.jetbrains.kotlin:kotlin-reflect:1.3.20
    project : > com.android.tools.build:gradle:3.3.1 > org.jetbrains.kotlin:kotlin-stdlib-jdk8:1.3.20 > org.jetbrains.kotlin:kotlin-stdlib-jdk7:1.3.20
    > Could not resolve org.jetbrains.kotlin:kotlin-stdlib:1.3.20.
    > Could not get resource 'https://jcenter.bintray.com/org/jetbrains/kotlin/kotlin-stdlib/1.3.20/kotlin-stdlib-1.3.20.pom'.
    > Could not GET 'https://jcenter.bintray.com/org/jetbrains/kotlin/kotlin-stdlib/1.3.20/kotlin-stdlib-1.3.20.pom'. Received status code 504 from server: Gateway Time-out
    > Could not resolve org.jetbrains.kotlin:kotlin-stdlib:1.3.20.
    Required by:
    project : > com.android.tools.build:gradle:3.3.1 > com.android.tools.build.jetifier:jetifier-core:1.0.0-beta02
    project : > com.android.tools.build:gradle:3.3.1 > com.android.tools.build.jetifier:jetifier-processor:1.0.0-beta02
    > Could not resolve org.jetbrains.kotlin:kotlin-stdlib:1.3.20.
    > Could not get resource 'https://jcenter.bintray.com/org/jetbrains/kotlin/kotlin-stdlib/1.3.20/kotlin-stdlib-1.3.20.pom'.
    > Could not GET 'https://jcenter.bintray.com/org/jetbrains/kotlin/kotlin-stdlib/1.3.20/kotlin-stdlib-1.3.20.pom'. Received status code 504 from server: Gateway Time-out

    * Try:
    Run with --stacktrace option to get the stack trace. Run with --info or --debug option to get more log output. Run with --scan to get full insights.

    * Get more help at https://help.gradle.org

    BUILD FAILED in 18s

  9. #19
    Clickteam Clickteam

    Join Date
    Jun 2006
    Location
    France
    Posts
    12,750
    Mentioned
    61 Post(s)
    Tagged
    2 Thread(s)
    OK:

    1. Is your Android SDK up-to-date? (build tools and API) If not, update it and retry.

    2. What Build API do you use? Better use the latest one, API #28. If you use an older API, retry with API 28.

    3. Also check the version of JDK you use (better use the latest 64-bit version of JDK 8)

    EDIT: and let us know what change fixed it, can be useful if anyone reports the same probleem. Thx.

  10. #20
    Clickteam Clickteam

    Join Date
    Jun 2006
    Location
    France
    Posts
    12,750
    Mentioned
    61 Post(s)
    Tagged
    2 Thread(s)
    PS: apparently Android building doesn't work in the Mac version of the editor with the build 292, we're on it.

Page 2 of 19 FirstFirst 1 2 3 4 12 ... LastLast

Similar Threads

  1. Build 289.0 - Beta version
    By Yves in forum Fusion 2.5
    Replies: 19
    Last Post: 28th May 2017, 08:06 PM
  2. Build 287.2 - beta version
    By Yves in forum Fusion 2.5
    Replies: 55
    Last Post: 27th September 2016, 07:21 AM
  3. Build 287.1 - beta version
    By Yves in forum Fusion 2.5
    Replies: 21
    Last Post: 23rd July 2016, 02:40 PM
  4. Build 285.0 - beta version
    By Yves in forum Fusion 2.5
    Replies: 69
    Last Post: 12th September 2015, 11:55 PM
  5. Build 284.0 - beta version
    By Yves in forum Fusion 2.5
    Replies: 33
    Last Post: 12th March 2015, 03:52 PM

Posting Permissions

  • You may not post new threads
  • You may not post replies
  • You may not post attachments
  • You may not edit your posts
  •