User Tag List

Page 11 of 25 FirstFirst ... 9 10 11 12 13 21 ... LastLast
Results 101 to 110 of 241

Thread: Android Runtime - Build 292

  1. #101
    Clicker Fusion 2.5 (Steam)Fusion 2.5 Developer (Steam)Android Export Module (Steam)HTML5 Export Module (Steam)iOS Export Module (Steam)Universal Windows Platform Export Module (Steam)
    Lukaaash's Avatar
    Join Date
    Oct 2016
    Posts
    15
    Mentioned
    1 Post(s)
    Tagged
    0 Thread(s)
    Interesting, when I select Android app bundle, choose path for build filename (with file *.aab) and compile it, I just get compiled *.apk instead of *.aab file. Is this normal?

    And for previous question, it works after uploading in Google Play and updating app, although it is regular apk file and not app bundle.

  2. #102
    Clicker Fusion 2.5
    Fusion 2.5 (Steam)Fusion 2.5 Developer (Steam)Android Export Module (Steam)

    Join Date
    Nov 2014
    Posts
    62
    Mentioned
    5 Post(s)
    Tagged
    0 Thread(s)
    Can anyone help me understand what is going on here? I've been getting this or some variation for hours, even after installing the proper API's, downloading the latest Java SDK 8 and I'm still trying to figure out what all this "Gradle" business is about. My computer seems to be reluctant to even opening the zip file for it, crashing the Windows explorer each time. But I suppose that's a separate issue.

    I can send the full log, if need be.


    Note: Some input files use or override a deprecated API.
    Note: Recompile with -Xlint:deprecation for details.
    Note: Some input files use unchecked or unsafe operations.
    Note: Recompile with -Xlint:unchecked for details.
    75 errors

    > Task :app:compileReleaseJavaWithJavac FAILED

    FAILURE: Build failed with an exception.

    * What went wrong:
    Execution failed for task ':app:compileReleaseJavaWithJavac'.
    > Compilation failed; see the compiler error output for details.

    * Try:
    Run with --stacktrace option to get the stack trace. Run with --info or --debug option to get more log output. Run with --scan to get full insights.

    * Get more help at https://help.gradle.org

    Deprecated Gradle features were used in this build, making it incompatible with Gradle 6.0.
    Use '--warning-mode all' to show the individual deprecation warnings.
    See https://docs.gradle.org/5.1.1/usergu..._line_warnings

    BUILD FAILED in 24s
    12 actionable tasks: 12 executed

  3. #103
    Clickteam Clickteam
    Fernando's Avatar
    Join Date
    Dec 2006
    Posts
    6,040
    Mentioned
    130 Post(s)
    Tagged
    3 Thread(s)
    the error is related to javac see "
    compileReleaseJavaWithJavac"

    question did you update java sdk directory,
    and the android sdk
    inside fusion editor preferences?
    Regards,


    Fernando Vivolo

    ... new things are coming ...

  4. #104
    Clicker Fusion 2.5
    Fusion 2.5 (Steam)Fusion 2.5 Developer (Steam)Android Export Module (Steam)

    Join Date
    Nov 2014
    Posts
    62
    Mentioned
    5 Post(s)
    Tagged
    0 Thread(s)
    Quote Originally Posted by Fernando View Post
    the error is related to javac see "
    compileReleaseJavaWithJavac"

    question did you update java sdk directory,
    and the android sdk
    inside fusion editor preferences?
    Yes sir, I did all of that. Installed the latest Android Studio, did the command prompt thing, the only thing I can't get to operate is Gradle. When I try to export to an APK through Fusion, I keep getting the same error message as above, and it's bringing up things about the GPG extension. I saw something here about getting the Gradle version of that extension. If that is the problem, where do I find that?

  5. #105
    Clickteam Clickteam
    Fernando's Avatar
    Join Date
    Dec 2006
    Posts
    6,040
    Mentioned
    130 Post(s)
    Tagged
    3 Thread(s)
    in you clickstore account, login and check downloads
    Regards,


    Fernando Vivolo

    ... new things are coming ...

  6. #106
    Clicker Fusion 2.5 DeveloperAndroid Export Module
    Rickyvb's Avatar
    Join Date
    Oct 2015
    Posts
    19
    Mentioned
    0 Post(s)
    Tagged
    0 Thread(s)
    I followed the instructions as followed. However, I get this error.
    Any help will greatly be appreciated.

    Buildfile: C:\Users\Toshiba\AppData\Local\Temp\And9C1C.tmp\bu ild.xml

    BUILD FAILED
    C:\Users\Toshiba\AppData\Local\Temp\And9C1C.tmp\bu ild.xml:83: Cannot find C:\Users\Toshiba\AppData\Local\Android\Sdk\tools\a nt\build.xml imported from C:\Users\Toshiba\AppData\Local\Temp\And9C1C.tmp\bu ild.xml

    Total time: 1 second

    I have MMF2.5 Dev ver. Build R292.10

    ERROR 01.jpg

  7. #107
    Clickteam Clickteam
    Fernando's Avatar
    Join Date
    Dec 2006
    Posts
    6,040
    Mentioned
    130 Post(s)
    Tagged
    3 Thread(s)
    strange seems that you are using and old ant version and not 292.10

    seems that you need to reinstall fusion and update to 292.11
    Regards,


    Fernando Vivolo

    ... new things are coming ...

  8. #108
    Clicker Fusion 2.5 DeveloperAndroid Export Module
    Rickyvb's Avatar
    Join Date
    Oct 2015
    Posts
    19
    Mentioned
    0 Post(s)
    Tagged
    0 Thread(s)
    Thanks for the response. I just purchased MMF2.5 and applied the update for the latest patch. However, the version is still 292.10 for some reason.

    ERROR 01.jpg

  9. #109
    Clicker Fusion 2.5 DeveloperAndroid Export Module
    Rickyvb's Avatar
    Join Date
    Oct 2015
    Posts
    19
    Mentioned
    0 Post(s)
    Tagged
    0 Thread(s)
    Okay, so I did a few things to see if it helped.

    1) Reinstalled the patch for MMf2.5

    2) Changed the SDK directory to C:\Android\SDK

    However, now I have this error.

    Downloading https://services.gradle.org/distribu...-5.1.1-all.zip
    .................................................. .................................................. ........................
    Unzipping C:\Users\Toshiba\.gradle\wrapper\dists\gradle-5.1.1-all\97z1ksx6lirer3kbvdnh7jtjg\gradle-5.1.1-all.zip to C:\Users\Toshiba\.gradle\wrapper\dists\gradle-5.1.1-all\97z1ksx6lirer3kbvdnh7jtjg

    Welcome to Gradle 5.1.1!

    Here are the highlights of this release:
    - Control which dependencies can be retrieved from which repositories
    - Production-ready configuration avoidance APIs

    For more details see https://docs.gradle.org/5.1.1/release-notes.html

    Starting a Gradle Daemon (subsequent builds will be faster)

    > Configure project :app
    File C:\Users\Toshiba\.android\repositories.cfg could not be loaded.
    Checking the license for package Android SDK Build-Tools 28.0.3 in C:\Android\Sdk\licenses
    License for package Android SDK Build-Tools 28.0.3 accepted.
    Preparing "Install Android SDK Build-Tools 28.0.3 (revision: 28.0.3)".
    "Install Android SDK Build-Tools 28.0.3 (revision: 28.0.3)" ready.
    Installing Android SDK Build-Tools 28.0.3 in C:\Android\Sdk\build-tools\28.0.3
    "Install Android SDK Build-Tools 28.0.3 (revision: 28.0.3)" complete.
    "Install Android SDK Build-Tools 28.0.3 (revision: 28.0.3)" finished.

    > Task :app:preBuild UP-TO-DATE
    > Task :app:preReleaseBuild
    > Task :app:compileReleaseAidl NO-SOURCE
    > Task :app:compileReleaseRenderscript NO-SOURCE
    > Task :app:checkReleaseManifest
    > Task :app:generateReleaseBuildConfig
    > Task :app:prepareLintJar
    > Task :app:generateReleaseSources
    > Task :app:javaPreCompileRelease
    > Task :app:mainApkListPersistenceRelease
    > Task :app:generateReleaseResValues
    > Task :app:generateReleaseResources
    > Task :app:mergeReleaseResources FAILED

    FAILURE: Build failed with an exception.

    * What went wrong:
    Execution failed for task ':app:mergeReleaseResources'.
    > 8 exceptions were raised by workers:
    com.android.builder.internal.aapt.v2.Aapt2Internal Exception: AAPT2 aapt2-3.4.1-5326820-windows Daemon #0: Daemon startup failed
    This should not happen under normal circumstances, please file an issue if it does.
    com.android.builder.internal.aapt.v2.Aapt2Internal Exception: AAPT2 aapt2-3.4.1-5326820-windows Daemon #1: Daemon startup failed
    This should not happen under normal circumstances, please file an issue if it does.
    com.android.builder.internal.aapt.v2.Aapt2Internal Exception: AAPT2 aapt2-3.4.1-5326820-windows Daemon #2: Daemon startup failed
    This should not happen under normal circumstances, please file an issue if it does.
    com.android.builder.internal.aapt.v2.Aapt2Internal Exception: AAPT2 aapt2-3.4.1-5326820-windows Daemon #3: Daemon startup failed
    This should not happen under normal circumstances, please file an issue if it does.
    com.android.builder.internal.aapt.v2.Aapt2Internal Exception: AAPT2 aapt2-3.4.1-5326820-windows Daemon #4: Daemon startup failed
    This should not happen under normal circumstances, please file an issue if it does.
    com.android.builder.internal.aapt.v2.Aapt2Internal Exception: AAPT2 aapt2-3.4.1-5326820-windows Daemon #5: Daemon startup failed
    This should not happen under normal circumstances, please file an issue if it does.
    com.android.builder.internal.aapt.v2.Aapt2Internal Exception: AAPT2 aapt2-3.4.1-5326820-windows Daemon #6: Daemon startup failed
    This should not happen under normal circumstances, please file an issue if it does.
    com.android.builder.internal.aapt.v2.Aapt2Internal Exception: AAPT2 aapt2-3.4.1-5326820-windows Daemon #7: Daemon startup failed
    This should not happen under normal circumstances, please file an issue if it does.


    * Try:
    Run with --stacktrace option to get the stack trace. Run with --info or --debug option to get more log output. Run with --scan to get full insights.

    * Get more help at https://help.gradle.org

    BUILD FAILED in 2m 55s
    8 actionable tasks: 8 executed

  10. #110
    Clickteam Clickteam
    Fernando's Avatar
    Join Date
    Dec 2006
    Posts
    6,040
    Mentioned
    130 Post(s)
    Tagged
    3 Thread(s)
    restart your computer maybe gradle daemon got blockage , check your antivirus just in case

    if this doe snot resolve your issue please post your windows version
    Regards,


    Fernando Vivolo

    ... new things are coming ...

Page 11 of 25 FirstFirst ... 9 10 11 12 13 21 ... LastLast

Similar Threads

  1. Users that cannot build with Android Studio (ant\build.xml error)
    By Perry in forum Android Export Module 2.5
    Replies: 77
    Last Post: 16th October 2018, 02:17 PM
  2. Replies: 56
    Last Post: 26th December 2017, 08:53 PM
  3. Cannot build my Android app (ant/build.xml error)
    By oaklan5 in forum Fusion 2.5
    Replies: 1
    Last Post: 27th July 2017, 06:59 PM
  4. Replies: 15
    Last Post: 27th November 2014, 10:08 AM

Posting Permissions

  • You may not post new threads
  • You may not post replies
  • You may not post attachments
  • You may not edit your posts
  •