User Tag List

Page 22 of 22 FirstFirst ... 12 20 21 22
Results 211 to 220 of 220

Thread: Android Runtime - Build 292

  1. #211
    Clicker Fusion 2.5 MacFusion 2.5 DeveloperFusion 2.5+ DLCAndroid Export ModuleHTML5 Export ModuleiOS Export ModuleXNA Export Module
    Fusion 2.5 (Steam)Fusion 2.5 Developer (Steam)Android Export Module (Steam)HTML5 Export Module (Steam)iOS Export Module (Steam)Universal Windows Platform Export Module (Steam)
    gkinfinity's Avatar
    Join Date
    May 2011
    Location
    USA
    Posts
    282
    Mentioned
    1 Post(s)
    Tagged
    0 Thread(s)
    I didn't delete the folder when I uninstalled previously. By doing that and updating to the 292.11 beta patch, it fixed the error! Thanks so much Fernando!

  2. #212
    Clickteam Clickteam
    Fernando's Avatar
    Join Date
    Dec 2006
    Posts
    6,322
    Mentioned
    207 Post(s)
    Tagged
    4 Thread(s)
    Glad is solved
    Regards,


    Fernando Vivolo

    ... new things are coming ...

  3. #213
    Clicker Fusion 2.5 DeveloperAndroid Export ModuleHTML5 Export ModuleSWF Export Module
    Ped's Avatar
    Join Date
    Feb 2014
    Posts
    53
    Mentioned
    0 Post(s)
    Tagged
    0 Thread(s)
    “Android Studio installs its own version of Java, usually in C:\Program Files\Android\Android Studio\jre. Verify this directory exists on your machine and use it as "Java SDK directory" in the preferences of Fusion”........

    So we still need to install the latest java sdk?

  4. #214
    Clickteam Clickteam

    Join Date
    Jun 2006
    Location
    France
    Posts
    13,404
    Mentioned
    168 Post(s)
    Tagged
    2 Thread(s)
    No, you don't. Android Studio installs its own version in C:\Program Files\Android\Android Studio\jre. Just use this directory as "Java SDK directory" in the preferences of Fusion (General Tab, Android exporter) .

  5. #215
    Clicker Fusion 2.5 DeveloperFusion 2.5+ DLCAndroid Export ModuleHTML5 Export ModuleiOS Export ModuleUniversal Windows Platform Export ModuleXNA Export Module
    Dobermann's Avatar
    Join Date
    Feb 2009
    Location
    France
    Posts
    719
    Mentioned
    29 Post(s)
    Tagged
    0 Thread(s)
    Sorry for the off topic, but how much time it takes to get an answer for a console conversion service?

  6. #216
    Clicker Fusion 2.5 (Steam)Fusion 2.5 Developer (Steam)Android Export Module (Steam)

    Join Date
    Jan 2020
    Posts
    2
    Mentioned
    1 Post(s)
    Tagged
    0 Thread(s)
    Hello everyone, I ran into the following problem: I'm trying to compile an Android application with In-App Purchase extension, but I get a compilation error. However, without using this extension, the application compiles without problems. It is very important for me to compile the application with this extension, since the previous version of the application with working purchases has already been published in Google Play. When compiling, I use JDK 8 and API 29. What are the possible solutions to this problem?

    > Configure project :
    it is windows 10

    > Configure project :app
    WARNING: The option setting 'android.overridePathCheck=true' is experimental and unsupported.
    The current default is 'false'.


    > Task :app:preBuild UP-TO-DATE
    > Task :app:preReleaseBuild UP-TO-DATE
    > Task :app:compileReleaseRenderscript NO-SOURCE
    > Task :app:generateReleaseResValues
    > Task :app:generateReleaseResources
    > Task :app:mergeReleaseResources
    > Task :app:checkReleaseManifest
    > Task :app:createReleaseCompatibleScreenManifests
    > Task :app:mainApkListPersistenceRelease
    > Task :app:processReleaseManifest
    > Task :app:checkReleaseDuplicateClasses
    > Task :app:mergeExtDexRelease
    > Task :app:compileReleaseAidl FAILED
    > Task :app:bundleReleaseResources

    FAILURE: Build failed with an exception.

    * What went wrong:
    Execution failed for task ':app:compileReleaseAidl'.
    > 1 exception was raised by workers:
    java.io.UncheckedIOException: java.nio.charset.MalformedInputException: Input length = 1


    * Try:
    Run with --stacktrace option to get the stack trace. Run with --info or --debug option to get more log output. Run with --scan to get full insights.

    * Get more help at https://help.gradle.org

    BUILD FAILED in 2m 6s
    10 actionable tasks: 10 executed

  7. #217
    Clickteam Clickteam
    Fernando's Avatar
    Join Date
    Dec 2006
    Posts
    6,322
    Mentioned
    207 Post(s)
    Tagged
    4 Thread(s)
    mm that is weird i just build OK the inapp example with 292.22, can you confirm to me that you set the Public Key?
    Regards,


    Fernando Vivolo

    ... new things are coming ...

  8. #218
    Clicker Fusion 2.5 (Steam)Fusion 2.5 Developer (Steam)Android Export Module (Steam)

    Join Date
    Jan 2020
    Posts
    2
    Mentioned
    1 Post(s)
    Tagged
    0 Thread(s)
    Yes of course, I've put in the public key in field of extension.
    Additional information: Current version of Android is 9.0, old version is 6.0, API 29. Android SDK was installed without Android Studio

  9. #219
    Clickteam Clickteam
    Fernando's Avatar
    Join Date
    Dec 2006
    Posts
    6,322
    Mentioned
    207 Post(s)
    Tagged
    4 Thread(s)
    mm strange i have no idea of this

    can you share your mfa for me to check here send me a link by PM
    Regards,


    Fernando Vivolo

    ... new things are coming ...

  10. #220
    Clickteam Clickteam
    Fernando's Avatar
    Join Date
    Dec 2006
    Posts
    6,322
    Mentioned
    207 Post(s)
    Tagged
    4 Thread(s)
    @Esdeaz no problem here building your mfa. An answer in your PM suggesting some actions at your side.
    Regards,


    Fernando Vivolo

    ... new things are coming ...

Page 22 of 22 FirstFirst ... 12 20 21 22

Similar Threads

  1. Users that cannot build with Android Studio (ant\build.xml error)
    By Perry in forum Android Export Module 2.5
    Replies: 102
    Last Post: 28th November 2019, 08:02 PM
  2. Replies: 56
    Last Post: 26th December 2017, 09:53 PM
  3. Cannot build my Android app (ant/build.xml error)
    By oaklan5 in forum Fusion 2.5
    Replies: 1
    Last Post: 27th July 2017, 07:59 PM
  4. Replies: 15
    Last Post: 27th November 2014, 11:08 AM

Posting Permissions

  • You may not post new threads
  • You may not post replies
  • You may not post attachments
  • You may not edit your posts
  •