User Tag List

Page 16 of 22 FirstFirst ... 6 14 15 16 17 18 ... LastLast
Results 151 to 160 of 212

Thread: Android Runtime - Build 292

  1. #151
    Clicker Fusion 2.5
    Fusion 2.5 (Steam)Fusion 2.5 Developer (Steam)Android Export Module (Steam)

    Join Date
    Nov 2014
    Posts
    62
    Mentioned
    5 Post(s)
    Tagged
    0 Thread(s)
    @Fernando

    I've checked to make sure that Gradle directory has full access, and still receive the same error, even after restarting the system. What is "compileReleaseJavaWithJavac" ? That seems to be the culprit, here. Nothing I install or update, seems to fix whatever that is. It keeps spouting stuff about the GPG, but I can't, for the life of me, figure out what that has to do with anything.

  2. #152
    Forum Moderator

    Fusion 2.5 MacFusion 2.5 DeveloperFusion 2.5+ DLCAndroid Export ModuleHTML5 Export ModuleiOS Export ModuleUniversal Windows Platform Export ModuleSWF Export ModuleMac Export ModuleInstall Creator Pro
    Fusion 2.5 (Steam)Fusion 2.5 Developer (Steam)Android Export Module (Steam)HTML5 Export Module (Steam)iOS Export Module (Steam)
    Perry's Avatar
    Join Date
    Dec 2013
    Location
    Watertown, WI
    Posts
    4,334
    Mentioned
    49 Post(s)
    Tagged
    0 Thread(s)
    you need to switch to 64 bit Java.

  3. #153
    Clickteam Clickteam
    Fernando's Avatar
    Join Date
    Dec 2006
    Posts
    6,136
    Mentioned
    154 Post(s)
    Tagged
    3 Thread(s)
    Could not create Jansi native library 'C: \ Users \ al \ .gradle \ native \ jansi \ 1.17.1 \ windows32 \ jansi.dll'.
    ok you have a 64 bits PC running a 64 bit windows version and the gradle is asking fro 32 bit, then teh java sdk is 32?, if it is, you must change to 64 bits
    @MrJustan

    please confirm your windows version if is 64 bits and you have installed 64 bits version for java sdk
    Regards,


    Fernando Vivolo

    ... new things are coming ...

  4. #154
    Clicker Fusion 2.5
    Fusion 2.5 (Steam)Fusion 2.5 Developer (Steam)Android Export Module (Steam)

    Join Date
    Nov 2014
    Posts
    62
    Mentioned
    5 Post(s)
    Tagged
    0 Thread(s)
    @Fernando

    Yes, I'm running 64-bit Windows 8.1 and the version of Java 8 that I've installed is indeed the 64-bit version.

  5. #155
    Clickteam Clickteam
    Fernando's Avatar
    Join Date
    Dec 2006
    Posts
    6,136
    Mentioned
    154 Post(s)
    Tagged
    3 Thread(s)
    sorry to reask, please post all version java sdk version and update

    does the preferences are updates and pointing to the correct locations
    Regards,


    Fernando Vivolo

    ... new things are coming ...

  6. #156
    Clicker Fusion 2.5 (Steam)Fusion 2.5 Developer (Steam)Android Export Module (Steam)HTML5 Export Module (Steam)iOS Export Module (Steam)Universal Windows Platform Export Module (Steam)
    Lecherbault's Avatar
    Join Date
    Jul 2016
    Posts
    137
    Mentioned
    7 Post(s)
    Tagged
    0 Thread(s)
    Quote Originally Posted by Fernando View Post
    sorry to reask, please post all version java sdk version and update

    does the preferences are updates and pointing to the correct locations
    I have installed jdk-11.0-1 and pointed to the correct location (java and android studio), but when i want to make apk with my important work, no compile: i have this error:
    > Task :app:preBuild UP-TO-DATE
    > Task :app:preDebugBuild
    > Task :app:compileDebugAidl NO-SOURCE
    > Task :app:compileDebugRenderscript NO-SOURCE
    > Task :app:checkDebugManifest
    > Task :app:generateDebugBuildConfig
    > Task :app:prepareLintJar
    > Task :app:generateDebugSources
    > Task :app:javaPreCompileDebug
    > Task :app:mainApkListPersistenceDebug
    > Task :app:generateDebugResValues
    > Task :app:generateDebugResources
    > Task :app:mergeDebugResources
    > Task :app:createDebugCompatibleScreenManifests
    > Task :app:processDebugManifest
    > Task :app:processDebugResources

    > Task :app:compileDebugJavaWithJavac FAILED
    C:\Users\al\AppData\Local\Temp\And73E9.tmp\app\src \main\java\Extensions\CRunGMaps.java:20: error: package com.google.android.gms.maps does not exist
    import com.google.android.gms.maps.CameraUpdate;
    ^
    C:\Users\al\AppData\Local\Temp\And73E9.tmp\app\src \main\java\Extensions\CRunGMaps.java:21: error: package com.google.android.gms.maps does not exist
    import com.google.android.gms.maps.CameraUpdateFactory;
    ^
    C:\Users\al\AppData\Local\Temp\And73E9.tmp\app\src \main\java\Extensions\CRunGMaps.java:22: error: package com.google.android.gms.maps does not exist
    import com.google.android.gms.maps.GoogleMap;
    ^
    C:\Users\al\AppData\Local\Temp\And73E9.tmp\app\src \main\java\Extensions\CRunGMaps.java:23: error: package com.google.android.gms.maps.GoogleMap does not exist
    import com.google.android.gms.maps.GoogleMap.CancelableCa llback;
    ^
    C:\Users\al\AppData\Local\Temp\And73E9.tmp\app\src \main\java\Extensions\CRunGMaps.java:24: error: package com.google.android.gms.maps.GoogleMap does not exist
    import com.google.android.gms.maps.GoogleMap.OnCameraChan geListener;
    ^
    C:\Users\al\AppData\Local\Temp\And73E9.tmp\app\src \main\java\Extensions\CRunGMaps.java:25: error: package com.google.android.gms.maps.GoogleMap does not exist
    import com.google.android.gms.maps.GoogleMap.OnInfoWindow ClickListener;
    ^
    C:\Users\al\AppData\Local\Temp\And73E9.tmp\app\src \main\java\Extensions\CRunGMaps.java:26: error: package com.google.android.gms.maps.GoogleMap does not exist
    import com.google.android.gms.maps.GoogleMap.OnMapClickLi stener;
    ^
    C:\Users\al\AppData\Local\Temp\And73E9.tmp\app\src \main\java\Extensions\CRunGMaps.java:27: error: package com.google.android.gms.maps.GoogleMap does not exist
    import com.google.android.gms.maps.GoogleMap.OnMarkerClic kListener;
    ^
    C:\Users\al\AppData\Local\Temp\And73E9.tmp\app\src \main\java\Extensions\CRunGMaps.java:28: error: package com.google.android.gms.maps.GoogleMap does not exist
    import com.google.android.gms.maps.GoogleMap.OnMarkerDrag Listener;
    ^
    C:\Users\al\AppData\Local\Temp\And73E9.tmp\app\src \main\java\Extensions\CRunGMaps.java:29: error: package com.google.android.gms.maps.GoogleMap does not exist
    import com.google.android.gms.maps.GoogleMap.OnMyLocation ChangeListener;
    ^
    C:\Users\al\AppData\Local\Temp\And73E9.tmp\app\src \main\java\Extensions\CRunGMaps.java:30: error: package com.google.android.gms.maps does not exist
    import com.google.android.gms.maps.GoogleMapOptions;
    ^
    C:\Users\al\AppData\Local\Temp\And73E9.tmp\app\src \main\java\Extensions\CRunGMaps.java:31: error: package com.google.android.gms.maps does not exist
    import com.google.android.gms.maps.MapFragment;
    ^
    C:\Users\al\AppData\Local\Temp\And73E9.tmp\app\src \main\java\Extensions\CRunGMaps.java:32: error: package com.google.android.gms.maps does not exist
    import com.google.android.gms.maps.MapView;
    ^
    C:\Users\al\AppData\Local\Temp\And73E9.tmp\app\src \main\java\Extensions\CRunGMaps.java:33: error: package com.google.android.gms.maps does not exist
    import com.google.android.gms.maps.MapsInitializer;
    ^
    C:\Users\al\AppData\Local\Temp\And73E9.tmp\app\src \main\java\Extensions\CRunGMaps.java:34: error: package com.google.android.gms.maps does not exist
    import com.google.android.gms.maps.OnMapReadyCallback;
    ^
    C:\Users\al\AppData\Local\Temp\And73E9.tmp\app\src \main\java\Extensions\CRunGMaps.java:35: error: package com.google.android.gms.maps.model does not exist
    import com.google.android.gms.maps.model.BitmapDescriptor Factory;
    ^
    C:\Users\al\AppData\Local\Temp\And73E9.tmp\app\src \main\java\Extensions\CRunGMaps.java:36: error: package com.google.android.gms.maps.model does not exist
    import com.google.android.gms.maps.model.CameraPosition;
    ^
    C:\Users\al\AppData\Local\Temp\And73E9.tmp\app\src \main\java\Extensions\CRunGMaps.java:37: error: package com.google.android.gms.maps.model does not exist
    import com.google.android.gms.maps.model.Circle;
    ^
    C:\Users\al\AppData\Local\Temp\And73E9.tmp\app\src \main\java\Extensions\CRunGMaps.java:38: error: package com.google.android.gms.maps.model does not exist
    import com.google.android.gms.maps.model.CircleOptions;
    ^
    C:\Users\al\AppData\Local\Temp\And73E9.tmp\app\src \main\java\Extensions\CRunGMaps.java:39: error: package com.google.android.gms.maps.model does not exist
    import com.google.android.gms.maps.model.LatLng;
    ^
    C:\Users\al\AppData\Local\Temp\And73E9.tmp\app\src \main\java\Extensions\CRunGMaps.java:40: error: package com.google.android.gms.maps.model does not exist
    import com.google.android.gms.maps.model.Marker;
    ^
    C:\Users\al\AppData\Local\Temp\And73E9.tmp\app\src \main\java\Extensions\CRunGMaps.java:41: error: package com.google.android.gms.maps.model does not exist
    import com.google.android.gms.maps.model.MarkerOptions;
    ^
    C:\Users\al\AppData\Local\Temp\And73E9.tmp\app\src \main\java\Extensions\CRunGMaps.java:159: error: cannot find symbol
    private GoogleMap mMap;
    ^
    symbol: class GoogleMap
    location: class CRunGMaps
    C:\Users\al\AppData\Local\Temp\And73E9.tmp\app\src \main\java\Extensions\CRunGMaps.java:160: error: cannot find symbol
    private MapView mMapView;
    ^
    symbol: class MapView
    location: class CRunGMaps
    C:\Users\al\AppData\Local\Temp\And73E9.tmp\app\src \main\java\Extensions\CRunGMaps.java:162: error: cannot find symbol
    private GoogleMapOptions mMapOptions;
    ^
    symbol: class GoogleMapOptions
    location: class CRunGMaps
    C:\Users\al\AppData\Local\Temp\And73E9.tmp\app\src \main\java\Extensions\CRunGMaps.java:163: error: cannot find symbol
    private MapFragment mMapFrag = null;
    ^
    symbol: class MapFragment
    location: class CRunGMaps
    C:\Users\al\AppData\Local\Temp\And73E9.tmp\app\src \main\java\Extensions\CRunGMaps.java:164: error: cannot find symbol
    private CameraPosition mCamera;
    ^
    symbol: class CameraPosition
    location: class CRunGMaps
    C:\Users\al\AppData\Local\Temp\And73E9.tmp\app\src \main\java\Extensions\FollowMe.java:3: error: package com.google.android.gms.maps does not exist
    import com.google.android.gms.maps.LocationSource;
    ^
    C:\Users\al\AppData\Local\Temp\And73E9.tmp\app\src \main\java\Extensions\FollowMe.java:18: error: cannot find symbol
    public class FollowMe implements LocationSource, LocationListener {
    ^
    symbol: class LocationSource
    C:\Users\al\AppData\Local\Temp\And73E9.tmp\app\src \main\java\Extensions\CRunGMaps.java:195: error: cannot find symbol
    private Marker onMarker = null;
    ^
    symbol: class Marker
    location: class CRunGMaps
    C:\Users\al\AppData\Local\Temp\And73E9.tmp\app\src \main\java\Extensions\CRunGMaps.java:199: error: cannot find symbol
    private CameraPosition onCamera = null;
    ^
    symbol: class CameraPosition
    location: class CRunGMaps
    C:\Users\al\AppData\Local\Temp\And73E9.tmp\app\src \main\java\Extensions\CRunGMaps.java:200: error: cannot find symbol
    private CameraUpdate uCamera = null;
    ^
    symbol: class CameraUpdate
    location: class CRunGMaps
    C:\Users\al\AppData\Local\Temp\And73E9.tmp\app\src \main\java\Extensions\CRunGMaps.java:201: error: cannot find symbol
    private LatLng onPosition =null;
    ^
    symbol: class LatLng
    location: class CRunGMaps
    C:\Users\al\AppData\Local\Temp\And73E9.tmp\app\src \main\java\Extensions\CRunGMaps.java:208: error: cannot find symbol
    Map <Integer, Marker> Markers;
    ^
    symbol: class Marker
    location: class CRunGMaps
    C:\Users\al\AppData\Local\Temp\And73E9.tmp\app\src \main\java\Extensions\CRunGMaps.java:209: error: cannot find symbol
    Map <Integer, Circle> Circles;
    ^
    symbol: class Circle
    location: class CRunGMaps
    C:\Users\al\AppData\Local\Temp\And73E9.tmp\app\src \main\java\Extensions\CRunGMaps.java:424: error: cannot find symbol
    private void changeCamera(CameraUpdate update, int Duration, CancelableCallback callback) {
    ^
    symbol: class CameraUpdate
    location: class CRunGMaps
    C:\Users\al\AppData\Local\Temp\And73E9.tmp\app\src \main\java\Extensions\CRunGMaps.java:424: error: cannot find symbol
    private void changeCamera(CameraUpdate update, int Duration, CancelableCallback callback) {
    ^
    symbol: class CancelableCallback
    location: class CRunGMaps
    C:\Users\al\AppData\Local\Temp\And73E9.tmp\app\src \main\java\Extensions\CRunGMaps.java:569: error: cannot find symbol
    private double MarkersDistance(LatLng M1, LatLng M2)
    ^
    symbol: class LatLng
    location: class CRunGMaps
    C:\Users\al\AppData\Local\Temp\And73E9.tmp\app\src \main\java\Extensions\CRunGMaps.java:569: error: cannot find symbol
    private double MarkersDistance(LatLng M1, LatLng M2)
    ^
    symbol: class LatLng
    location: class CRunGMaps
    C:\Users\al\AppData\Local\Temp\And73E9.tmp\app\src \main\java\Extensions\CRunGMaps.java:1963: error: cannot find symbol
    private int GetDistance(LatLng src, LatLng dest, int mode) {
    ^
    symbol: class LatLng
    location: class CRunGMaps
    C:\Users\al\AppData\Local\Temp\And73E9.tmp\app\src \main\java\Extensions\CRunGMaps.java:1963: error: cannot find symbol
    private int GetDistance(LatLng src, LatLng dest, int mode) {
    ^
    symbol: class LatLng
    location: class CRunGMaps
    C:\Users\al\AppData\Local\Temp\And73E9.tmp\app\src \main\java\Extensions\CRunGMaps.java:254: error: cannot find symbol
    public Circle nCircle;
    ^
    symbol: class Circle
    location: class CRunGMaps.CircleX
    C:\Users\al\AppData\Local\Temp\And73E9.tmp\app\src \main\java\Extensions\CRunGMaps.java:243: error: cannot find symbol
    public Marker nMarker;
    ^
    symbol: class Marker
    location: class CRunGMaps.MarkerX
    C:\Users\al\AppData\Local\Temp\And73E9.tmp\app\src \main\java\Extensions\FollowMe.java:20: error: cannot find symbol
    public OnLocationChangedListener mListener;
    ^
    symbol: class OnLocationChangedListener
    location: class FollowMe
    C:\Users\al\AppData\Local\Temp\And73E9.tmp\app\src \main\java\Extensions\FollowMe.java:96: error: cannot find symbol
    public void activate(OnLocationChangedListener listener) {
    ^
    symbol: class OnLocationChangedListener
    location: class FollowMe
    C:\Users\al\AppData\Local\Temp\And73E9.tmp\app\src \main\java\Extensions\FollowMe.java:109: error: cannot find symbol
    public OnLocationChangedListener getListener() {
    ^
    symbol: class OnLocationChangedListener
    location: class FollowMe
    C:\Users\al\AppData\Local\Temp\And73E9.tmp\app\src \main\java\Extensions\CRunGMaps.java:270: error: cannot find symbol
    mMapFrag.getMapAsync(new OnMapReadyCallback()
    ^
    symbol: class OnMapReadyCallback
    C:\Users\al\AppData\Local\Temp\And73E9.tmp\app\src \main\java\Extensions\CRunGMaps.java:273: error: cannot find symbol
    public void onMapReady(GoogleMap map) {
    ^
    symbol: class GoogleMap
    C:\Users\al\AppData\Local\Temp\And73E9.tmp\app\src \main\java\Extensions\CRunGMaps.java:272: error: method does not override or implement a method from a supertype
    @Override
    ^
    C:\Users\al\AppData\Local\Temp\And73E9.tmp\app\src \main\java\Extensions\CRunGMaps.java:299: error: cannot find symbol
    mMap.setOnMapClickListener(new OnMapClickListener() {
    ^
    symbol: class OnMapClickListener
    location: class CRunGMaps
    C:\Users\al\AppData\Local\Temp\And73E9.tmp\app\src \main\java\Extensions\CRunGMaps.java:302: error: cannot find symbol
    public void onMapClick(LatLng position) {
    ^
    symbol: class LatLng
    C:\Users\al\AppData\Local\Temp\And73E9.tmp\app\src \main\java\Extensions\CRunGMaps.java:301: error: method does not override or implement a method from a supertype
    @Override
    ^
    C:\Users\al\AppData\Local\Temp\And73E9.tmp\app\src \main\java\Extensions\CRunGMaps.java:308: error: cannot find symbol
    mMap.setOnCameraChangeListener(new OnCameraChangeListener() {
    ^
    symbol: class OnCameraChangeListener
    location: class CRunGMaps
    C:\Users\al\AppData\Local\Temp\And73E9.tmp\app\src \main\java\Extensions\CRunGMaps.java:311: error: cannot find symbol
    public void onCameraChange(CameraPosition camera) {
    ^
    symbol: class CameraPosition
    C:\Users\al\AppData\Local\Temp\And73E9.tmp\app\src \main\java\Extensions\CRunGMaps.java:310: error: method does not override or implement a method from a supertype
    @Override
    ^
    C:\Users\al\AppData\Local\Temp\And73E9.tmp\app\src \main\java\Extensions\CRunGMaps.java:317: error: cannot find symbol
    mMap.setOnMarkerClickListener(new OnMarkerClickListener() {
    ^
    symbol: class OnMarkerClickListener
    location: class CRunGMaps
    C:\Users\al\AppData\Local\Temp\And73E9.tmp\app\src \main\java\Extensions\CRunGMaps.java:320: error: cannot find symbol
    public boolean onMarkerClick (Marker marker){
    ^
    symbol: class Marker
    C:\Users\al\AppData\Local\Temp\And73E9.tmp\app\src \main\java\Extensions\CRunGMaps.java:319: error: method does not override or implement a method from a supertype
    @Override
    ^
    C:\Users\al\AppData\Local\Temp\And73E9.tmp\app\src \main\java\Extensions\CRunGMaps.java:328: error: cannot find symbol
    mMap.setOnInfoWindowClickListener(new OnInfoWindowClickListener() {
    ^
    symbol: class OnInfoWindowClickListener
    location: class CRunGMaps
    C:\Users\al\AppData\Local\Temp\And73E9.tmp\app\src \main\java\Extensions\CRunGMaps.java:331: error: cannot find symbol
    public void onInfoWindowClick(Marker marker) {
    ^
    symbol: class Marker
    C:\Users\al\AppData\Local\Temp\And73E9.tmp\app\src \main\java\Extensions\CRunGMaps.java:330: error: method does not override or implement a method from a supertype
    @Override
    ^
    C:\Users\al\AppData\Local\Temp\And73E9.tmp\app\src \main\java\Extensions\CRunGMaps.java:337: error: cannot find symbol
    mMap.setOnMarkerDragListener(new OnMarkerDragListener() {
    ^
    symbol: class OnMarkerDragListener
    location: class CRunGMaps
    C:\Users\al\AppData\Local\Temp\And73E9.tmp\app\src \main\java\Extensions\CRunGMaps.java:340: error: cannot find symbol
    public void onMarkerDrag(Marker marker) {
    ^
    symbol: class Marker
    C:\Users\al\AppData\Local\Temp\And73E9.tmp\app\src \main\java\Extensions\CRunGMaps.java:345: error: cannot find symbol
    public void onMarkerDragStart(Marker marker) {
    ^
    symbol: class Marker
    C:\Users\al\AppData\Local\Temp\And73E9.tmp\app\src \main\java\Extensions\CRunGMaps.java:350: error: cannot find symbol
    public void onMarkerDragEnd(Marker marker) {
    ^
    symbol: class Marker
    C:\Users\al\AppData\Local\Temp\And73E9.tmp\app\src \main\java\Extensions\CRunGMaps.java:339: error: method does not override or implement a method from a supertype
    @Override
    ^
    C:\Users\al\AppData\Local\Temp\And73E9.tmp\app\src \main\java\Extensions\CRunGMaps.java:344: error: method does not override or implement a method from a supertype
    @Override
    ^
    C:\Users\al\AppData\Local\Temp\And73E9.tmp\app\src \main\java\Extensions\CRunGMaps.java:349: error: method does not override or implement a method from a supertype
    @Override
    ^
    C:\Users\al\AppData\Local\Temp\And73E9.tmp\app\src \main\java\Extensions\CRunGMaps.java:357: error: cannot find symbol
    mMap.setOnMyLocationChangeListener(new OnMyLocationChangeListener() {
    ^
    symbol: class OnMyLocationChangeListener
    location: class CRunGMaps
    C:\Users\al\AppData\Local\Temp\And73E9.tmp\app\src \main\java\Extensions\CRunGMaps.java:359: error: method does not override or implement a method from a supertype
    @Override
    ^
    C:\Users\al\AppData\Local\Temp\And73E9.tmp\app\src \main\java\Extensions\CRunGMaps.java:384: error: cannot find symbol
    MapsInitializer.initialize(MMFRuntime.inst);
    ^
    symbol: variable MapsInitializer
    location: class CRunGMaps
    C:\Users\al\AppData\Local\Temp\And73E9.tmp\app\src \main\java\Extensions\CRunGMaps.java:386: error: cannot find symbol
    mMapOptions = new GoogleMapOptions();
    ^
    symbol: class GoogleMapOptions
    location: class CRunGMaps
    C:\Users\al\AppData\Local\Temp\And73E9.tmp\app\src \main\java\Extensions\CRunGMaps.java:390: error: cannot find symbol
    mMapFrag = MapFragment.newInstance(mMapOptions);
    ^
    symbol: variable MapFragment
    location: class CRunGMaps
    C:\Users\al\AppData\Local\Temp\And73E9.tmp\app\src \main\java\Extensions\CRunGMaps.java:402: error: cannot find symbol
    mMapFrag.getMapAsync(new OnMapReadyCallback()
    ^
    symbol: class OnMapReadyCallback
    location: class CRunGMaps
    C:\Users\al\AppData\Local\Temp\And73E9.tmp\app\src \main\java\Extensions\CRunGMaps.java:405: error: cannot find symbol
    public void onMapReady(GoogleMap map) {
    ^
    symbol: class GoogleMap
    C:\Users\al\AppData\Local\Temp\And73E9.tmp\app\src \main\java\Extensions\CRunGMaps.java:404: error: method does not override or implement a method from a supertype
    @Override
    ^
    C:\Users\al\AppData\Local\Temp\And73E9.tmp\app\src \main\java\Extensions\CRunGMaps.java:433: error: cannot find symbol
    Circle lCircle = null;
    ^
    symbol: class Circle
    location: class CRunGMaps
    C:\Users\al\AppData\Local\Temp\And73E9.tmp\app\src \main\java\Extensions\CRunGMaps.java:434: error: cannot find symbol
    CircleOptions lCircleOpt = new CircleOptions()
    ^
    symbol: class CircleOptions
    location: class CRunGMaps
    C:\Users\al\AppData\Local\Temp\And73E9.tmp\app\src \main\java\Extensions\CRunGMaps.java:435: error: cannot find symbol
    .center(new LatLng(mCircle.Latitude, mCircle.Longitude))
    ^
    symbol: class LatLng
    location: class CRunGMaps
    C:\Users\al\AppData\Local\Temp\And73E9.tmp\app\src \main\java\Extensions\CRunGMaps.java:434: error: cannot find symbol
    CircleOptions lCircleOpt = new CircleOptions()
    ^
    symbol: class CircleOptions
    location: class CRunGMaps
    C:\Users\al\AppData\Local\Temp\And73E9.tmp\app\src \main\java\Extensions\CRunGMaps.java:446: error: cannot find symbol
    Marker lMarker = null;
    ^
    symbol: class Marker
    location: class CRunGMaps
    C:\Users\al\AppData\Local\Temp\And73E9.tmp\app\src \main\java\Extensions\CRunGMaps.java:447: error: cannot find symbol
    MarkerOptions lMarkerOpt = null;
    ^
    symbol: class MarkerOptions
    location: class CRunGMaps
    C:\Users\al\AppData\Local\Temp\And73E9.tmp\app\src \main\java\Extensions\CRunGMaps.java:456: error: cannot find symbol
    .icon(BitmapDescriptorFactory.defaultMarker(Bitmap DescriptorFactory.HUE_RED));
    ^
    symbol: variable BitmapDescriptorFactory
    location: class CRunGMaps
    C:\Users\al\AppData\Local\Temp\And73E9.tmp\app\src \main\java\Extensions\CRunGMaps.java:456: error: cannot find symbol
    .icon(BitmapDescriptorFactory.defaultMarker(Bitmap DescriptorFactory.HUE_RED));
    ^
    symbol: variable BitmapDescriptorFactory
    location: class CRunGMaps
    C:\Users\al\AppData\Local\Temp\And73E9.tmp\app\src \main\java\Extensions\CRunGMaps.java:451: error: cannot find symbol
    .position(new LatLng(mMarker.Latitude, mMarker.Longitude))
    ^
    symbol: class LatLng
    location: class CRunGMaps
    C:\Users\al\AppData\Local\Temp\And73E9.tmp\app\src \main\java\Extensions\CRunGMaps.java:450: error: cannot find symbol
    lMarkerOpt = new MarkerOptions()
    ^
    symbol: class MarkerOptions
    location: class CRunGMaps
    C:\Users\al\AppData\Local\Temp\And73E9.tmp\app\src \main\java\Extensions\CRunGMaps.java:464: error: cannot find symbol
    .icon(BitmapDescriptorFactory.defaultMarker(color) );
    ^
    symbol: variable BitmapDescriptorFactory
    location: class CRunGMaps
    C:\Users\al\AppData\Local\Temp\And73E9.tmp\app\src \main\java\Extensions\CRunGMaps.java:459: error: cannot find symbol
    .position(new LatLng(mMarker.Latitude, mMarker.Longitude))
    ^
    symbol: class LatLng
    location: class CRunGMaps
    C:\Users\al\AppData\Local\Temp\And73E9.tmp\app\src \main\java\Extensions\CRunGMaps.java:458: error: cannot find symbol
    lMarkerOpt = new MarkerOptions()
    ^
    symbol: class MarkerOptions
    location: class CRunGMaps
    C:\Users\al\AppData\Local\Temp\And73E9.tmp\app\src \main\java\Extensions\CRunGMaps.java:507: error: cannot find symbol
    .icon(BitmapDescriptorFactory.fromBitmap(image));
    ^
    symbol: variable BitmapDescriptorFactory
    location: class CRunGMaps
    C:\Users\al\AppData\Local\Temp\And73E9.tmp\app\src \main\java\Extensions\CRunGMaps.java:501: error: cannot find symbol
    .position(new LatLng(mMarker.Latitude, mMarker.Longitude))
    ^
    symbol: class LatLng
    location: class CRunGMaps
    C:\Users\al\AppData\Local\Temp\And73E9.tmp\app\src \main\java\Extensions\CRunGMaps.java:500: error: cannot find symbol
    lMarkerOpt = new MarkerOptions()
    ^
    symbol: class MarkerOptions
    location: class CRunGMaps
    C:\Users\al\AppData\Local\Temp\And73E9.tmp\app\src \main\java\Extensions\CRunGMaps.java:543: error: cannot find symbol
    for(Entry<Integer, Marker> m : Markers.entrySet()) {
    ^
    symbol: class Marker
    location: class CRunGMaps
    C:\Users\al\AppData\Local\Temp\And73E9.tmp\app\src \main\java\Extensions\CRunGMaps.java:547: error: cannot find symbol
    Marker xMarker = m.getValue();
    ^
    symbol: class Marker
    location: class CRunGMaps
    C:\Users\al\AppData\Local\Temp\And73E9.tmp\app\src \main\java\Extensions\CRunGMaps.java:556: error: cannot find symbol
    for(Entry<Integer, Circle> m : Circles.entrySet()) {
    ^
    symbol: class Circle
    location: class CRunGMaps
    C:\Users\al\AppData\Local\Temp\And73E9.tmp\app\src \main\java\Extensions\CRunGMaps.java:560: error: cannot find symbol
    Circle xCircle = m.getValue();
    ^
    symbol: class Circle
    location: class CRunGMaps
    C:\Users\al\AppData\Local\Temp\And73E9.tmp\app\src \main\java\Extensions\CRunGMaps.java:576: error: illegal parenthesized expression
    Math.cos((M1.latitude)*Math.PI/180) *
    ^
    C:\Users\al\AppData\Local\Temp\And73E9.tmp\app\src \main\java\Extensions\CRunGMaps.java:577: error: illegal parenthesized expression
    Math.cos((M2.latitude)*Math.PI/180) *
    ^
    C:\Users\al\AppData\Local\Temp\And73E9.tmp\app\src \main\java\Extensions\CRunGMaps.java:621: error: cannot find symbol
    Markers = new HashMap<Integer, Marker> ();
    ^
    symbol: class Marker
    location: class CRunGMaps
    C:\Users\al\AppData\Local\Temp\And73E9.tmp\app\src \main\java\Extensions\CRunGMaps.java:622: error: cannot find symbol
    Circles = new HashMap<Integer, Circle> ();
    ^
    symbol: class Circle
    location: class CRunGMaps
    Note: Some input files use or override a deprecated API.
    Note: Recompile with -Xlint:deprecation for details.
    Note: Some input files use unchecked or unsafe operations.
    Note: Recompile with -Xlint:unchecked for details.
    100 errors

    FAILURE: Build failed with an exception.

    * What went wrong:
    Execution failed for task ':app:compileDebugJavaWithJavac'.
    > Compilation failed; see the compiler error output for details.

    * Try:
    Run with --stacktrace option to get the stack trace. Run with --info or --debug option to get more log output. Run with --scan to get full insights.

    * Get more help at https://help.gradle.org

    Deprecated Gradle features were used in this build, making it incompatible with Gradle 6.0.
    Use '--warning-mode all' to show the individual deprecation warnings.
    See https://docs.gradle.org/5.1.1/usergu..._line_warnings

    BUILD FAILED in 4s
    12 actionable tasks: 12 executed

  7. #157
    Clicker Fusion 2.5 (Steam)Fusion 2.5 Developer (Steam)Android Export Module (Steam)HTML5 Export Module (Steam)iOS Export Module (Steam)Universal Windows Platform Export Module (Steam)
    Lecherbault's Avatar
    Join Date
    Jul 2016
    Posts
    137
    Mentioned
    7 Post(s)
    Tagged
    0 Thread(s)
    Quote Originally Posted by Fernando View Post
    sorry to reask, please post all version java sdk version and update

    does the preferences are updates and pointing to the correct locations
    When I delete "Location.mfx" AND "GMaps.mfx", it compiles. It's better...
    Problem with these extensions, but even if I update, it does not work

  8. #158
    Clicker Fusion 2.5
    Fusion 2.5 (Steam)Fusion 2.5 Developer (Steam)Android Export Module (Steam)

    Join Date
    Nov 2014
    Posts
    62
    Mentioned
    5 Post(s)
    Tagged
    0 Thread(s)
    I'm not understanding why it would reflect me having installed the 32-bit Java, when it is definitely the 64-bit version. I have even uninstalled the older versions of the 64-bit, in case that was posing a problem.

    deezjavas.jpg


    C:\Users\al\AppData\Local\Temp\And9F46.tmp\app\src \main\java\Extensions\CRunGMaps.java:20: error: package com.google.android.gms.maps does not exist
    import com.google.android.gms.maps.CameraUpdate;
    ^
    GMaps as in Google Maps, yes?

    @Fernando

    Is this some type of issue pertaining to Google-related extensions? Because the Google Play Games object seems to be the exact thing that is hanging up my export attempt. I exported a completely separate project sans the GPG object and it saved as an APK with no issue.

  9. #159
    Clicker Fusion 2.5
    Fusion 2.5 (Steam)Fusion 2.5 Developer (Steam)Android Export Module (Steam)

    Join Date
    Nov 2014
    Posts
    62
    Mentioned
    5 Post(s)
    Tagged
    0 Thread(s)
    Quote Originally Posted by Fernando View Post
    sorry to reask, please post all version java sdk version and update

    does the preferences are updates and pointing to the correct locations
    yes sir

    Not sure it will help, but here's proof...?

    android_sdk_folder.pnggeneral pref.pngjava folder.png

  10. #160
    Clicker Fusion 2.5 (Steam)Fusion 2.5 Developer (Steam)Android Export Module (Steam)HTML5 Export Module (Steam)iOS Export Module (Steam)Universal Windows Platform Export Module (Steam)
    Lecherbault's Avatar
    Join Date
    Jul 2016
    Posts
    137
    Mentioned
    7 Post(s)
    Tagged
    0 Thread(s)
    Quote Originally Posted by Fernando View Post
    sorry to reask, please post all version java sdk version and update

    does the preferences are updates and pointing to the correct locations
    maybe it can help you?
    gradle.jpg

Page 16 of 22 FirstFirst ... 6 14 15 16 17 18 ... LastLast

Similar Threads

  1. Users that cannot build with Android Studio (ant\build.xml error)
    By Perry in forum Android Export Module 2.5
    Replies: 77
    Last Post: 16th October 2018, 02:17 PM
  2. Replies: 56
    Last Post: 26th December 2017, 08:53 PM
  3. Cannot build my Android app (ant/build.xml error)
    By oaklan5 in forum Fusion 2.5
    Replies: 1
    Last Post: 27th July 2017, 06:59 PM
  4. Replies: 15
    Last Post: 27th November 2014, 10:08 AM

Posting Permissions

  • You may not post new threads
  • You may not post replies
  • You may not post attachments
  • You may not edit your posts
  •