User Tag List

Page 19 of 22 FirstFirst ... 9 17 18 19 20 21 ... LastLast
Results 181 to 190 of 212

Thread: Android Runtime - Build 292

  1. #181
    Clicker Fusion 2.5 (Steam)Fusion 2.5 Developer (Steam)Android Export Module (Steam)HTML5 Export Module (Steam)iOS Export Module (Steam)Universal Windows Platform Export Module (Steam)
    Lecherbault's Avatar
    Join Date
    Jul 2016
    Posts
    137
    Mentioned
    7 Post(s)
    Tagged
    0 Thread(s)
    Quote Originally Posted by Fernando View Post
    not sure why you can not build there with this object.

    just build again to test here and is working, something is blocking this lib to be downloaded

    not sure what is happening

    check that you have access to

    https://mvnrepository.com/artifact/com.android.tools.build/gradle

    https://dl.google.com/dl/android/maven2/index.html

    https://jcenter.bintray.com/

    https://services.gradle.org/distributions/
    I have access to all urls...

  2. #182
    Clicker Fusion 2.5 (Steam)Fusion 2.5 Developer (Steam)Android Export Module (Steam)HTML5 Export Module (Steam)iOS Export Module (Steam)Universal Windows Platform Export Module (Steam)
    Lecherbault's Avatar
    Join Date
    Jul 2016
    Posts
    137
    Mentioned
    7 Post(s)
    Tagged
    0 Thread(s)
    Quote Originally Posted by Perry View Post
    Maybe it's time for a clean new install of Fusion..
    Something is not right on your system
    With Steam, how can i reinstall fusion and all export plugin i have?

  3. #183
    Clicker Fusion 2.5 (Steam)Fusion 2.5 Developer (Steam)Android Export Module (Steam)HTML5 Export Module (Steam)iOS Export Module (Steam)Universal Windows Platform Export Module (Steam)
    Lecherbault's Avatar
    Join Date
    Jul 2016
    Posts
    137
    Mentioned
    7 Post(s)
    Tagged
    0 Thread(s)
    Quote Originally Posted by Fernando View Post
    not sure why you can not build there with this object.

    just build again to test here and is working, something is blocking this lib to be downloaded

    not sure what is happening

    check that you have access to

    https://mvnrepository.com/artifact/com.android.tools.build/gradle

    https://dl.google.com/dl/android/maven2/index.html

    https://jcenter.bintray.com/

    https://services.gradle.org/distributions/
    I do not think it comes from the compliant installation of mmf2.5, but probably from Google Play services that would not be installed in ANdroid Studio, right?

  4. #184
    Clicker Fusion 2.5 (Steam)Fusion 2.5 Developer (Steam)Android Export Module (Steam)HTML5 Export Module (Steam)iOS Export Module (Steam)Universal Windows Platform Export Module (Steam)
    Lecherbault's Avatar
    Join Date
    Jul 2016
    Posts
    137
    Mentioned
    7 Post(s)
    Tagged
    0 Thread(s)
    Quote Originally Posted by Perry View Post
    Maybe it's time for a clean new install of Fusion..
    Something is not right on your system
    I do not think it comes from the compliant installation of mmf2.5, but probably from Google Play services that would not be installed in ANdroid Studio, no?

  5. #185
    Forum Moderator

    Fusion 2.5 MacFusion 2.5 DeveloperFusion 2.5+ DLCAndroid Export ModuleHTML5 Export ModuleiOS Export ModuleUniversal Windows Platform Export ModuleSWF Export ModuleMac Export ModuleInstall Creator Pro
    Fusion 2.5 (Steam)Fusion 2.5 Developer (Steam)Android Export Module (Steam)HTML5 Export Module (Steam)iOS Export Module (Steam)
    Perry's Avatar
    Join Date
    Dec 2013
    Location
    Watertown, WI
    Posts
    4,336
    Mentioned
    49 Post(s)
    Tagged
    0 Thread(s)
    ok, I tried it with the latest build, and there is indeed an error now

    Deprecated Gradle features were used in this build, making it incompatible with Gradle 6.0.

    and the same Gmaps error with Google Maps

    Game center works fine.

    Using 292.11 Non Steam version

  6. #186
    Forum Moderator

    Fusion 2.5 MacFusion 2.5 DeveloperFusion 2.5+ DLCAndroid Export ModuleHTML5 Export ModuleiOS Export ModuleUniversal Windows Platform Export ModuleSWF Export ModuleMac Export ModuleInstall Creator Pro
    Fusion 2.5 (Steam)Fusion 2.5 Developer (Steam)Android Export Module (Steam)HTML5 Export Module (Steam)iOS Export Module (Steam)
    Perry's Avatar
    Join Date
    Dec 2013
    Location
    Watertown, WI
    Posts
    4,336
    Mentioned
    49 Post(s)
    Tagged
    0 Thread(s)
    > Configure project :
    it is windows 10

    > Task :app:preBuild UP-TO-DATE
    > Task :app:preDebugBuild
    > Task :app:compileDebugAidl NO-SOURCE
    > Task :app:compileDebugRenderscript NO-SOURCE
    > Task :app:checkDebugManifest
    > Task :app:generateDebugBuildConfig
    > Task :app:prepareLintJar
    > Task :app:generateDebugSources
    > Task :app:javaPreCompileDebug
    > Task :app:mainApkListPersistenceDebug
    > Task :app:generateDebugResValues
    > Task :app:generateDebugResources
    > Task :app:mergeDebugResources
    > Task :app:createDebugCompatibleScreenManifests
    > Task :app:processDebugManifest
    > Task :app:processDebugResources

    > Task :app:compileDebugJavaWithJavac FAILED
    C:\Users\Perry\AppData\Local\Temp\And7510.tmp\app\ src\main\java\Extensions\CRunGMaps.java:20: error: package com.google.android.gms.common does not exist
    import com.google.android.gms.common.GooglePlayServicesUt il;
    ^
    C:\Users\Perry\AppData\Local\Temp\And7510.tmp\app\ src\main\java\Extensions\CRunGMaps.java:21: error: package com.google.android.gms.maps does not exist
    import com.google.android.gms.maps.CameraUpdate;
    ^
    C:\Users\Perry\AppData\Local\Temp\And7510.tmp\app\ src\main\java\Extensions\CRunGMaps.java:22: error: package com.google.android.gms.maps does not exist
    import com.google.android.gms.maps.CameraUpdateFactory;
    ^
    C:\Users\Perry\AppData\Local\Temp\And7510.tmp\app\ src\main\java\Extensions\CRunGMaps.java:23: error: package com.google.android.gms.maps does not exist
    import com.google.android.gms.maps.GoogleMap;
    ^
    C:\Users\Perry\AppData\Local\Temp\And7510.tmp\app\ src\main\java\Extensions\CRunGMaps.java:24: error: package com.google.android.gms.maps.GoogleMap does not exist
    import com.google.android.gms.maps.GoogleMap.CancelableCa llback;
    ^
    C:\Users\Perry\AppData\Local\Temp\And7510.tmp\app\ src\main\java\Extensions\CRunGMaps.java:25: error: package com.google.android.gms.maps.GoogleMap does not exist
    import com.google.android.gms.maps.GoogleMap.OnCameraChan geListener;
    ^
    C:\Users\Perry\AppData\Local\Temp\And7510.tmp\app\ src\main\java\Extensions\CRunGMaps.java:26: error: package com.google.android.gms.maps.GoogleMap does not exist
    import com.google.android.gms.maps.GoogleMap.OnInfoWindow ClickListener;
    ^
    C:\Users\Perry\AppData\Local\Temp\And7510.tmp\app\ src\main\java\Extensions\CRunGMaps.java:27: error: package com.google.android.gms.maps.GoogleMap does not exist
    import com.google.android.gms.maps.GoogleMap.OnMapClickLi stener;
    ^
    C:\Users\Perry\AppData\Local\Temp\And7510.tmp\app\ src\main\java\Extensions\CRunGMaps.java:28: error: package com.google.android.gms.maps.GoogleMap does not exist
    import com.google.android.gms.maps.GoogleMap.OnMarkerClic kListener;
    ^
    C:\Users\Perry\AppData\Local\Temp\And7510.tmp\app\ src\main\java\Extensions\CRunGMaps.java:29: error: package com.google.android.gms.maps.GoogleMap does not exist
    import com.google.android.gms.maps.GoogleMap.OnMarkerDrag Listener;
    ^
    C:\Users\Perry\AppData\Local\Temp\And7510.tmp\app\ src\main\java\Extensions\CRunGMaps.java:30: error: package com.google.android.gms.maps.GoogleMap does not exist
    import com.google.android.gms.maps.GoogleMap.OnMyLocation ChangeListener;
    ^
    C:\Users\Perry\AppData\Local\Temp\And7510.tmp\app\ src\main\java\Extensions\CRunGMaps.java:31: error: package com.google.android.gms.maps does not exist
    import com.google.android.gms.maps.GoogleMapOptions;
    ^
    C:\Users\Perry\AppData\Local\Temp\And7510.tmp\app\ src\main\java\Extensions\CRunGMaps.java:32: error: package com.google.android.gms.maps does not exist
    import com.google.android.gms.maps.MapFragment;
    ^
    C:\Users\Perry\AppData\Local\Temp\And7510.tmp\app\ src\main\java\Extensions\CRunGMaps.java:33: error: package com.google.android.gms.maps does not exist
    import com.google.android.gms.maps.MapView;
    ^
    C:\Users\Perry\AppData\Local\Temp\And7510.tmp\app\ src\main\java\Extensions\CRunGMaps.java:34: error: package com.google.android.gms.maps does not exist
    import com.google.android.gms.maps.MapsInitializer;
    ^
    C:\Users\Perry\AppData\Local\Temp\And7510.tmp\app\ src\main\java\Extensions\CRunGMaps.java:35: error: package com.google.android.gms.maps.model does not exist
    import com.google.android.gms.maps.model.BitmapDescriptor Factory;
    ^
    C:\Users\Perry\AppData\Local\Temp\And7510.tmp\app\ src\main\java\Extensions\CRunGMaps.java:36: error: package com.google.android.gms.maps.model does not exist
    import com.google.android.gms.maps.model.CameraPosition;
    ^
    C:\Users\Perry\AppData\Local\Temp\And7510.tmp\app\ src\main\java\Extensions\CRunGMaps.java:37: error: package com.google.android.gms.maps.model does not exist
    import com.google.android.gms.maps.model.Circle;
    ^
    C:\Users\Perry\AppData\Local\Temp\And7510.tmp\app\ src\main\java\Extensions\CRunGMaps.java:38: error: package com.google.android.gms.maps.model does not exist
    import com.google.android.gms.maps.model.CircleOptions;
    ^
    C:\Users\Perry\AppData\Local\Temp\And7510.tmp\app\ src\main\java\Extensions\CRunGMaps.java:39: error: package com.google.android.gms.maps.model does not exist
    import com.google.android.gms.maps.model.LatLng;
    ^
    C:\Users\Perry\AppData\Local\Temp\And7510.tmp\app\ src\main\java\Extensions\CRunGMaps.java:40: error: package com.google.android.gms.maps.model does not exist
    import com.google.android.gms.maps.model.Marker;
    ^
    C:\Users\Perry\AppData\Local\Temp\And7510.tmp\app\ src\main\java\Extensions\CRunGMaps.java:41: error: package com.google.android.gms.maps.model does not exist
    import com.google.android.gms.maps.model.MarkerOptions;
    ^
    C:\Users\Perry\AppData\Local\Temp\And7510.tmp\app\ src\main\java\Extensions\CRunGMaps.java:159: error: cannot find symbol
    private GoogleMap mMap;
    ^
    symbol: class GoogleMap
    location: class CRunGMaps
    C:\Users\Perry\AppData\Local\Temp\And7510.tmp\app\ src\main\java\Extensions\CRunGMaps.java:160: error: cannot find symbol
    private MapView mMapView;
    ^
    symbol: class MapView
    location: class CRunGMaps
    C:\Users\Perry\AppData\Local\Temp\And7510.tmp\app\ src\main\java\Extensions\CRunGMaps.java:162: error: cannot find symbol
    private GoogleMapOptions mMapOptions;
    ^
    symbol: class GoogleMapOptions
    location: class CRunGMaps
    C:\Users\Perry\AppData\Local\Temp\And7510.tmp\app\ src\main\java\Extensions\CRunGMaps.java:163: error: cannot find symbol
    private MapFragment mMapFrag = null;
    ^
    symbol: class MapFragment
    location: class CRunGMaps
    C:\Users\Perry\AppData\Local\Temp\And7510.tmp\app\ src\main\java\Extensions\CRunGMaps.java:164: error: cannot find symbol
    private CameraPosition mCamera;
    ^
    symbol: class CameraPosition
    location: class CRunGMaps
    C:\Users\Perry\AppData\Local\Temp\And7510.tmp\app\ src\main\java\Extensions\FollowMe.java:3: error: package com.google.android.gms.maps does not exist
    import com.google.android.gms.maps.LocationSource;
    ^
    C:\Users\Perry\AppData\Local\Temp\And7510.tmp\app\ src\main\java\Extensions\FollowMe.java:18: error: cannot find symbol
    public class FollowMe implements LocationSource, LocationListener {
    ^
    symbol: class LocationSource
    C:\Users\Perry\AppData\Local\Temp\And7510.tmp\app\ src\main\java\Extensions\CRunGMaps.java:195: error: cannot find symbol
    private Marker onMarker = null;
    ^
    symbol: class Marker
    location: class CRunGMaps
    C:\Users\Perry\AppData\Local\Temp\And7510.tmp\app\ src\main\java\Extensions\CRunGMaps.java:199: error: cannot find symbol
    private CameraPosition onCamera = null;
    ^
    symbol: class CameraPosition
    location: class CRunGMaps
    C:\Users\Perry\AppData\Local\Temp\And7510.tmp\app\ src\main\java\Extensions\CRunGMaps.java:200: error: cannot find symbol
    private CameraUpdate uCamera = null;
    ^
    symbol: class CameraUpdate
    location: class CRunGMaps
    C:\Users\Perry\AppData\Local\Temp\And7510.tmp\app\ src\main\java\Extensions\CRunGMaps.java:201: error: cannot find symbol
    private LatLng onPosition =null;
    ^
    symbol: class LatLng
    location: class CRunGMaps
    C:\Users\Perry\AppData\Local\Temp\And7510.tmp\app\ src\main\java\Extensions\CRunGMaps.java:208: error: cannot find symbol
    Map <Integer, Marker> Markers;
    ^
    symbol: class Marker
    location: class CRunGMaps
    C:\Users\Perry\AppData\Local\Temp\And7510.tmp\app\ src\main\java\Extensions\CRunGMaps.java:209: error: cannot find symbol
    Map <Integer, Circle> Circles;
    ^
    symbol: class Circle
    location: class CRunGMaps
    C:\Users\Perry\AppData\Local\Temp\And7510.tmp\app\ src\main\java\Extensions\CRunGMaps.java:402: error: cannot find symbol
    private void changeCamera(CameraUpdate update, int Duration, CancelableCallback callback) {
    ^
    symbol: class CameraUpdate
    location: class CRunGMaps
    C:\Users\Perry\AppData\Local\Temp\And7510.tmp\app\ src\main\java\Extensions\CRunGMaps.java:402: error: cannot find symbol
    private void changeCamera(CameraUpdate update, int Duration, CancelableCallback callback) {
    ^
    symbol: class CancelableCallback
    location: class CRunGMaps
    C:\Users\Perry\AppData\Local\Temp\And7510.tmp\app\ src\main\java\Extensions\CRunGMaps.java:543: error: cannot find symbol
    private double MarkersDistance(LatLng M1, LatLng M2)
    ^
    symbol: class LatLng
    location: class CRunGMaps
    C:\Users\Perry\AppData\Local\Temp\And7510.tmp\app\ src\main\java\Extensions\CRunGMaps.java:543: error: cannot find symbol
    private double MarkersDistance(LatLng M1, LatLng M2)
    ^
    symbol: class LatLng
    location: class CRunGMaps
    C:\Users\Perry\AppData\Local\Temp\And7510.tmp\app\ src\main\java\Extensions\CRunGMaps.java:1919: error: cannot find symbol
    private int GetDistance(LatLng src, LatLng dest, int mode) {
    ^
    symbol: class LatLng
    location: class CRunGMaps
    C:\Users\Perry\AppData\Local\Temp\And7510.tmp\app\ src\main\java\Extensions\CRunGMaps.java:1919: error: cannot find symbol
    private int GetDistance(LatLng src, LatLng dest, int mode) {
    ^
    symbol: class LatLng
    location: class CRunGMaps
    C:\Users\Perry\AppData\Local\Temp\And7510.tmp\app\ src\main\java\Extensions\FollowMe.java:20: error: cannot find symbol
    public OnLocationChangedListener mListener;
    ^
    symbol: class OnLocationChangedListener
    location: class FollowMe
    C:\Users\Perry\AppData\Local\Temp\And7510.tmp\app\ src\main\java\Extensions\FollowMe.java:94: error: cannot find symbol
    public void activate(OnLocationChangedListener listener) {
    ^
    symbol: class OnLocationChangedListener
    location: class FollowMe
    C:\Users\Perry\AppData\Local\Temp\And7510.tmp\app\ src\main\java\Extensions\FollowMe.java:107: error: cannot find symbol
    public OnLocationChangedListener getListener() {
    ^
    symbol: class OnLocationChangedListener
    location: class FollowMe
    C:\Users\Perry\AppData\Local\Temp\And7510.tmp\app\ src\main\java\Extensions\CRunGMaps.java:243: error: cannot find symbol
    public Marker nMarker;
    ^
    symbol: class Marker
    location: class CRunGMaps.MarkerX
    C:\Users\Perry\AppData\Local\Temp\And7510.tmp\app\ src\main\java\Extensions\CRunGMaps.java:254: error: cannot find symbol
    public Circle nCircle;
    ^
    symbol: class Circle
    location: class CRunGMaps.CircleX
    C:\Users\Perry\AppData\Local\Temp\And7510.tmp\app\ src\main\java\Extensions\CRunGMaps.java:293: error: cannot find symbol
    mMap.setOnMapClickListener(new OnMapClickListener() {
    ^
    symbol: class OnMapClickListener
    location: class CRunGMaps
    C:\Users\Perry\AppData\Local\Temp\And7510.tmp\app\ src\main\java\Extensions\CRunGMaps.java:302: error: cannot find symbol
    mMap.setOnCameraChangeListener(new OnCameraChangeListener() {
    ^
    symbol: class OnCameraChangeListener
    location: class CRunGMaps
    C:\Users\Perry\AppData\Local\Temp\And7510.tmp\app\ src\main\java\Extensions\CRunGMaps.java:311: error: cannot find symbol
    mMap.setOnMarkerClickListener(new OnMarkerClickListener() {
    ^
    symbol: class OnMarkerClickListener
    location: class CRunGMaps
    C:\Users\Perry\AppData\Local\Temp\And7510.tmp\app\ src\main\java\Extensions\CRunGMaps.java:322: error: cannot find symbol
    mMap.setOnInfoWindowClickListener(new OnInfoWindowClickListener() {
    ^
    symbol: class OnInfoWindowClickListener
    location: class CRunGMaps
    C:\Users\Perry\AppData\Local\Temp\And7510.tmp\app\ src\main\java\Extensions\CRunGMaps.java:331: error: cannot find symbol
    mMap.setOnMarkerDragListener(new OnMarkerDragListener() {
    ^
    symbol: class OnMarkerDragListener
    location: class CRunGMaps
    C:\Users\Perry\AppData\Local\Temp\And7510.tmp\app\ src\main\java\Extensions\CRunGMaps.java:351: error: cannot find symbol
    mMap.setOnMyLocationChangeListener(new OnMyLocationChangeListener() {
    ^
    symbol: class OnMyLocationChangeListener
    location: class CRunGMaps
    C:\Users\Perry\AppData\Local\Temp\And7510.tmp\app\ src\main\java\Extensions\CRunGMaps.java:368: error: cannot find symbol
    MapsInitializer.initialize(MMFRuntime.inst);
    ^
    symbol: variable MapsInitializer
    location: class CRunGMaps
    C:\Users\Perry\AppData\Local\Temp\And7510.tmp\app\ src\main\java\Extensions\CRunGMaps.java:370: error: cannot find symbol
    mMapOptions = new GoogleMapOptions();
    ^
    symbol: class GoogleMapOptions
    location: class CRunGMaps
    C:\Users\Perry\AppData\Local\Temp\And7510.tmp\app\ src\main\java\Extensions\CRunGMaps.java:374: error: cannot find symbol
    mMapFrag = MapFragment.newInstance(mMapOptions);
    ^
    symbol: variable MapFragment
    location: class CRunGMaps
    C:\Users\Perry\AppData\Local\Temp\And7510.tmp\app\ src\main\java\Extensions\CRunGMaps.java:411: error: cannot find symbol
    Circle lCircle = null;
    ^
    symbol: class Circle
    location: class CRunGMaps
    C:\Users\Perry\AppData\Local\Temp\And7510.tmp\app\ src\main\java\Extensions\CRunGMaps.java:412: error: cannot find symbol
    CircleOptions lCircleOpt = new CircleOptions()
    ^
    symbol: class CircleOptions
    location: class CRunGMaps
    C:\Users\Perry\AppData\Local\Temp\And7510.tmp\app\ src\main\java\Extensions\CRunGMaps.java:413: error: cannot find symbol
    .center(new LatLng(mCircle.Latitude, mCircle.Longitude))
    ^
    symbol: class LatLng
    location: class CRunGMaps
    C:\Users\Perry\AppData\Local\Temp\And7510.tmp\app\ src\main\java\Extensions\CRunGMaps.java:412: error: cannot find symbol
    CircleOptions lCircleOpt = new CircleOptions()
    ^
    symbol: class CircleOptions
    location: class CRunGMaps
    C:\Users\Perry\AppData\Local\Temp\And7510.tmp\app\ src\main\java\Extensions\CRunGMaps.java:424: error: cannot find symbol
    Marker lMarker = null;
    ^
    symbol: class Marker
    location: class CRunGMaps
    C:\Users\Perry\AppData\Local\Temp\And7510.tmp\app\ src\main\java\Extensions\CRunGMaps.java:425: error: cannot find symbol
    MarkerOptions lMarkerOpt = null;
    ^
    symbol: class MarkerOptions
    location: class CRunGMaps
    C:\Users\Perry\AppData\Local\Temp\And7510.tmp\app\ src\main\java\Extensions\CRunGMaps.java:434: error: cannot find symbol
    .icon(BitmapDescriptorFactory.defaultMarker(Bitmap DescriptorFactory.HUE_RED));
    ^
    symbol: variable BitmapDescriptorFactory
    location: class CRunGMaps
    C:\Users\Perry\AppData\Local\Temp\And7510.tmp\app\ src\main\java\Extensions\CRunGMaps.java:434: error: cannot find symbol
    .icon(BitmapDescriptorFactory.defaultMarker(Bitmap DescriptorFactory.HUE_RED));
    ^
    symbol: variable BitmapDescriptorFactory
    location: class CRunGMaps
    C:\Users\Perry\AppData\Local\Temp\And7510.tmp\app\ src\main\java\Extensions\CRunGMaps.java:429: error: cannot find symbol
    .position(new LatLng(mMarker.Latitude, mMarker.Longitude))
    ^
    symbol: class LatLng
    location: class CRunGMaps
    C:\Users\Perry\AppData\Local\Temp\And7510.tmp\app\ src\main\java\Extensions\CRunGMaps.java:428: error: cannot find symbol
    lMarkerOpt = new MarkerOptions()
    ^
    symbol: class MarkerOptions
    location: class CRunGMaps
    C:\Users\Perry\AppData\Local\Temp\And7510.tmp\app\ src\main\java\Extensions\CRunGMaps.java:442: error: cannot find symbol
    .icon(BitmapDescriptorFactory.defaultMarker(color) );
    ^
    symbol: variable BitmapDescriptorFactory
    location: class CRunGMaps
    C:\Users\Perry\AppData\Local\Temp\And7510.tmp\app\ src\main\java\Extensions\CRunGMaps.java:437: error: cannot find symbol
    .position(new LatLng(mMarker.Latitude, mMarker.Longitude))
    ^
    symbol: class LatLng
    location: class CRunGMaps
    C:\Users\Perry\AppData\Local\Temp\And7510.tmp\app\ src\main\java\Extensions\CRunGMaps.java:436: error: cannot find symbol
    lMarkerOpt = new MarkerOptions()
    ^
    symbol: class MarkerOptions
    location: class CRunGMaps
    C:\Users\Perry\AppData\Local\Temp\And7510.tmp\app\ src\main\java\Extensions\CRunGMaps.java:485: error: cannot find symbol
    .icon(BitmapDescriptorFactory.fromBitmap(image));
    ^
    symbol: variable BitmapDescriptorFactory
    location: class CRunGMaps
    C:\Users\Perry\AppData\Local\Temp\And7510.tmp\app\ src\main\java\Extensions\CRunGMaps.java:479: error: cannot find symbol
    .position(new LatLng(mMarker.Latitude, mMarker.Longitude))
    ^
    symbol: class LatLng
    location: class CRunGMaps
    C:\Users\Perry\AppData\Local\Temp\And7510.tmp\app\ src\main\java\Extensions\CRunGMaps.java:478: error: cannot find symbol
    lMarkerOpt = new MarkerOptions()
    ^
    symbol: class MarkerOptions
    location: class CRunGMaps
    C:\Users\Perry\AppData\Local\Temp\And7510.tmp\app\ src\main\java\Extensions\CRunGMaps.java:521: error: cannot find symbol
    for(Entry<Integer, Marker> m : Markers.entrySet()) {
    ^
    symbol: class Marker
    location: class CRunGMaps
    C:\Users\Perry\AppData\Local\Temp\And7510.tmp\app\ src\main\java\Extensions\CRunGMaps.java:523: error: cannot find symbol
    Marker xMarker = m.getValue();
    ^
    symbol: class Marker
    location: class CRunGMaps
    C:\Users\Perry\AppData\Local\Temp\And7510.tmp\app\ src\main\java\Extensions\CRunGMaps.java:532: error: cannot find symbol
    for(Entry<Integer, Circle> m : Circles.entrySet()) {
    ^
    symbol: class Circle
    location: class CRunGMaps
    C:\Users\Perry\AppData\Local\Temp\And7510.tmp\app\ src\main\java\Extensions\CRunGMaps.java:534: error: cannot find symbol
    Circle xCircle = m.getValue();
    ^
    symbol: class Circle
    location: class CRunGMaps
    C:\Users\Perry\AppData\Local\Temp\And7510.tmp\app\ src\main\java\Extensions\CRunGMaps.java:550: error: illegal start of type
    Math.cos((M1.latitude)*Math.PI/180) *
    ^
    C:\Users\Perry\AppData\Local\Temp\And7510.tmp\app\ src\main\java\Extensions\CRunGMaps.java:551: error: illegal start of type
    Math.cos((M2.latitude)*Math.PI/180) *
    ^
    C:\Users\Perry\AppData\Local\Temp\And7510.tmp\app\ src\main\java\Extensions\CRunGMaps.java:595: error: cannot find symbol
    Markers = new HashMap<Integer, Marker> ();
    ^
    symbol: class Marker
    location: class CRunGMaps
    C:\Users\Perry\AppData\Local\Temp\And7510.tmp\app\ src\main\java\Extensions\CRunGMaps.java:596: error: cannot find symbol
    Circles = new HashMap<Integer, Circle> ();
    ^
    symbol: class Circle
    location: class CRunGMaps
    C:\Users\Perry\AppData\Local\Temp\And7510.tmp\app\ src\main\java\Extensions\CRunGMaps.java:613: error: cannot find symbol
    mCamera = new CameraPosition.Builder().target(new LatLng(Camera.Latitude, Camera.Longitude))
    ^
    symbol: class LatLng
    location: class CRunGMaps
    C:\Users\Perry\AppData\Local\Temp\And7510.tmp\app\ src\main\java\Extensions\CRunGMaps.java:613: error: package CameraPosition does not exist
    mCamera = new CameraPosition.Builder().target(new LatLng(Camera.Latitude, Camera.Longitude))
    ^
    C:\Users\Perry\AppData\Local\Temp\And7510.tmp\app\ src\main\java\Extensions\CRunGMaps.java:1073: error: cannot find symbol
    for (Entry<Integer, Marker> map : Markers.entrySet()) {
    ^
    symbol: class Marker
    location: class CRunGMaps
    C:\Users\Perry\AppData\Local\Temp\And7510.tmp\app\ src\main\java\Extensions\CRunGMaps.java:1086: error: cannot find symbol
    for (Entry<Integer, Marker> map : Markers.entrySet()) {
    ^
    symbol: class Marker
    location: class CRunGMaps
    C:\Users\Perry\AppData\Local\Temp\And7510.tmp\app\ src\main\java\Extensions\CRunGMaps.java:1099: error: cannot find symbol
    for (Entry<Integer, Marker> map : Markers.entrySet()) {
    ^
    symbol: class Marker
    location: class CRunGMaps
    C:\Users\Perry\AppData\Local\Temp\And7510.tmp\app\ src\main\java\Extensions\CRunGMaps.java:1156: error: cannot find symbol
    for (Entry<Integer, Marker> map : Markers.entrySet()) {
    ^
    symbol: class Marker
    location: class CRunGMaps
    C:\Users\Perry\AppData\Local\Temp\And7510.tmp\app\ src\main\java\Extensions\CRunGMaps.java:1231: error: cannot find symbol
    mCamera = new CameraPosition.Builder().target(new LatLng(Camera.Latitude, Camera.Longitude))
    ^
    symbol: class LatLng
    location: class CRunGMaps
    C:\Users\Perry\AppData\Local\Temp\And7510.tmp\app\ src\main\java\Extensions\CRunGMaps.java:1231: error: package CameraPosition does not exist
    mCamera = new CameraPosition.Builder().target(new LatLng(Camera.Latitude, Camera.Longitude))
    ^
    C:\Users\Perry\AppData\Local\Temp\And7510.tmp\app\ src\main\java\Extensions\CRunGMaps.java:1236: error: cannot find symbol
    changeCamera(CameraUpdateFactory.newCameraPosition (mCamera),Animates.time, null);
    ^
    symbol: variable CameraUpdateFactory
    location: class CRunGMaps
    C:\Users\Perry\AppData\Local\Temp\And7510.tmp\app\ src\main\java\Extensions\CRunGMaps.java:1241: error: cannot find symbol
    mCamera = new CameraPosition.Builder().target(new LatLng(Camera.Latitude, Camera.Longitude))
    ^
    symbol: class LatLng
    location: class CRunGMaps
    C:\Users\Perry\AppData\Local\Temp\And7510.tmp\app\ src\main\java\Extensions\CRunGMaps.java:1241: error: package CameraPosition does not exist
    mCamera = new CameraPosition.Builder().target(new LatLng(Camera.Latitude, Camera.Longitude))
    ^
    C:\Users\Perry\AppData\Local\Temp\And7510.tmp\app\ src\main\java\Extensions\CRunGMaps.java:1246: error: cannot find symbol
    changeCamera(CameraUpdateFactory.newCameraPosition (mCamera),Animates.time, null);
    ^
    symbol: variable CameraUpdateFactory
    location: class CRunGMaps
    C:\Users\Perry\AppData\Local\Temp\And7510.tmp\app\ src\main\java\Extensions\CRunGMaps.java:1258: error: cannot find symbol
    changeCamera((CameraUpdateFactory.newLatLng(new LatLng(Camera.Latitude, Camera.Longitude))),Animates.time,null);
    ^
    symbol: class LatLng
    location: class CRunGMaps
    C:\Users\Perry\AppData\Local\Temp\And7510.tmp\app\ src\main\java\Extensions\CRunGMaps.java:1258: error: cannot find symbol
    changeCamera((CameraUpdateFactory.newLatLng(new LatLng(Camera.Latitude, Camera.Longitude))),Animates.time,null);
    ^
    symbol: variable CameraUpdateFactory
    location: class CRunGMaps
    C:\Users\Perry\AppData\Local\Temp\And7510.tmp\app\ src\main\java\Extensions\CRunGMaps.java:1269: error: cannot find symbol
    changeCamera(CameraUpdateFactory.zoomTo(Camera.Zoo m),Animates.time, null);
    ^
    symbol: variable CameraUpdateFactory
    location: class CRunGMaps
    C:\Users\Perry\AppData\Local\Temp\And7510.tmp\app\ src\main\java\Extensions\CRunGMaps.java:1279: error: cannot find symbol
    mCamera = new CameraPosition.Builder().target(new LatLng(Camera.Latitude, Camera.Longitude))
    ^
    symbol: class LatLng
    location: class CRunGMaps
    C:\Users\Perry\AppData\Local\Temp\And7510.tmp\app\ src\main\java\Extensions\CRunGMaps.java:1279: error: package CameraPosition does not exist
    mCamera = new CameraPosition.Builder().target(new LatLng(Camera.Latitude, Camera.Longitude))
    ^
    C:\Users\Perry\AppData\Local\Temp\And7510.tmp\app\ src\main\java\Extensions\CRunGMaps.java:1284: error: cannot find symbol
    changeCamera(CameraUpdateFactory.newCameraPosition (mCamera),Animates.time, null);
    ^
    symbol: variable CameraUpdateFactory
    location: class CRunGMaps
    C:\Users\Perry\AppData\Local\Temp\And7510.tmp\app\ src\main\java\Extensions\CRunGMaps.java:1294: error: cannot find symbol
    mCamera = new CameraPosition.Builder().target(new LatLng(Camera.Latitude, Camera.Longitude))
    ^
    symbol: class LatLng
    location: class CRunGMaps
    C:\Users\Perry\AppData\Local\Temp\And7510.tmp\app\ src\main\java\Extensions\CRunGMaps.java:1294: error: package CameraPosition does not exist
    mCamera = new CameraPosition.Builder().target(new LatLng(Camera.Latitude, Camera.Longitude))
    ^
    C:\Users\Perry\AppData\Local\Temp\And7510.tmp\app\ src\main\java\Extensions\CRunGMaps.java:1299: error: cannot find symbol
    changeCamera(CameraUpdateFactory.newCameraPosition (mCamera),Animates.time, null);
    ^
    symbol: variable CameraUpdateFactory
    location: class CRunGMaps
    Note: Some input files use or override a deprecated API.
    Note: Recompile with -Xlint:deprecation for details.
    Note: Some input files use unchecked or unsafe operations.
    Note: Recompile with -Xlint:unchecked for details.
    100 errors

    FAILURE: Build failed with an exception.

    * What went wrong:
    Execution failed for task ':app:compileDebugJavaWithJavac'.
    > Compilation failed; see the compiler error output for details.

    * Try:
    Run with --stacktrace option to get the stack trace. Run with --info or --debug option to get more log output. Run with --scan to get full insights.

    * Get more help at https://help.gradle.org

    Deprecated Gradle features were used in this build, making it incompatible with Gradle 6.0.
    Use '--warning-mode all' to show the individual deprecation warnings.
    See https://docs.gradle.org/5.1.1/usergu..._line_warnings

    BUILD FAILED in 15s
    12 actionable tasks: 12 executed

  7. #187
    Clickteam Clickteam
    Fernando's Avatar
    Join Date
    Dec 2006
    Posts
    6,152
    Mentioned
    158 Post(s)
    Tagged
    3 Thread(s)
    mm let start from beginning this is not an error is just a warning for future deprecation in gradle 6

    Deprecated Gradle features were used in this build, making it incompatible with Gradle 6.0.
    i think you need to update your GMaps Object from CEM
    Regards,


    Fernando Vivolo

    ... new things are coming ...

  8. #188
    Clicker Fusion 2.5
    Fusion 2.5 (Steam)Fusion 2.5 Developer (Steam)Android Export Module (Steam)

    Join Date
    Nov 2014
    Posts
    62
    Mentioned
    5 Post(s)
    Tagged
    0 Thread(s)
    I still get virtually the same error as you guys, except instead of the Gmaps, it's for the GPG extension/object. I can create an APK as long as GPG is not present, but the GPG is far too ingrained in this specific project to remove it, without breaking something else. Again, I'm running Windows 8.1(64-Bit), Java 8 (64-bit), Beta 292.11 (Steam), everything seems to be ok with Gradle, so far as I can tell. I just don't get it...

  9. #189
    Clickteam Clickteam
    Fernando's Avatar
    Join Date
    Dec 2006
    Posts
    6,152
    Mentioned
    158 Post(s)
    Tagged
    3 Thread(s)
    @MrJustan did you check if the license for use teh platform are all Accepted?

    check that you have access to

    https://mvnrepository.com/artifact/c...s.build/gradle

    https://dl.google.com/dl/android/maven2/index.html

    https://jcenter.bintray.com/

    https://services.gradle.org/distributions/
    Regards,


    Fernando Vivolo

    ... new things are coming ...

  10. #190
    Forum Moderator

    Fusion 2.5 MacFusion 2.5 DeveloperFusion 2.5+ DLCAndroid Export ModuleHTML5 Export ModuleiOS Export ModuleUniversal Windows Platform Export ModuleSWF Export ModuleMac Export ModuleInstall Creator Pro
    Fusion 2.5 (Steam)Fusion 2.5 Developer (Steam)Android Export Module (Steam)HTML5 Export Module (Steam)iOS Export Module (Steam)
    Perry's Avatar
    Join Date
    Dec 2013
    Location
    Watertown, WI
    Posts
    4,336
    Mentioned
    49 Post(s)
    Tagged
    0 Thread(s)
    Quote Originally Posted by Fernando View Post
    mm let start from beginning this is not an error is just a warning for future deprecation in gradle 6



    i think you need to update your GMaps Object from CEM
    CEM? The Plugin Manager in Fusion?
    I did update, and there is nothing else to update.
    Images attachées Images attachées

Page 19 of 22 FirstFirst ... 9 17 18 19 20 21 ... LastLast

Similar Threads

  1. Users that cannot build with Android Studio (ant\build.xml error)
    By Perry in forum Android Export Module 2.5
    Replies: 82
    Last Post: Today, 04:08 AM
  2. Replies: 56
    Last Post: 26th December 2017, 08:53 PM
  3. Cannot build my Android app (ant/build.xml error)
    By oaklan5 in forum Fusion 2.5
    Replies: 1
    Last Post: 27th July 2017, 06:59 PM
  4. Replies: 15
    Last Post: 27th November 2014, 10:08 AM

Posting Permissions

  • You may not post new threads
  • You may not post replies
  • You may not post attachments
  • You may not edit your posts
  •