User Tag List

Page 20 of 24 FirstFirst ... 10 18 19 20 21 22 ... LastLast
Results 191 to 200 of 233

Thread: Android Runtime - Build 292

  1. #191
    Clickteam Clickteam
    Fernando's Avatar
    Join Date
    Dec 2006
    Posts
    6,024
    Mentioned
    128 Post(s)
    Tagged
    3 Thread(s)
    mm try to reinstall

    just in case here is the latest change made in July 09

    https://drive.google.com/file/d/1EHlsdcAHj3gDvP_2dk-ita_Y9f8wqSw9/view?usp=sharing

    ================================================== ====================

    if you get this error

    C:\Users\Perry\AppData\Local\Temp\And7510.tmp\app\ src\main\java\Extensions\CRunGMaps.java:20: error: package com.google.android.gms.common does not exist
    import com.google.android.gms.common.GooglePlayServicesUt il;
    please update from this link
    Regards,


    Fernando Vivolo

    ... new things are coming ...

  2. #192
    Forum Moderator

    Fusion 2.5 MacFusion 2.5 DeveloperFusion 2.5+ DLCAndroid Export ModuleHTML5 Export ModuleiOS Export ModuleUniversal Windows Platform Export ModuleSWF Export ModuleMac Export ModuleInstall Creator Pro
    Fusion 2.5 (Steam)Fusion 2.5 Developer (Steam)Android Export Module (Steam)HTML5 Export Module (Steam)iOS Export Module (Steam)
    Perry's Avatar
    Join Date
    Dec 2013
    Location
    Watertown, WI
    Posts
    4,323
    Mentioned
    44 Post(s)
    Tagged
    0 Thread(s)
    Error list is a lot shorter now


    > Configure project :
    it is windows 10

    > Task :app:preBuild UP-TO-DATE
    > Task :app:preDebugBuild
    > Task :app:compileDebugAidl NO-SOURCE
    > Task :app:compileDebugRenderscript NO-SOURCE
    > Task :app:checkDebugManifest
    > Task :app:generateDebugBuildConfig
    > Task :app:prepareLintJar
    > Task :app:generateDebugSources
    > Task :app:javaPreCompileDebug
    > Task :app:mainApkListPersistenceDebug
    > Task :app:generateDebugResValues
    > Task :app:generateDebugResources
    > Task :app:mergeDebugResources
    > Task :app:createDebugCompatibleScreenManifests
    > Task :app:processDebugManifest
    > Task :app:processDebugResources

    > Task :app:compileDebugJavaWithJavac FAILED
    C:\Users\Perry\AppData\Local\Temp\And30C2.tmp\app\ src\main\java\Extensions\CRunGMaps.java:270: error: cannot find symbol
    mMap = mMapView.getMap();
    ^
    symbol: method getMap()
    location: variable mMapView of type MapView
    C:\Users\Perry\AppData\Local\Temp\And30C2.tmp\app\ src\main\java\Extensions\CRunGMaps.java:386: error: cannot find symbol
    mMap = mMapFrag.getMap();
    ^
    symbol: method getMap()
    location: variable mMapFrag of type MapFragment
    C:\Users\Perry\AppData\Local\Temp\And30C2.tmp\app\ src\main\java\Extensions\CRunGMaps.java:705: error: cannot find symbol
    mMap = mMapFrag.getMap();
    ^
    symbol: method getMap()
    location: variable mMapFrag of type MapFragment
    C:\Users\Perry\AppData\Local\Temp\And30C2.tmp\app\ src\main\java\Extensions\CRunGMaps.java:1836: error: cannot find symbol
    expRet.forceString(GooglePlayServicesUtil.getOpenS ourceSoftwareLicenseInfo(ho.getControlsContext())) ;
    ^
    symbol: method getOpenSourceSoftwareLicenseInfo(Context)
    location: class GooglePlayServicesUtil
    Note: Some input files use or override a deprecated API.
    Note: Recompile with -Xlint:deprecation for details.
    Note: Some input files use unchecked or unsafe operations.
    Note: Recompile with -Xlint:unchecked for details.
    4 errors

    FAILURE: Build failed with an exception.

    * What went wrong:
    Execution failed for task ':app:compileDebugJavaWithJavac'.
    > Compilation failed; see the compiler error output for details.

    * Try:
    Run with --stacktrace option to get the stack trace. Run with --info or --debug option to get more log output. Run with --scan to get full insights.

    * Get more help at https://help.gradle.org

    Deprecated Gradle features were used in this build, making it incompatible with Gradle 6.0.
    Use '--warning-mode all' to show the individual deprecation warnings.
    See https://docs.gradle.org/5.1.1/usergu..._line_warnings

    BUILD FAILED in 7s
    12 actionable tasks: 12 executed

  3. #193
    Clickteam Clickteam
    Fernando's Avatar
    Join Date
    Dec 2006
    Posts
    6,024
    Mentioned
    128 Post(s)
    Tagged
    3 Thread(s)
    can yuo check that you only have a Gmaps.dat and not a .zip mix there inside data/runtime/android
    Regards,


    Fernando Vivolo

    ... new things are coming ...

  4. #194
    Forum Moderator

    Fusion 2.5 MacFusion 2.5 DeveloperFusion 2.5+ DLCAndroid Export ModuleHTML5 Export ModuleiOS Export ModuleUniversal Windows Platform Export ModuleSWF Export ModuleMac Export ModuleInstall Creator Pro
    Fusion 2.5 (Steam)Fusion 2.5 Developer (Steam)Android Export Module (Steam)HTML5 Export Module (Steam)iOS Export Module (Steam)
    Perry's Avatar
    Join Date
    Dec 2013
    Location
    Watertown, WI
    Posts
    4,323
    Mentioned
    44 Post(s)
    Tagged
    0 Thread(s)
    There is a
    GMaps.dat 7/9/2019
    and a
    gmaps.zip 6/3/2016

    I renamed the zip to something else, and now it compiles

    WOOHOOOO

    That was the problem

  5. #195
    Clicker Fusion 2.5 MacFusion 2.5 DeveloperFusion 2.5+ DLCAndroid Export ModuleHTML5 Export ModuleiOS Export ModuleXNA Export Module
    Fusion 2.5 (Steam)Fusion 2.5 Developer (Steam)Android Export Module (Steam)HTML5 Export Module (Steam)iOS Export Module (Steam)Universal Windows Platform Export Module (Steam)
    gkinfinity's Avatar
    Join Date
    May 2011
    Location
    USA
    Posts
    269
    Mentioned
    0 Post(s)
    Tagged
    0 Thread(s)
    I'm trying to get my Android Exporter working but I'm running into trouble. Hoping to get some help on this.

    -I'm on Fusion version R292.10
    -I installed the latest version of Android Studio
    -I installed the 64-bit version of JDK 8
    -I updated the Android SDK directory and the JDK directory location in the Fusion exporter preferences
    -Build type = Android
    -Build API = 29

    When I try to build an application, I get this error:

    ---------------------------------------------------

    Buildfile: C:\Users\XYZ\AppData\Local\Temp\And7ADE.tmp\build. xml

    BUILD FAILED
    C:\Users\XYZ\AppData\Local\Temp\And7ADE.tmp\build. xml:83: Cannot find C:\Users\XYZ\AppData\Local\Android\Sdk\tools\ant\b uild.xml imported from C:\Users\XYZ\AppData\Local\Temp\And7ADE.tmp\build. xml

    Total time: 0 seconds

    ---------------------------------------------------

    Not sure where I went wrong

  6. #196
    Clicker Fusion 2.5 (Steam)Fusion 2.5 Developer (Steam)Android Export Module (Steam)HTML5 Export Module (Steam)iOS Export Module (Steam)Universal Windows Platform Export Module (Steam)
    Lecherbault's Avatar
    Join Date
    Jul 2016
    Posts
    125
    Mentioned
    6 Post(s)
    Tagged
    0 Thread(s)
    Quote Originally Posted by Fernando View Post
    mm try to reinstall

    just in case here is the latest change made in July 09

    https://drive.google.com/file/d/1EHlsdcAHj3gDvP_2dk-ita_Y9f8wqSw9/view?usp=sharing

    ================================================== ====================

    if you get this error



    please update from this link
    I downloaded the files at https://drive.google.com/file/d/1EHl...ew?usp=sharing, and install them, AND i see the update from the publisher had never updated the extension because the files were differents!
    It seems to be OK now! Whaouuuu!!! Thanks a lot. It was the extension that was not up to date But why the MMF2.5 editor does not update the extensions ??? And why the updates of Steam do not do it?? It is not normal...

  7. #197
    Clicker Fusion 2.5
    Fusion 2.5 (Steam)Fusion 2.5 Developer (Steam)Android Export Module (Steam)

    Join Date
    Nov 2014
    Posts
    62
    Mentioned
    5 Post(s)
    Tagged
    0 Thread(s)
    @Fernando

    ......

    I'm feeling like a fool right now, but I'm also relieved. Since this is an update for a project I already released, I went back over the previous version and realized I had an instance of the GPG objects placed in one of the first few frames of the game. I did that for this game, and voila! Wouldn't you know it? The darned thing works. I'm playing it on my phone right now.

    Wow.

    Thank you for all your help!

  8. #198
    Clicker Fusion 2.5 (Steam)Fusion 2.5 Developer (Steam)Android Export Module (Steam)HTML5 Export Module (Steam)iOS Export Module (Steam)Universal Windows Platform Export Module (Steam)
    Lecherbault's Avatar
    Join Date
    Jul 2016
    Posts
    125
    Mentioned
    6 Post(s)
    Tagged
    0 Thread(s)
    @Fernando
    Thank you for your help too. I see that MrJustan has solved its problem. Good.
    We can continue to work with Clickfusion, which is a great product.

  9. #199
    Forum Moderator

    Fusion 2.5 MacFusion 2.5 DeveloperFusion 2.5+ DLCAndroid Export ModuleHTML5 Export ModuleiOS Export ModuleUniversal Windows Platform Export ModuleSWF Export ModuleMac Export ModuleInstall Creator Pro
    Fusion 2.5 (Steam)Fusion 2.5 Developer (Steam)Android Export Module (Steam)HTML5 Export Module (Steam)iOS Export Module (Steam)
    Perry's Avatar
    Join Date
    Dec 2013
    Location
    Watertown, WI
    Posts
    4,323
    Mentioned
    44 Post(s)
    Tagged
    0 Thread(s)
    Quote Originally Posted by Lecherbault View Post
    I downloaded the files at https://drive.google.com/file/d/1EHl...ew?usp=sharing, and install them, AND i see the update from the publisher had never updated the extension because the files were differents!
    It seems to be OK now! Whaouuuu!!! Thanks a lot. It was the extension that was not up to date But why the MMF2.5 editor does not update the extensions ??? And why the updates of Steam do not do it?? It is not normal...
    Sure it's normal.. The file you downloaded is new, and not released yet..

  10. #200
    Clickteam Clickteam
    Fernando's Avatar
    Join Date
    Dec 2006
    Posts
    6,024
    Mentioned
    128 Post(s)
    Tagged
    3 Thread(s)
    Quote Originally Posted by MrJustan View Post
    @Fernando

    ......

    I'm feeling like a fool right now, but I'm also relieved. Since this is an update for a project I already released, I went back over the previous version and realized I had an instance of the GPG objects placed in one of the first few frames of the game. I did that for this game, and voila! Wouldn't you know it? The darned thing works. I'm playing it on my phone right now.

    Wow.

    Thank you for all your help!

    Glad you solved
    Regards,


    Fernando Vivolo

    ... new things are coming ...

Page 20 of 24 FirstFirst ... 10 18 19 20 21 22 ... LastLast

Similar Threads

  1. Users that cannot build with Android Studio (ant\build.xml error)
    By Perry in forum Android Export Module 2.5
    Replies: 77
    Last Post: 16th October 2018, 02:17 PM
  2. Replies: 56
    Last Post: 26th December 2017, 08:53 PM
  3. Cannot build my Android app (ant/build.xml error)
    By oaklan5 in forum Fusion 2.5
    Replies: 1
    Last Post: 27th July 2017, 06:59 PM
  4. Replies: 15
    Last Post: 27th November 2014, 10:08 AM

Posting Permissions

  • You may not post new threads
  • You may not post replies
  • You may not post attachments
  • You may not edit your posts
  •