User Tag List

Page 28 of 32 FirstFirst ... 18 26 27 28 29 30 ... LastLast
Results 271 to 280 of 313

Thread: Android Runtime - Build 292

  1. #271
    Clicker Fusion 2.5 MacFusion 2.5 DeveloperAndroid Export ModuleHTML5 Export ModuleiOS Export ModuleSWF Export ModuleXNA Export ModuleUnicode Add-on
    Fusion 2.5 (Steam)Fusion 2.5 Developer (Steam)Fusion 2.5+ DLC (Steam)Android Export Module (Steam)HTML5 Export Module (Steam)iOS Export Module (Steam)Universal Windows Platform Export Module (Steam)Firefly 3D Module (Steam)
    Phi's Avatar
    Join Date
    Jan 2010
    Location
    England
    Posts
    2,029
    Mentioned
    25 Post(s)
    Tagged
    0 Thread(s)
    I've just seen a "manage all files" permission which can be used for a document manager. To access that, a manage all files intent needs to be posted.

    Is this intent coded into Fusion at the moment in file requests, or do I have to request it via some object?

    (I would edit my post, but we're still transitioning the forum.)

  2. #272
    Clickteam Clickteam
    Fernando's Avatar
    Join Date
    Dec 2006
    Posts
    7,302
    Mentioned
    298 Post(s)
    Tagged
    4 Thread(s)
    it should be working with android object, regarding teh post in discord, i did a small change in file object which i will post later for testing


    ================================================== =======================================

    Here an example for Manage external storage permission
    Attached files Attached files
    Regards,


    Fernando Vivolo

    ... new things are coming ...

  3. #273
    Clicker Fusion 2.5 DeveloperAndroid Export ModuleSWF Export Module

    Join Date
    Apr 2013
    Posts
    31
    Mentioned
    0 Post(s)
    Tagged
    0 Thread(s)
    Please ignore #273, posted in wrong place and cant delete it

  4. #274
    Clicker Fusion 2.5 DeveloperFusion 2.5+ DLCAndroid Export Module
    burresnurre's Avatar
    Join Date
    Jun 2013
    Location
    sweden
    Posts
    77
    Mentioned
    0 Post(s)
    Tagged
    0 Thread(s)
    I use Fusion Developer build R290.4 and do not dare to update or buy fusion 2.5 + DLC
    then I am terrified that I will not be able to get started.Android Export again.

  5. #275
    Clickteam Clickteam

    Join Date
    Jun 2006
    Location
    France
    Posts
    14,384
    Mentioned
    279 Post(s)
    Tagged
    3 Thread(s)
    Well, you can't use 290.4 for ever. What you can do is:

    1. Make a backup copy of your MFA's.
    2. Make a backup copy of your current Android SDK.
    3. Update Fusion to 293.10.
    4. Install Android Studio, follow the instructions at the beginning of this post (and make sure the Java SDK pathname points to the jre sub-directory of Android Studio, don't use the JDK anymore).
    5. Build your app and report any error that is not documented at the beginning of this post.

    In the worst case, if for some reason you are totally unable to make it work (but I don't see why), then you can unninstall Android Studio, restore your old Android SDK, reinstall 290.4 and set the old Android SDK/JDK pathnames in your preferences.

  6. #276
    Clicker Fusion 2.5 DeveloperFusion 2.5+ DLCAndroid Export Module
    burresnurre's Avatar
    Join Date
    Jun 2013
    Location
    sweden
    Posts
    77
    Mentioned
    0 Post(s)
    Tagged
    0 Thread(s)
    he he understands that I need to update, and am very interested in fusion 2.5 + DLC thinking about maybe testing on my other computer or testing what you write. I'm just afraid my games will stop working when I've come so far in development.
    thanks Yves for the help.

  7. #277
    Clicker Fusion 2.5 DeveloperAndroid Export ModuleiOS Export Module
    VBEinc's Avatar
    Join Date
    Oct 2015
    Posts
    496
    Mentioned
    12 Post(s)
    Tagged
    0 Thread(s)
    Well, I had to redo windows and reinstall MMF2.5DEV.

    MMF2.5DEV 293.10 and the Latest Android Exporter.

    I followed everything for setting up MMF2.5DEV as mentioned using Android Studio's Directories and now I get this.

    > Task :app:preBuild UP-TO-DATE> Task :app:preReleaseBuild UP-TO-DATE
    > Task :app:compileReleaseAidl NO-SOURCE
    > Task :app:compileReleaseRenderscript NO-SOURCE
    > Task :app:generateReleaseBuildConfig
    > Task :app:javaPreCompileRelease
    > Task :app:writeReleaseApplicationId
    > Task :app:analyticsRecordingRelease
    > Task :app:generateReleaseResValues
    > Task :app:generateReleaseResources
    > Task :app:checkReleaseAarMetadata
    > Task :app:createReleaseCompatibleScreenManifests
    > Task :app:extractDeepLinksRelease
    > Task :app:processReleaseMainManifest
    > Task :app:processReleaseManifest
    > Task :app:processReleaseManifestForPackage
    > Task :app:mergeReleaseJniLibFolders
    > Task :app:mergeReleaseShaders
    > Task :app:compileReleaseShaders NO-SOURCE
    > Task :app:generateReleaseAssets UP-TO-DATE
    > Task :app:mergeReleaseAssets
    > Task :app:compressReleaseAssets
    > Task :app:checkReleaseDuplicateClasses
    > Task :app:processReleaseJavaRes NO-SOURCE
    > Task :app:desugarReleaseFileDependencies
    > Task :app:mergeReleaseResources
    > Task :app:mergeReleaseJavaResource
    > Task :app:mergeReleaseNativeLibs


    > Task :app:stripReleaseDebugSymbols
    Unable to strip the following libraries, packaging them as they are: libES1Renderer.so, libES2Renderer.so, libES3Renderer.so, libRuntimeNative.so, libgdx.so.


    > Task :app:extractReleaseNativeSymbolTables
    Unable to extract native debug metadata from C:\Users\VBE\AppData\Local\Temp\AndCF34.tmp\app\bu ild\intermediates\merged_native_libs\release\out\l ib\arm64-v8a\libES1Renderer.so because unable to locate the objcopy executable for the arm64-v8a ABI.
    Unable to extract native debug metadata from C:\Users\VBE\AppData\Local\Temp\AndCF34.tmp\app\bu ild\intermediates\merged_native_libs\release\out\l ib\arm64-v8a\libES2Renderer.so because unable to locate the objcopy executable for the arm64-v8a ABI.
    Unable to extract native debug metadata from C:\Users\VBE\AppData\Local\Temp\AndCF34.tmp\app\bu ild\intermediates\merged_native_libs\release\out\l ib\arm64-v8a\libES3Renderer.so because unable to locate the objcopy executable for the arm64-v8a ABI.
    Unable to extract native debug metadata from C:\Users\VBE\AppData\Local\Temp\AndCF34.tmp\app\bu ild\intermediates\merged_native_libs\release\out\l ib\arm64-v8a\libgdx.so because unable to locate the objcopy executable for the arm64-v8a ABI.
    Unable to extract native debug metadata from C:\Users\VBE\AppData\Local\Temp\AndCF34.tmp\app\bu ild\intermediates\merged_native_libs\release\out\l ib\arm64-v8a\libRuntimeNative.so because unable to locate the objcopy executable for the arm64-v8a ABI.
    Unable to extract native debug metadata from C:\Users\VBE\AppData\Local\Temp\AndCF34.tmp\app\bu ild\intermediates\merged_native_libs\release\out\l ib\armeabi-v7a\libES1Renderer.so because unable to locate the objcopy executable for the armeabi-v7a ABI.
    Unable to extract native debug metadata from C:\Users\VBE\AppData\Local\Temp\AndCF34.tmp\app\bu ild\intermediates\merged_native_libs\release\out\l ib\armeabi-v7a\libES2Renderer.so because unable to locate the objcopy executable for the armeabi-v7a ABI.
    Unable to extract native debug metadata from C:\Users\VBE\AppData\Local\Temp\AndCF34.tmp\app\bu ild\intermediates\merged_native_libs\release\out\l ib\armeabi-v7a\libES3Renderer.so because unable to locate the objcopy executable for the armeabi-v7a ABI.
    Unable to extract native debug metadata from C:\Users\VBE\AppData\Local\Temp\AndCF34.tmp\app\bu ild\intermediates\merged_native_libs\release\out\l ib\armeabi-v7a\libgdx.so because unable to locate the objcopy executable for the armeabi-v7a ABI.
    Unable to extract native debug metadata from C:\Users\VBE\AppData\Local\Temp\AndCF34.tmp\app\bu ild\intermediates\merged_native_libs\release\out\l ib\armeabi-v7a\libRuntimeNative.so because unable to locate the objcopy executable for the armeabi-v7a ABI.
    Unable to extract native debug metadata from C:\Users\VBE\AppData\Local\Temp\AndCF34.tmp\app\bu ild\intermediates\merged_native_libs\release\out\l ib\x86\libES1Renderer.so because unable to locate the objcopy executable for the x86 ABI.
    Unable to extract native debug metadata from C:\Users\VBE\AppData\Local\Temp\AndCF34.tmp\app\bu ild\intermediates\merged_native_libs\release\out\l ib\x86\libES2Renderer.so because unable to locate the objcopy executable for the x86 ABI.
    Unable to extract native debug metadata from C:\Users\VBE\AppData\Local\Temp\AndCF34.tmp\app\bu ild\intermediates\merged_native_libs\release\out\l ib\x86\libES3Renderer.so because unable to locate the objcopy executable for the x86 ABI.
    Unable to extract native debug metadata from C:\Users\VBE\AppData\Local\Temp\AndCF34.tmp\app\bu ild\intermediates\merged_native_libs\release\out\l ib\x86\libgdx.so because unable to locate the objcopy executable for the x86 ABI.
    Unable to extract native debug metadata from C:\Users\VBE\AppData\Local\Temp\AndCF34.tmp\app\bu ild\intermediates\merged_native_libs\release\out\l ib\x86\libRuntimeNative.so because unable to locate the objcopy executable for the x86 ABI.
    Unable to extract native debug metadata from C:\Users\VBE\AppData\Local\Temp\AndCF34.tmp\app\bu ild\intermediates\merged_native_libs\release\out\l ib\x86_64\libES1Renderer.so because unable to locate the objcopy executable for the x86_64 ABI.
    Unable to extract native debug metadata from C:\Users\VBE\AppData\Local\Temp\AndCF34.tmp\app\bu ild\intermediates\merged_native_libs\release\out\l ib\x86_64\libES2Renderer.so because unable to locate the objcopy executable for the x86_64 ABI.
    Unable to extract native debug metadata from C:\Users\VBE\AppData\Local\Temp\AndCF34.tmp\app\bu ild\intermediates\merged_native_libs\release\out\l ib\x86_64\libES3Renderer.so because unable to locate the objcopy executable for the x86_64 ABI.
    Unable to extract native debug metadata from C:\Users\VBE\AppData\Local\Temp\AndCF34.tmp\app\bu ild\intermediates\merged_native_libs\release\out\l ib\x86_64\libgdx.so because unable to locate the objcopy executable for the x86_64 ABI.
    Unable to extract native debug metadata from C:\Users\VBE\AppData\Local\Temp\AndCF34.tmp\app\bu ild\intermediates\merged_native_libs\release\out\l ib\x86_64\libRuntimeNative.so because unable to locate the objcopy executable for the x86_64 ABI.


    > Task :app:collectReleaseDependencies
    > Task :app:mergeReleaseNativeDebugMetadata NO-SOURCE
    > Task :app:sdkReleaseDependencyData
    > Task :app:validateSigningRelease
    > Task :app:writeReleaseAppMetadata
    > Task :app:writeReleaseSigningConfigVersions
    > Task :app:mergeExtDexRelease
    > Task :app:processReleaseResources


    > Task :app:compileReleaseJavaWithJavac FAILED
    An exception has occurred in the compiler (1.8.0_152-release). Please file a bug against the Java compiler via the Java bug reporting page (http://bugreport.java.com) after checking the Bug Database (http://bugs.java.com) for duplicates. Include your program and the following diagnostic in your report. Thank you.
    java.lang.AssertionError: annotationType(): unrecognized Attribute name MODULE (class com.sun.tools.javac.util.UnsharedNameTable$NameImp l)
    at com.sun.tools.javac.util.Assert.error(Assert.java: 133)
    at com.sun.tools.javac.code.TypeAnnotations.annotatio nType(TypeAnnotations.java:231)
    at com.sun.tools.javac.code.TypeAnnotations$TypeAnnot ationPositions.separateAnnotationsKinds(TypeAnnota tions.java:294)
    at com.sun.tools.javac.code.TypeAnnotations$TypeAnnot ationPositions.visitMethodDef(TypeAnnotations.java :1066)
    at com.sun.tools.javac.tree.JCTree$JCMethodDecl.accep t(JCTree.java:778)
    at com.sun.tools.javac.tree.TreeScanner.scan(TreeScan ner.java:49)
    at com.sun.tools.javac.code.TypeAnnotations$TypeAnnot ationPositions.scan(TypeAnnotations.java:275)
    at com.sun.tools.javac.tree.TreeScanner.scan(TreeScan ner.java:57)
    at com.sun.tools.javac.code.TypeAnnotations$TypeAnnot ationPositions.visitClassDef(TypeAnnotations.java: 1042)
    at com.sun.tools.javac.tree.JCTree$JCClassDecl.accept (JCTree.java:693)
    at com.sun.tools.javac.tree.TreeScanner.scan(TreeScan ner.java:49)
    at com.sun.tools.javac.code.TypeAnnotations$TypeAnnot ationPositions.scan(TypeAnnotations.java:275)
    at com.sun.tools.javac.code.TypeAnnotations$1.run(Typ eAnnotations.java:127)
    at com.sun.tools.javac.comp.Annotate.flush(Annotate.j ava:152)
    at com.sun.tools.javac.comp.Annotate.enterDone(Annota te.java:129)
    at com.sun.tools.javac.comp.Enter.complete(Enter.java :512)
    at com.sun.tools.javac.comp.Enter.main(Enter.java:471 )
    at com.sun.tools.javac.main.JavaCompiler.enterTrees(J avaCompiler.java:982)
    at com.sun.tools.javac.main.JavaCompiler.compile(Java Compiler.java:857)
    at com.sun.tools.javac.main.Main.compile(Main.java:52 3)
    at com.sun.tools.javac.api.JavacTaskImpl.doCall(Javac TaskImpl.java:129)
    at com.sun.tools.javac.api.JavacTaskImpl.call(JavacTa skImpl.java:138)
    at org.gradle.internal.compiler.java.IncrementalCompi leTask.call(IncrementalCompileTask.java:77)
    at org.gradle.api.internal.tasks.compile.AnnotationPr ocessingCompileTask.call(AnnotationProcessingCompi leTask.java:94)
    at org.gradle.api.internal.tasks.compile.ResourceClea ningCompilationTask.call(ResourceCleaningCompilati onTask.java:57)
    at org.gradle.api.internal.tasks.compile.JdkJavaCompi ler.execute(JdkJavaCompiler.java:55)
    at org.gradle.api.internal.tasks.compile.JdkJavaCompi ler.execute(JdkJavaCompiler.java:40)
    at org.gradle.api.internal.tasks.compile.NormalizingJ avaCompiler.delegateAndHandleErrors(NormalizingJav aCompiler.java:97)
    at org.gradle.api.internal.tasks.compile.NormalizingJ avaCompiler.execute(NormalizingJavaCompiler.java:5 1)
    at org.gradle.api.internal.tasks.compile.NormalizingJ avaCompiler.execute(NormalizingJavaCompiler.java:3 7)
    at org.gradle.api.internal.tasks.compile.AnnotationPr ocessorDiscoveringCompiler.execute(AnnotationProce ssorDiscoveringCompiler.java:51)
    at org.gradle.api.internal.tasks.compile.AnnotationPr ocessorDiscoveringCompiler.execute(AnnotationProce ssorDiscoveringCompiler.java:37)
    at org.gradle.api.internal.tasks.compile.ModuleApplic ationNameWritingCompiler.execute(ModuleApplication NameWritingCompiler.java:46)
    at org.gradle.api.internal.tasks.compile.ModuleApplic ationNameWritingCompiler.execute(ModuleApplication NameWritingCompiler.java:36)
    at org.gradle.jvm.toolchain.internal.DefaultToolchain JavaCompiler.execute(DefaultToolchainJavaCompiler. java:57)
    at org.gradle.api.tasks.compile.JavaCompile.lambda$cr eateToolchainCompiler$1(JavaCompile.java:251)
    at org.gradle.api.internal.tasks.compile.CleaningJava Compiler.execute(CleaningJavaCompiler.java:53)
    at org.gradle.api.internal.tasks.compile.incremental. IncrementalCompilerFactory.lambda$createRebuildAll Compiler$0(IncrementalCompilerFactory.java:98)
    at org.gradle.api.internal.tasks.compile.incremental. IncrementalResultStoringCompiler.execute(Increment alResultStoringCompiler.java:61)
    at org.gradle.api.internal.tasks.compile.incremental. IncrementalResultStoringCompiler.execute(Increment alResultStoringCompiler.java:45)
    at org.gradle.api.internal.tasks.compile.CompileJavaB uildOperationReportingCompiler$2.call(CompileJavaB uildOperationReportingCompiler.java:59)
    at org.gradle.api.internal.tasks.compile.CompileJavaB uildOperationReportingCompiler$2.call(CompileJavaB uildOperationReportingCompiler.java:51)
    at org.gradle.internal.operations.DefaultBuildOperati onRunner$CallableBuildOperationWorker.execute(Defa ultBuildOperationRunner.java:200)
    at org.gradle.internal.operations.DefaultBuildOperati onRunner$CallableBuildOperationWorker.execute(Defa ultBuildOperationRunner.java:195)
    at org.gradle.internal.operations.DefaultBuildOperati onRunner$3.execute(DefaultBuildOperationRunner.jav a:75)
    at org.gradle.internal.operations.DefaultBuildOperati onRunner$3.execute(DefaultBuildOperationRunner.jav a:68)
    at org.gradle.internal.operations.DefaultBuildOperati onRunner.execute(DefaultBuildOperationRunner.java: 153)
    at org.gradle.internal.operations.DefaultBuildOperati onRunner.execute(DefaultBuildOperationRunner.java: 68)
    at org.gradle.internal.operations.DefaultBuildOperati onRunner.call(DefaultBuildOperationRunner.java:62)
    at org.gradle.internal.operations.DefaultBuildOperati onExecutor.lambda$call$2(DefaultBuildOperationExec utor.java:76)
    at org.gradle.internal.operations.UnmanagedBuildOpera tionWrapper.callWithUnmanagedSupport(UnmanagedBuil dOperationWrapper.java:54)
    at org.gradle.internal.operations.DefaultBuildOperati onExecutor.call(DefaultBuildOperationExecutor.java :76)
    at org.gradle.api.internal.tasks.compile.CompileJavaB uildOperationReportingCompiler.execute(CompileJava BuildOperationReportingCompiler.java:51)
    at org.gradle.api.tasks.compile.JavaCompile.performCo mpilation(JavaCompile.java:300)
    at org.gradle.api.tasks.compile.JavaCompile.performIn crementalCompilation(JavaCompile.java:179)
    at org.gradle.api.tasks.compile.JavaCompile.compile(J avaCompile.java:152)
    at sun.reflect.NativeMethodAccessorImpl.invoke0(Nativ e Method)
    at sun.reflect.NativeMethodAccessorImpl.invoke(Native MethodAccessorImpl.java:62)
    at sun.reflect.DelegatingMethodAccessorImpl.invoke(De legatingMethodAccessorImpl.java:43)
    at java.lang.reflect.Method.invoke(Method.java:498)
    at org.gradle.internal.reflect.JavaMethod.invoke(Java Method.java:104)
    at org.gradle.api.internal.project.taskfactory.Increm entalInputsTaskAction.doExecute(IncrementalInputsT askAction.java:32)
    at org.gradle.api.internal.project.taskfactory.Standa rdTaskAction.execute(StandardTaskAction.java:51)
    at org.gradle.api.internal.project.taskfactory.Abstra ctIncrementalTaskAction.execute(AbstractIncrementa lTaskAction.java:25)
    at org.gradle.api.internal.project.taskfactory.Standa rdTaskAction.execute(StandardTaskAction.java:29)
    at org.gradle.api.internal.tasks.execution.ExecuteAct ionsTaskExecuter$2.run(ExecuteActionsTaskExecuter. java:498)
    at org.gradle.internal.operations.DefaultBuildOperati onRunner$1.execute(DefaultBuildOperationRunner.jav a:29)
    at org.gradle.internal.operations.DefaultBuildOperati onRunner$1.execute(DefaultBuildOperationRunner.jav a:26)
    at org.gradle.internal.operations.DefaultBuildOperati onRunner$3.execute(DefaultBuildOperationRunner.jav a:75)
    at org.gradle.internal.operations.DefaultBuildOperati onRunner$3.execute(DefaultBuildOperationRunner.jav a:68)
    at org.gradle.internal.operations.DefaultBuildOperati onRunner.execute(DefaultBuildOperationRunner.java: 153)
    at org.gradle.internal.operations.DefaultBuildOperati onRunner.execute(DefaultBuildOperationRunner.java: 68)
    at org.gradle.internal.operations.DefaultBuildOperati onRunner.run(DefaultBuildOperationRunner.java:56)
    at org.gradle.internal.operations.DefaultBuildOperati onExecutor.lambda$run$1(DefaultBuildOperationExecu tor.java:71)
    at org.gradle.internal.operations.UnmanagedBuildOpera tionWrapper.runWithUnmanagedSupport(UnmanagedBuild OperationWrapper.java:45)
    at org.gradle.internal.operations.DefaultBuildOperati onExecutor.run(DefaultBuildOperationExecutor.java: 71)
    at org.gradle.api.internal.tasks.execution.ExecuteAct ionsTaskExecuter.executeAction(ExecuteActionsTaskE xecuter.java:483)
    at org.gradle.api.internal.tasks.execution.ExecuteAct ionsTaskExecuter.executeActions(ExecuteActionsTask Executer.java:466)
    at org.gradle.api.internal.tasks.execution.ExecuteAct ionsTaskExecuter.access$300(ExecuteActionsTaskExec uter.java:105)
    at org.gradle.api.internal.tasks.execution.ExecuteAct ionsTaskExecuter$TaskExecution.executeWithPrevious OutputFiles(ExecuteActionsTaskExecuter.java:270)
    at org.gradle.api.internal.tasks.execution.ExecuteAct ionsTaskExecuter$TaskExecution.execute(ExecuteActi onsTaskExecuter.java:248)
    at org.gradle.internal.execution.steps.ExecuteStep.ex ecuteInternal(ExecuteStep.java:83)
    at org.gradle.internal.execution.steps.ExecuteStep.ac cess$000(ExecuteStep.java:37)
    at org.gradle.internal.execution.steps.ExecuteStep$1. call(ExecuteStep.java:50)
    at org.gradle.internal.execution.steps.ExecuteStep$1. call(ExecuteStep.java:47)
    at org.gradle.internal.operations.DefaultBuildOperati onRunner$CallableBuildOperationWorker.execute(Defa ultBuildOperationRunner.java:200)
    at org.gradle.internal.operations.DefaultBuildOperati onRunner$CallableBuildOperationWorker.execute(Defa ultBuildOperationRunner.java:195)
    at org.gradle.internal.operations.DefaultBuildOperati onRunner$3.execute(DefaultBuildOperationRunner.jav a:75)
    at org.gradle.internal.operations.DefaultBuildOperati onRunner$3.execute(DefaultBuildOperationRunner.jav a:68)
    at org.gradle.internal.operations.DefaultBuildOperati onRunner.execute(DefaultBuildOperationRunner.java: 153)
    at org.gradle.internal.operations.DefaultBuildOperati onRunner.execute(DefaultBuildOperationRunner.java: 68)
    at org.gradle.internal.operations.DefaultBuildOperati onRunner.call(DefaultBuildOperationRunner.java:62)
    at org.gradle.internal.operations.DefaultBuildOperati onExecutor.lambda$call$2(DefaultBuildOperationExec utor.java:76)
    at org.gradle.internal.operations.UnmanagedBuildOpera tionWrapper.callWithUnmanagedSupport(UnmanagedBuil dOperationWrapper.java:54)
    at org.gradle.internal.operations.DefaultBuildOperati onExecutor.call(DefaultBuildOperationExecutor.java :76)
    at org.gradle.internal.execution.steps.ExecuteStep.ex ecute(ExecuteStep.java:47)
    at org.gradle.internal.execution.steps.ExecuteStep.ex ecute(ExecuteStep.java:37)
    at org.gradle.internal.execution.steps.RemovePrevious OutputsStep.execute(RemovePreviousOutputsStep.java :68)
    at org.gradle.internal.execution.steps.RemovePrevious OutputsStep.execute(RemovePreviousOutputsStep.java :38)
    at org.gradle.internal.execution.steps.ResolveInputCh angesStep.execute(ResolveInputChangesStep.java:50)
    at org.gradle.internal.execution.steps.ResolveInputCh angesStep.execute(ResolveInputChangesStep.java:36)
    at org.gradle.internal.execution.steps.CancelExecutio nStep.execute(CancelExecutionStep.java:41)
    at org.gradle.internal.execution.steps.TimeoutStep.ex ecuteWithoutTimeout(TimeoutStep.java:74)
    at org.gradle.internal.execution.steps.TimeoutStep.ex ecute(TimeoutStep.java:55)
    at org.gradle.internal.execution.steps.CreateOutputsS tep.execute(CreateOutputsStep.java:51)
    at org.gradle.internal.execution.steps.CreateOutputsS tep.execute(CreateOutputsStep.java:29)
    at org.gradle.internal.execution.steps.CaptureStateAf terExecutionStep.execute(CaptureStateAfterExecutio nStep.java:54)
    at org.gradle.internal.execution.steps.CaptureStateAf terExecutionStep.execute(CaptureStateAfterExecutio nStep.java:35)
    at org.gradle.internal.execution.steps.BroadcastChang ingOutputsStep.execute(BroadcastChangingOutputsSte p.java:60)
    at org.gradle.internal.execution.steps.BroadcastChang ingOutputsStep.execute(BroadcastChangingOutputsSte p.java:27)
    at org.gradle.internal.execution.steps.BuildCacheStep .executeWithoutCache(BuildCacheStep.java:174)
    at org.gradle.internal.execution.steps.BuildCacheStep .execute(BuildCacheStep.java:74)
    at org.gradle.internal.execution.steps.BuildCacheStep .execute(BuildCacheStep.java:45)
    at org.gradle.internal.execution.steps.StoreExecution StateStep.execute(StoreExecutionStateStep.java:40)
    at org.gradle.internal.execution.steps.StoreExecution StateStep.execute(StoreExecutionStateStep.java:29)
    at org.gradle.internal.execution.steps.RecordOutputsS tep.execute(RecordOutputsStep.java:36)
    at org.gradle.internal.execution.steps.RecordOutputsS tep.execute(RecordOutputsStep.java:22)
    at org.gradle.internal.execution.steps.SkipUpToDateSt ep.executeBecause(SkipUpToDateStep.java:99)
    at org.gradle.internal.execution.steps.SkipUpToDateSt ep.lambda$execute$0(SkipUpToDateStep.java:92)
    at java.util.Optional.map(Optional.java:215)
    at org.gradle.internal.execution.steps.SkipUpToDateSt ep.execute(SkipUpToDateStep.java:52)
    at org.gradle.internal.execution.steps.SkipUpToDateSt ep.execute(SkipUpToDateStep.java:36)
    at org.gradle.internal.execution.steps.ResolveChanges Step.execute(ResolveChangesStep.java:84)
    at org.gradle.internal.execution.steps.ResolveChanges Step.execute(ResolveChangesStep.java:41)
    at org.gradle.internal.execution.steps.legacy.MarkSna pshottingInputsFinishedStep.execute(MarkSnapshotti ngInputsFinishedStep.java:37)
    at org.gradle.internal.execution.steps.legacy.MarkSna pshottingInputsFinishedStep.execute(MarkSnapshotti ngInputsFinishedStep.java:27)
    at org.gradle.internal.execution.steps.ResolveCaching StateStep.execute(ResolveCachingStateStep.java:91)
    at org.gradle.internal.execution.steps.ResolveCaching StateStep.execute(ResolveCachingStateStep.java:49)
    at org.gradle.internal.execution.steps.CaptureStateBe foreExecutionStep.execute(CaptureStateBeforeExecut ionStep.java:78)
    at org.gradle.internal.execution.steps.CaptureStateBe foreExecutionStep.execute(CaptureStateBeforeExecut ionStep.java:49)
    at org.gradle.internal.execution.steps.ValidateStep.e xecute(ValidateStep.java:105)
    at org.gradle.internal.execution.steps.ValidateStep.e xecute(ValidateStep.java:50)
    at org.gradle.internal.execution.steps.SkipEmptyWorkS tep.lambda$execute$2(SkipEmptyWorkStep.java:86)
    at java.util.Optional.orElseGet(Optional.java:267)
    at org.gradle.internal.execution.steps.SkipEmptyWorkS tep.execute(SkipEmptyWorkStep.java:86)
    at org.gradle.internal.execution.steps.SkipEmptyWorkS tep.execute(SkipEmptyWorkStep.java:32)
    at org.gradle.internal.execution.steps.legacy.MarkSna pshottingInputsStartedStep.execute(MarkSnapshottin gInputsStartedStep.java:38)
    at org.gradle.internal.execution.steps.LoadExecutionS tateStep.execute(LoadExecutionStateStep.java:43)
    at org.gradle.internal.execution.steps.LoadExecutionS tateStep.execute(LoadExecutionStateStep.java:31)
    at org.gradle.internal.execution.steps.AssignWorkspac eStep.lambda$execute$0(AssignWorkspaceStep.java:40 )
    at org.gradle.api.internal.tasks.execution.ExecuteAct ionsTaskExecuter$TaskExecution$2.withWorkspace(Exe cuteActionsTaskExecuter.java:283)
    at org.gradle.internal.execution.steps.AssignWorkspac eStep.execute(AssignWorkspaceStep.java:40)
    at org.gradle.internal.execution.steps.AssignWorkspac eStep.execute(AssignWorkspaceStep.java:30)
    at org.gradle.internal.execution.steps.IdentityCacheS tep.execute(IdentityCacheStep.java:37)
    at org.gradle.internal.execution.steps.IdentityCacheS tep.execute(IdentityCacheStep.java:27)
    at org.gradle.internal.execution.steps.IdentifyStep.e xecute(IdentifyStep.java:49)
    at org.gradle.internal.execution.steps.IdentifyStep.e xecute(IdentifyStep.java:35)
    at org.gradle.internal.execution.impl.DefaultExecutio nEngine$1.execute(DefaultExecutionEngine.java:76)
    at org.gradle.api.internal.tasks.execution.ExecuteAct ionsTaskExecuter.executeIfValid(ExecuteActionsTask Executer.java:184)
    at org.gradle.api.internal.tasks.execution.ExecuteAct ionsTaskExecuter.execute(ExecuteActionsTaskExecute r.java:173)
    at org.gradle.api.internal.tasks.execution.CleanupSta leOutputsExecuter.execute(CleanupStaleOutputsExecu ter.java:109)
    at org.gradle.api.internal.tasks.execution.FinalizePr opertiesTaskExecuter.execute(FinalizePropertiesTas kExecuter.java:46)
    at org.gradle.api.internal.tasks.execution.ResolveTas kExecutionModeExecuter.execute(ResolveTaskExecutio nModeExecuter.java:51)
    at org.gradle.api.internal.tasks.execution.SkipTaskWi thNoActionsExecuter.execute(SkipTaskWithNoActionsE xecuter.java:57)
    at org.gradle.api.internal.tasks.execution.SkipOnlyIf TaskExecuter.execute(SkipOnlyIfTaskExecuter.java:5 6)
    at org.gradle.api.internal.tasks.execution.CatchExcep tionTaskExecuter.execute(CatchExceptionTaskExecute r.java:36)
    at org.gradle.api.internal.tasks.execution.EventFirin gTaskExecuter$1.executeTask(EventFiringTaskExecute r.java:77)
    at org.gradle.api.internal.tasks.execution.EventFirin gTaskExecuter$1.call(EventFiringTaskExecuter.java: 55)
    at org.gradle.api.internal.tasks.execution.EventFirin gTaskExecuter$1.call(EventFiringTaskExecuter.java: 52)
    at org.gradle.internal.operations.DefaultBuildOperati onRunner$CallableBuildOperationWorker.execute(Defa ultBuildOperationRunner.java:200)
    at org.gradle.internal.operations.DefaultBuildOperati onRunner$CallableBuildOperationWorker.execute(Defa ultBuildOperationRunner.java:195)
    at org.gradle.internal.operations.DefaultBuildOperati onRunner$3.execute(DefaultBuildOperationRunner.jav a:75)
    at org.gradle.internal.operations.DefaultBuildOperati onRunner$3.execute(DefaultBuildOperationRunner.jav a:68)
    at org.gradle.internal.operations.DefaultBuildOperati onRunner.execute(DefaultBuildOperationRunner.java: 153)
    at org.gradle.internal.operations.DefaultBuildOperati onRunner.execute(DefaultBuildOperationRunner.java: 68)
    at org.gradle.internal.operations.DefaultBuildOperati onRunner.call(DefaultBuildOperationRunner.java:62)
    at org.gradle.internal.operations.DefaultBuildOperati onExecutor.lambda$call$2(DefaultBuildOperationExec utor.java:76)
    at org.gradle.internal.operations.UnmanagedBuildOpera tionWrapper.callWithUnmanagedSupport(UnmanagedBuil dOperationWrapper.java:54)
    at org.gradle.internal.operations.DefaultBuildOperati onExecutor.call(DefaultBuildOperationExecutor.java :76)
    at org.gradle.api.internal.tasks.execution.EventFirin gTaskExecuter.execute(EventFiringTaskExecuter.java :52)
    at org.gradle.execution.plan.LocalTaskNodeExecutor.ex ecute(LocalTaskNodeExecutor.java:74)
    at org.gradle.execution.taskgraph.DefaultTaskExecutio nGraph$InvokeNodeExecutorsAction.execute(DefaultTa skExecutionGraph.java:408)
    at org.gradle.execution.taskgraph.DefaultTaskExecutio nGraph$InvokeNodeExecutorsAction.execute(DefaultTa skExecutionGraph.java:395)
    at org.gradle.execution.taskgraph.DefaultTaskExecutio nGraph$BuildOperationAwareExecutionAction.execute( DefaultTaskExecutionGraph.java:388)
    at org.gradle.execution.taskgraph.DefaultTaskExecutio nGraph$BuildOperationAwareExecutionAction.execute( DefaultTaskExecutionGraph.java:374)
    at org.gradle.execution.plan.DefaultPlanExecutor$Exec utorWorker.lambda$run$0(DefaultPlanExecutor.java:1 27)
    at org.gradle.execution.plan.DefaultPlanExecutor$Exec utorWorker.execute(DefaultPlanExecutor.java:191)
    at org.gradle.execution.plan.DefaultPlanExecutor$Exec utorWorker.executeNextNode(DefaultPlanExecutor.jav a:182)
    at org.gradle.execution.plan.DefaultPlanExecutor$Exec utorWorker.run(DefaultPlanExecutor.java:124)
    at org.gradle.internal.concurrent.ExecutorPolicy$Catc hAndRecordFailures.onExecute(ExecutorPolicy.java:6 4)
    at org.gradle.internal.concurrent.ManagedExecutorImpl $1.run(ManagedExecutorImpl.java:48)
    at java.util.concurrent.ThreadPoolExecutor.runWorker( ThreadPoolExecutor.java:1142)
    at java.util.concurrent.ThreadPoolExecutor$Worker.run (ThreadPoolExecutor.java:617)
    at org.gradle.internal.concurrent.ThreadFactoryImpl$M anagedThreadRunnable.run(ThreadFactoryImpl.java:56 )
    at java.lang.Thread.run(Thread.java:745)


    FAILURE: Build failed with an exception.


    * What went wrong:
    Execution failed for task ':app:compileReleaseJavaWithJavac'.
    > Compilation failed; see the compiler error output for details.


    * Try:
    Run with --stacktrace option to get the stack trace. Run with --info or --debug option to get more log output. Run with --scan to get full insights.


    * Get more help at https://help.gradle.org


    BUILD FAILED in 5s
    30 actionable tasks: 30 executed

    Any Help, I'd be Greatfull.

    Preferences below
    error.jpg

  8. #278
    Clickteam Clickteam

    Join Date
    Jun 2006
    Location
    France
    Posts
    14,384
    Mentioned
    279 Post(s)
    Tagged
    3 Thread(s)
    Check 2 things:

    1. Make sure you've reinstalled the latest update patch of Fusion AFTER reinstalling the Android exporter, not before.
    2. If you use Google Play objects, make sure you've installed the latest version for build 293 or above from Clickstore.

  9. #279
    Clickteam Clickteam
    Fernando's Avatar
    Join Date
    Dec 2006
    Posts
    7,302
    Mentioned
    298 Post(s)
    Tagged
    4 Thread(s)
    Hi,

    Please check that you have the latest version of android studio, the latest patch of fusion installed after installing the MMF dev + android exporter.

    This could be related to several things

    1.- using an old gradlew wrapper (the latest patch will solve this)

    2.- JDK open a CMD windows and run javac -version, the latest version of Gradlew use version 302 your is 152, check that android studio is the latest version.
    Regards,


    Fernando Vivolo

    ... new things are coming ...

  10. #280
    Clicker Fusion 2.5 DeveloperAndroid Export ModuleiOS Export Module
    VBEinc's Avatar
    Join Date
    Oct 2015
    Posts
    496
    Mentioned
    12 Post(s)
    Tagged
    0 Thread(s)
    Quote Originally Posted by Yves View Post
    Check 2 things:

    1. Make sure you've reinstalled the latest update patch of Fusion AFTER reinstalling the Android exporter, not before.
    2. If you use Google Play objects, make sure you've installed the latest version for build 293 or above from Clickstore.

    I did it that way bud. Nothing.
    I actually copied my Clickteam directory prior, so that all I have to do is paste it on top of a fresh install. Prevents having to go to Object manager and clicking hundreds of objects to install.

    Thanks though bud

Page 28 of 32 FirstFirst ... 18 26 27 28 29 30 ... LastLast

Similar Threads

  1. Users that cannot build with Android Studio (ant\build.xml error)
    By Perry in forum Android Export Module 2.5
    Replies: 102
    Last Post: 28th November 2019, 07:02 PM
  2. Replies: 56
    Last Post: 26th December 2017, 08:53 PM
  3. Cannot build my Android app (ant/build.xml error)
    By oaklan5 in forum Fusion 2.5
    Replies: 1
    Last Post: 27th July 2017, 06:59 PM
  4. Replies: 15
    Last Post: 27th November 2014, 10:08 AM

Posting Permissions

  • You may not post new threads
  • You may not post replies
  • You may not post attachments
  • You may not edit your posts
  •