User Tag List

Page 13 of 23 FirstFirst ... 3 11 12 13 14 15 ... LastLast
Results 121 to 130 of 223

Thread: Android Runtime - Build 292

  1. #121
    Clicker Fusion 2.5 DeveloperAndroid Export Module
    VBEinc's Avatar
    Join Date
    Oct 2015
    Posts
    163
    Mentioned
    10 Post(s)
    Tagged
    0 Thread(s)
    Thank you, Fernando.

    I downloaded and installed the patch. However, there was an error message I understood from previous mmf2 with android exporter. The error was it was unable to find the Keystore alias.

    Fix:

    Simply move your keystore to C:\????.keystore

    This fixed the final error message.

    I checked the apk in my phone and it worked flawlessly.

    Build time was blazing fast. Normally my builds took around 5 minutes. This took 3 seconds. Thank you again Fernando!

    ERROR 01.jpg

  2. #122
    Clicker Fusion 2.5
    Fusion 2.5 (Steam)Fusion 2.5 Developer (Steam)Android Export Module (Steam)

    Join Date
    Nov 2014
    Posts
    66
    Mentioned
    5 Post(s)
    Tagged
    0 Thread(s)
    Quote Originally Posted by MrJustan View Post
    And how do I do that, sir? I'm searching and unable to find a link.
    Scratch that. I'm opted in.

  3. #123
    Clicker Fusion 2.5
    Fusion 2.5 (Steam)Fusion 2.5 Developer (Steam)Android Export Module (Steam)

    Join Date
    Nov 2014
    Posts
    66
    Mentioned
    5 Post(s)
    Tagged
    0 Thread(s)
    Well, I updated to the latest beta, still have the API set to 28, all of the proper SDK's seem to be in place, and again the GPG extension has been updated to the gradle version and still I get this same error, when I try to export. And I'm positive I'm pointing to all the correct folders in the preferences.

    > Task :app:preBuild UP-TO-DATE
    > Task :app:preReleaseBuild
    > Task :app:compileReleaseAidl NO-SOURCE
    > Task :app:compileReleaseRenderscript
    > Task :app:checkReleaseManifest
    > Task :app:generateReleaseBuildConfig
    > Task :app:prepareLintJar
    > Task :app:generateReleaseSources
    > Task :app:javaPreCompileRelease
    > Task :app:mainApkListPersistenceRelease
    > Task :app:generateReleaseResValues
    > Task :app:generateReleaseResources
    > Task :app:mergeReleaseResources
    > Task :app:createReleaseCompatibleScreenManifests
    > Task :app:processReleaseManifest
    > Task :app:processReleaseResources

    > Task :app:compileReleaseJavaWithJavac
    C:\Users\admin\AppData\Local\Temp\And717C.tmp\app\ src\main\java\Extensions\CRunGPGAchievement.java:7 : error: package com.google.android.gms.games does not exist
    import com.google.android.gms.games.Games;
    ^
    C:\Users\admin\AppData\Local\Temp\And717C.tmp\app\ src\main\java\Extensions\CRunGPGAchievement.java:8 : error: package com.google.android.gms.games does not exist
    import com.google.android.gms.games.GamesActivityResultCo des;
    ^
    C:\Users\admin\AppData\Local\Temp\And717C.tmp\app\ src\main\java\Extensions\CRunGPGAchievement.java:9 : error: package com.google.android.gms.games does not exist
    import com.google.android.gms.games.GamesStatusCodes;
    ^
    C:\Users\admin\AppData\Local\Temp\And717C.tmp\app\ src\main\java\Extensions\CRunGPGAchievement.java:1 0: error: package com.google.android.gms.games.achievement does not exist
    import com.google.android.gms.games.achievement.Achieveme nt;
    ^
    C:\Users\admin\AppData\Local\Temp\And717C.tmp\app\ src\main\java\Extensions\CRunGPGAchievement.java:1 1: error: package com.google.android.gms.games.achievement does not exist
    import com.google.android.gms.games.achievement.Achieveme ntBuffer;
    ^
    C:\Users\admin\AppData\Local\Temp\And717C.tmp\app\ src\main\java\Extensions\CRunGPGAchievement.java:1 2: error: package com.google.android.gms.games.achievement does not exist
    import com.google.android.gms.games.achievement.Achieveme ntEntity;
    ^
    C:\Users\admin\AppData\Local\Temp\And717C.tmp\app\ src\main\java\Extensions\CRunGPGAchievement.java:1 3: error: package com.google.android.gms.games.achievement.Achieveme nts does not exist
    import com.google.android.gms.games.achievement.Achieveme nts.LoadAchievementsResult;
    ^
    C:\Users\admin\AppData\Local\Temp\And717C.tmp\app\ src\main\java\Extensions\CRunGPGAchievement.java:1 4: error: package com.google.android.gms.games.achievement.Achieveme nts does not exist
    import com.google.android.gms.games.achievement.Achieveme nts.UpdateAchievementResult;
    ^
    C:\Users\admin\AppData\Local\Temp\And717C.tmp\app\ src\main\java\Extensions\CRunGPGAchievement.java:3 36: error: cannot find symbol
    class AchievementUpdateCallback implements ResultCallback<UpdateAchievementResult> {
    ^
    symbol: class UpdateAchievementResult
    location: class CRunGPGAchievement
    C:\Users\admin\AppData\Local\Temp\And717C.tmp\app\ src\main\java\Extensions\CRunGPGAchievement.java:3 79: error: cannot find symbol
    class AchievementLoadCallback implements ResultCallback<LoadAchievementsResult> {
    ^
    symbol: class LoadAchievementsResult
    location: class CRunGPGAchievement
    C:\Users\admin\AppData\Local\Temp\And717C.tmp\app\ src\main\java\Extensions\CRunGPGAchievement.java:8 5: error: cannot find symbol
    private SparseArray<AchievementEntity> achHash;
    ^
    symbol: class AchievementEntity
    location: class CRunGPGAchievement
    C:\Users\admin\AppData\Local\Temp\And717C.tmp\app\ src\main\java\Extensions\CRunGPGAchievement.java:3 38: error: cannot find symbol
    public void onResult(UpdateAchievementResult res) {
    ^
    symbol: class UpdateAchievementResult
    location: class CRunGPGAchievement.AchievementUpdateCallback
    C:\Users\admin\AppData\Local\Temp\And717C.tmp\app\ src\main\java\Extensions\CRunGPGAchievement.java:3 82: error: cannot find symbol
    public void onResult(LoadAchievementsResult res) {
    ^
    symbol: class LoadAchievementsResult
    location: class CRunGPGAchievement.AchievementLoadCallback
    C:\Users\admin\AppData\Local\Temp\And717C.tmp\app\ src\main\java\Extensions\CRunGPGLeaderboard.java:7 : error: package com.google.android.gms.games does not exist
    import com.google.android.gms.games.Games;
    ^
    C:\Users\admin\AppData\Local\Temp\And717C.tmp\app\ src\main\java\Extensions\CRunGPGLeaderboard.java:8 : error: package com.google.android.gms.games does not exist
    import com.google.android.gms.games.GamesActivityResultCo des;
    ^
    C:\Users\admin\AppData\Local\Temp\And717C.tmp\app\ src\main\java\Extensions\CRunGPGLeaderboard.java:9 : error: package com.google.android.gms.games does not exist
    import com.google.android.gms.games.GamesStatusCodes;
    ^
    C:\Users\admin\AppData\Local\Temp\And717C.tmp\app\ src\main\java\Extensions\CRunGPGLeaderboard.java:1 0: error: package com.google.android.gms.games does not exist
    import com.google.android.gms.games.PageDirection;
    ^
    C:\Users\admin\AppData\Local\Temp\And717C.tmp\app\ src\main\java\Extensions\CRunGPGLeaderboard.java:1 1: error: package com.google.android.gms.games.leaderboard does not exist
    import com.google.android.gms.games.leaderboard.Leaderboa rdBuffer;
    ^
    C:\Users\admin\AppData\Local\Temp\And717C.tmp\app\ src\main\java\Extensions\CRunGPGLeaderboard.java:1 2: error: package com.google.android.gms.games.leaderboard does not exist
    import com.google.android.gms.games.leaderboard.Leaderboa rdScoreBuffer;
    ^
    C:\Users\admin\AppData\Local\Temp\And717C.tmp\app\ src\main\java\Extensions\CRunGPGLeaderboard.java:1 3: error: package com.google.android.gms.games.leaderboard does not exist
    import com.google.android.gms.games.leaderboard.Leaderboa rdVariant;
    ^
    C:\Users\admin\AppData\Local\Temp\And717C.tmp\app\ src\main\java\Extensions\CRunGPGLeaderboard.java:1 4: error: package com.google.android.gms.games.leaderboard does not exist
    import com.google.android.gms.games.leaderboard.Leaderboa rds;
    ^
    C:\Users\admin\AppData\Local\Temp\And717C.tmp\app\ src\main\java\Extensions\CRunGPGLeaderboard.java:1 5: error: package com.google.android.gms.games.leaderboard.Leaderboa rds does not exist
    import com.google.android.gms.games.leaderboard.Leaderboa rds.LeaderboardMetadataResult;
    ^
    C:\Users\admin\AppData\Local\Temp\And717C.tmp\app\ src\main\java\Extensions\CRunGPGLeaderboard.java:1 6: error: package com.google.android.gms.games.leaderboard.Leaderboa rds does not exist
    import com.google.android.gms.games.leaderboard.Leaderboa rds.LoadScoresResult;
    ^
    C:\Users\admin\AppData\Local\Temp\And717C.tmp\app\ src\main\java\Extensions\CRunGPGLeaderboard.java:1 7: error: package com.google.android.gms.games.leaderboard.Leaderboa rds does not exist
    import com.google.android.gms.games.leaderboard.Leaderboa rds.SubmitScoreResult;
    ^
    C:\Users\admin\AppData\Local\Temp\And717C.tmp\app\ src\main\java\Extensions\CRunGPGLeaderboard.java:4 30: error: cannot find symbol
    class LeaderBoardSubmitScoreCallback implements ResultCallback<SubmitScoreResult> {
    ^
    symbol: class SubmitScoreResult
    location: class CRunGPGLeaderboard
    C:\Users\admin\AppData\Local\Temp\And717C.tmp\app\ src\main\java\Extensions\CRunGPGLeaderboard.java:6 95: error: package Leaderboards does not exist
    private boolean isScoreResultValid(final Leaderboards.LoadPlayerScoreResult scoreResult) {
    ^
    C:\Users\admin\AppData\Local\Temp\And717C.tmp\app\ src\main\java\Extensions\CRunGPGLeaderboard.java:4 32: error: cannot find symbol
    public void onResult(SubmitScoreResult res) {
    ^
    symbol: class SubmitScoreResult
    location: class CRunGPGLeaderboard.LeaderBoardSubmitScoreCallback
    C:\Users\admin\AppData\Local\Temp\And717C.tmp\app\ src\main\java\Extensions\CRunGPGAchievement.java:1 42: error: cannot find symbol
    achHash = new SparseArray<AchievementEntity>();
    ^
    symbol: class AchievementEntity
    location: class CRunGPGAchievement
    C:\Users\admin\AppData\Local\Temp\And717C.tmp\app\ src\main\java\Extensions\CRunGPGAchievement.java:1 89: error: cannot find symbol
    if (resultCode == GamesActivityResultCodes.RESULT_RECONNECT_REQUIRED )
    ^
    symbol: variable GamesActivityResultCodes
    location: class CRunGPGAchievement
    C:\Users\admin\AppData\Local\Temp\And717C.tmp\app\ src\main\java\Extensions\CRunGPGAchievement.java:1 91: error: cannot find symbol
    else if(resultCode == GamesActivityResultCodes.RESULT_SIGN_IN_FAILED)
    ^
    symbol: variable GamesActivityResultCodes
    location: class CRunGPGAchievement
    C:\Users\admin\AppData\Local\Temp\And717C.tmp\app\ src\main\java\Extensions\CRunGPGAchievement.java:1 92: error: cannot find symbol
    BaseGameUtils.showActivityResultError(MMFRuntime.i nst, requestCode, resultCode, signin_other_error);
    ^
    symbol: variable BaseGameUtils
    location: class CRunGPGAchievement
    C:\Users\admin\AppData\Local\Temp\And717C.tmp\app\ src\main\java\Extensions\CRunGPGAchievement.java:3 49: error: cannot find symbol
    if(nres == GamesStatusCodes.STATUS_OK) {
    ^
    symbol: variable GamesStatusCodes
    location: class CRunGPGAchievement.AchievementUpdateCallback
    C:\Users\admin\AppData\Local\Temp\And717C.tmp\app\ src\main\java\Extensions\CRunGPGAchievement.java:3 52: error: package Games does not exist
    Games.Achievements.load(mGoogleApiClient, true).setResultCallback(mAchievementLoadCallback);
    ^
    C:\Users\admin\AppData\Local\Temp\And717C.tmp\app\ src\main\java\Extensions\CRunGPGAchievement.java:3 54: error: cannot find symbol
    else if (nres == GamesStatusCodes.STATUS_ACHIEVEMENT_UNLOCKED) {
    ^
    symbol: variable GamesStatusCodes
    location: class CRunGPGAchievement.AchievementUpdateCallback
    C:\Users\admin\AppData\Local\Temp\And717C.tmp\app\ src\main\java\Extensions\CRunGPGAchievement.java:3 59: error: cannot find symbol
    else if (nres == GamesStatusCodes.STATUS_ACHIEVEMENT_UNKNOWN) {
    ^
    symbol: variable GamesStatusCodes
    location: class CRunGPGAchievement.AchievementUpdateCallback
    C:\Users\admin\AppData\Local\Temp\And717C.tmp\app\ src\main\java\Extensions\CRunGPGAchievement.java:3 64: error: cannot find symbol
    else if (nres == GamesStatusCodes.STATUS_ACHIEVEMENT_NOT_INCREMENTA L) {
    ^
    symbol: variable GamesStatusCodes
    location: class CRunGPGAchievement.AchievementUpdateCallback
    C:\Users\admin\AppData\Local\Temp\And717C.tmp\app\ src\main\java\Extensions\CRunGPGAchievement.java:3 69: error: cannot find symbol
    else if (nres == GamesStatusCodes.STATUS_ACHIEVEMENT_UNLOCK_FAILURE ) {
    ^
    symbol: variable GamesStatusCodes
    location: class CRunGPGAchievement.AchievementUpdateCallback
    C:\Users\admin\AppData\Local\Temp\And717C.tmp\app\ src\main\java\Extensions\CRunGPGAchievement.java:3 90: error: cannot find symbol
    AchievementBuffer aBuffer = res.getAchievements();
    ^
    symbol: class AchievementBuffer
    location: class CRunGPGAchievement.AchievementLoadCallback
    C:\Users\admin\AppData\Local\Temp\And717C.tmp\app\ src\main\java\Extensions\CRunGPGAchievement.java:4 05: error: cannot find symbol
    achHash = new SparseArray<AchievementEntity>();
    ^
    symbol: class AchievementEntity
    location: class CRunGPGAchievement.AchievementLoadCallback
    C:\Users\admin\AppData\Local\Temp\And717C.tmp\app\ src\main\java\Extensions\CRunGPGAchievement.java:4 11: error: cannot find symbol
    achHash.put(i, new AchievementEntity(aBuffer.get(i)));
    ^
    symbol: class AchievementEntity
    location: class CRunGPGAchievement.AchievementLoadCallback
    C:\Users\admin\AppData\Local\Temp\And717C.tmp\app\ src\main\java\Extensions\CRunGPGAchievement.java:4 22: error: cannot find symbol
    AchievementEntity achv = new AchievementEntity(aBuffer.get(i));
    ^
    symbol: class AchievementEntity
    location: class CRunGPGAchievement.AchievementLoadCallback
    C:\Users\admin\AppData\Local\Temp\And717C.tmp\app\ src\main\java\Extensions\CRunGPGAchievement.java:4 22: error: cannot find symbol
    AchievementEntity achv = new AchievementEntity(aBuffer.get(i));
    ^
    symbol: class AchievementEntity
    location: class CRunGPGAchievement.AchievementLoadCallback
    C:\Users\admin\AppData\Local\Temp\And717C.tmp\app\ src\main\java\Extensions\CRunGPGAchievement.java:4 24: error: cannot find symbol
    if (achv.getState() == Achievement.STATE_REVEALED) {
    ^
    symbol: variable Achievement
    location: class CRunGPGAchievement.AchievementLoadCallback
    C:\Users\admin\AppData\Local\Temp\And717C.tmp\app\ src\main\java\Extensions\CRunGPGAchievement.java:4 31: error: cannot find symbol
    if (checkStatus && achv.getState() == Achievement.STATE_UNLOCKED) {
    ^
    symbol: variable Achievement
    location: class CRunGPGAchievement.AchievementLoadCallback
    C:\Users\admin\AppData\Local\Temp\And717C.tmp\app\ src\main\java\Extensions\CRunGPGAchievement.java:4 55: error: package Games does not exist
    Games.Achievements.load(mGoogleApiClient, true).setResultCallback(mAchievementLoadCallback);
    ^
    C:\Users\admin\AppData\Local\Temp\And717C.tmp\app\ src\main\java\Extensions\CRunGPGAchievement.java:4 65: error: package Games does not exist
    Games.Achievements.unlockImmediate(mGoogleApiClien t, mAchievementId).setResultCallback(mAchievementUpda teCallback);
    ^
    C:\Users\admin\AppData\Local\Temp\And717C.tmp\app\ src\main\java\Extensions\CRunGPGAchievement.java:4 76: error: package Games does not exist
    Games.Achievements.incrementImmediate(mGoogleApiCl ient, mAchievementId, value).setResultCallback(mAchievementUpdateCallbac k);
    ^
    C:\Users\admin\AppData\Local\Temp\And717C.tmp\app\ src\main\java\Extensions\CRunGPGAchievement.java:4 86: error: package Games does not exist
    Games.Achievements.load(mGoogleApiClient, true).setResultCallback(mAchievementLoadCallback);
    ^
    C:\Users\admin\AppData\Local\Temp\And717C.tmp\app\ src\main\java\Extensions\CRunGPGAchievement.java:4 95: error: package Games does not exist
    MMFRuntime.inst.startActivityForResult(Games.Achie vements.getAchievementsIntent(mGoogleApiClient), RC_ACHIEVEMENTS);
    ^
    C:\Users\admin\AppData\Local\Temp\And717C.tmp\app\ src\main\java\Extensions\CRunGPGLeaderboard.java:2 34: error: cannot find symbol
    if (resultCode == GamesActivityResultCodes.RESULT_RECONNECT_REQUIRED )
    ^
    symbol: variable GamesActivityResultCodes
    location: class CRunGPGLeaderboard
    C:\Users\admin\AppData\Local\Temp\And717C.tmp\app\ src\main\java\Extensions\CRunGPGLeaderboard.java:2 36: error: cannot find symbol
    else if(resultCode == GamesActivityResultCodes.RESULT_SIGN_IN_FAILED)
    ^
    symbol: variable GamesActivityResultCodes
    location: class CRunGPGLeaderboard
    C:\Users\admin\AppData\Local\Temp\And717C.tmp\app\ src\main\java\Extensions\CRunGPGLeaderboard.java:2 37: error: cannot find symbol
    BaseGameUtils.showActivityResultError(MMFRuntime.i nst, requestCode, resultCode, signin_other_error);
    ^
    symbol: variable BaseGameUtils
    location: class CRunGPGLeaderboard
    C:\Users\admin\AppData\Local\Temp\And717C.tmp\app\ src\main\java\Extensions\CRunGPGLeaderboard.java:4 56: error: cannot find symbol
    Games.Leaderboards.loadLeaderboardMetadata(mGoogle ApiClient, true).setResultCallback(new ResultCallback<LeaderboardMetadataResult>() {
    ^
    symbol: class LeaderboardMetadataResult
    location: class CRunGPGLeaderboard
    C:\Users\admin\AppData\Local\Temp\And717C.tmp\app\ src\main\java\Extensions\CRunGPGLeaderboard.java:4 59: error: cannot find symbol
    public void onResult(LeaderboardMetadataResult result) {
    ^
    symbol: class LeaderboardMetadataResult
    C:\Users\admin\AppData\Local\Temp\And717C.tmp\app\ src\main\java\Extensions\CRunGPGLeaderboard.java:4 64: error: cannot find symbol
    LeaderboardBuffer leaderboardBuffer = result.getLeaderboards();
    ^
    symbol: class LeaderboardBuffer
    C:\Users\admin\AppData\Local\Temp\And717C.tmp\app\ src\main\java\Extensions\CRunGPGLeaderboard.java:4 56: error: package Games does not exist
    Games.Leaderboards.loadLeaderboardMetadata(mGoogle ApiClient, true).setResultCallback(new ResultCallback<LeaderboardMetadataResult>() {
    ^
    C:\Users\admin\AppData\Local\Temp\And717C.tmp\app\ src\main\java\Extensions\CRunGPGLeaderboard.java:4 97: error: cannot find symbol
    int timeSpan = (flgSpan == 0 ? LeaderboardVariant.TIME_SPAN_DAILY : (flgSpan == 1 ? LeaderboardVariant.TIME_SPAN_WEEKLY : LeaderboardVariant.TIME_SPAN_ALL_TIME));
    ^
    symbol: variable LeaderboardVariant
    location: class CRunGPGLeaderboard
    C:\Users\admin\AppData\Local\Temp\And717C.tmp\app\ src\main\java\Extensions\CRunGPGLeaderboard.java:4 97: error: cannot find symbol
    int timeSpan = (flgSpan == 0 ? LeaderboardVariant.TIME_SPAN_DAILY : (flgSpan == 1 ? LeaderboardVariant.TIME_SPAN_WEEKLY : LeaderboardVariant.TIME_SPAN_ALL_TIME));
    ^
    symbol: variable LeaderboardVariant
    location: class CRunGPGLeaderboard
    C:\Users\admin\AppData\Local\Temp\And717C.tmp\app\ src\main\java\Extensions\CRunGPGLeaderboard.java:4 97: error: cannot find symbol
    int timeSpan = (flgSpan == 0 ? LeaderboardVariant.TIME_SPAN_DAILY : (flgSpan == 1 ? LeaderboardVariant.TIME_SPAN_WEEKLY : LeaderboardVariant.TIME_SPAN_ALL_TIME));
    ^
    symbol: variable LeaderboardVariant
    location: class CRunGPGLeaderboard
    C:\Users\admin\AppData\Local\Temp\And717C.tmp\app\ src\main\java\Extensions\CRunGPGLeaderboard.java:4 98: error: cannot find symbol
    int collection = (flgColl == 0 ? LeaderboardVariant.COLLECTION_PUBLIC: LeaderboardVariant.COLLECTION_SOCIAL);
    ^
    symbol: variable LeaderboardVariant
    location: class CRunGPGLeaderboard
    C:\Users\admin\AppData\Local\Temp\And717C.tmp\app\ src\main\java\Extensions\CRunGPGLeaderboard.java:4 98: error: cannot find symbol
    int collection = (flgColl == 0 ? LeaderboardVariant.COLLECTION_PUBLIC: LeaderboardVariant.COLLECTION_SOCIAL);
    ^
    symbol: variable LeaderboardVariant
    location: class CRunGPGLeaderboard
    C:\Users\admin\AppData\Local\Temp\And717C.tmp\app\ src\main\java\Extensions\CRunGPGLeaderboard.java:5 01: error: cannot find symbol
    Games.Leaderboards.loadPlayerCenteredScores(mGoogl eApiClient, READ_CS_ID, timeSpan, collection, maxCount, true).setResultCallback(new ResultCallback<LoadScoresResult>() {
    ^
    symbol: class LoadScoresResult
    location: class CRunGPGLeaderboard
    C:\Users\admin\AppData\Local\Temp\And717C.tmp\app\ src\main\java\Extensions\CRunGPGLeaderboard.java:5 04: error: cannot find symbol
    public void onResult(LoadScoresResult result) {
    ^
    symbol: class LoadScoresResult
    C:\Users\admin\AppData\Local\Temp\And717C.tmp\app\ src\main\java\Extensions\CRunGPGLeaderboard.java:5 10: error: cannot find symbol
    LeaderboardScoreBuffer bufferScore = result.getScores();
    ^
    symbol: class LeaderboardScoreBuffer
    C:\Users\admin\AppData\Local\Temp\And717C.tmp\app\ src\main\java\Extensions\CRunGPGLeaderboard.java:5 01: error: package Games does not exist
    Games.Leaderboards.loadPlayerCenteredScores(mGoogl eApiClient, READ_CS_ID, timeSpan, collection, maxCount, true).setResultCallback(new ResultCallback<LoadScoresResult>() {
    ^
    C:\Users\admin\AppData\Local\Temp\And717C.tmp\app\ src\main\java\Extensions\CRunGPGLeaderboard.java:5 46: error: cannot find symbol
    int timeSpan = (flgSpan == 0 ? LeaderboardVariant.TIME_SPAN_DAILY : (flgSpan == 1 ? LeaderboardVariant.TIME_SPAN_WEEKLY : LeaderboardVariant.TIME_SPAN_ALL_TIME));
    ^
    symbol: variable LeaderboardVariant
    location: class CRunGPGLeaderboard
    C:\Users\admin\AppData\Local\Temp\And717C.tmp\app\ src\main\java\Extensions\CRunGPGLeaderboard.java:5 46: error: cannot find symbol
    int timeSpan = (flgSpan == 0 ? LeaderboardVariant.TIME_SPAN_DAILY : (flgSpan == 1 ? LeaderboardVariant.TIME_SPAN_WEEKLY : LeaderboardVariant.TIME_SPAN_ALL_TIME));
    ^
    symbol: variable LeaderboardVariant
    location: class CRunGPGLeaderboard
    C:\Users\admin\AppData\Local\Temp\And717C.tmp\app\ src\main\java\Extensions\CRunGPGLeaderboard.java:5 46: error: cannot find symbol
    int timeSpan = (flgSpan == 0 ? LeaderboardVariant.TIME_SPAN_DAILY : (flgSpan == 1 ? LeaderboardVariant.TIME_SPAN_WEEKLY : LeaderboardVariant.TIME_SPAN_ALL_TIME));
    ^
    symbol: variable LeaderboardVariant
    location: class CRunGPGLeaderboard
    C:\Users\admin\AppData\Local\Temp\And717C.tmp\app\ src\main\java\Extensions\CRunGPGLeaderboard.java:5 47: error: cannot find symbol
    int collection = (flgColl == 0 ? LeaderboardVariant.COLLECTION_PUBLIC: LeaderboardVariant.COLLECTION_SOCIAL);
    ^
    symbol: variable LeaderboardVariant
    location: class CRunGPGLeaderboard
    C:\Users\admin\AppData\Local\Temp\And717C.tmp\app\ src\main\java\Extensions\CRunGPGLeaderboard.java:5 47: error: cannot find symbol
    int collection = (flgColl == 0 ? LeaderboardVariant.COLLECTION_PUBLIC: LeaderboardVariant.COLLECTION_SOCIAL);
    ^
    symbol: variable LeaderboardVariant
    location: class CRunGPGLeaderboard
    C:\Users\admin\AppData\Local\Temp\And717C.tmp\app\ src\main\java\Extensions\CRunGPGLeaderboard.java:5 58: error: cannot find symbol
    Games.Leaderboards.loadTopScores(mGoogleApiClient, READ_TS_ID, timeSpan, collection, maxCount, true).setResultCallback(new ResultCallback<LoadScoresResult>() {
    ^
    symbol: class LoadScoresResult
    location: class CRunGPGLeaderboard
    C:\Users\admin\AppData\Local\Temp\And717C.tmp\app\ src\main\java\Extensions\CRunGPGLeaderboard.java:5 64: error: cannot find symbol
    public void onResult(LoadScoresResult result) {
    ^
    symbol: class LoadScoresResult
    C:\Users\admin\AppData\Local\Temp\And717C.tmp\app\ src\main\java\Extensions\CRunGPGLeaderboard.java:5 69: error: cannot find symbol
    LeaderboardScoreBuffer bufferScore = result.getScores();
    ^
    symbol: class LeaderboardScoreBuffer
    C:\Users\admin\AppData\Local\Temp\And717C.tmp\app\ src\main\java\Extensions\CRunGPGLeaderboard.java:5 94: error: cannot find symbol
    Games.Leaderboards.loadMoreScores(mGoogleApiClient , bufferScore, remaining > 25 ? 25 :remaining, PageDirection.NEXT).setResultCallback(this);
    ^
    symbol: variable PageDirection
    C:\Users\admin\AppData\Local\Temp\And717C.tmp\app\ src\main\java\Extensions\CRunGPGLeaderboard.java:5 94: error: package Games does not exist
    Games.Leaderboards.loadMoreScores(mGoogleApiClient , bufferScore, remaining > 25 ? 25 :remaining, PageDirection.NEXT).setResultCallback(this);
    ^
    C:\Users\admin\AppData\Local\Temp\And717C.tmp\app\ src\main\java\Extensions\CRunGPGLeaderboard.java:5 58: error: package Games does not exist
    Games.Leaderboards.loadTopScores(mGoogleApiClient, READ_TS_ID, timeSpan, collection, maxCount, true).setResultCallback(new ResultCallback<LoadScoresResult>() {
    ^
    C:\Users\admin\AppData\Local\Temp\And717C.tmp\app\ src\main\java\Extensions\CRunGPGLeaderboard.java:6 15: error: package Games does not exist
    Games.Leaderboards.submitScoreImmediate(mGoogleApi Client,
    ^
    C:\Users\admin\AppData\Local\Temp\And717C.tmp\app\ src\main\java\Extensions\CRunGPGLeaderboard.java:6 25: error: package Games does not exist
    Games.Leaderboards.submitScoreImmediate(mGoogleApi Client,
    ^
    C:\Users\admin\AppData\Local\Temp\And717C.tmp\app\ src\main\java\Extensions\CRunGPGLeaderboard.java:6 35: error: package Games does not exist
    Games.Leaderboards.submitScoreImmediate(mGoogleApi Client,
    ^
    C:\Users\admin\AppData\Local\Temp\And717C.tmp\app\ src\main\java\Extensions\CRunGPGLeaderboard.java:6 47: error: package Games does not exist
    Games.Leaderboards.getLeaderboardIntent(mGoogleApi Client, LEADERBOARD_ID), RC_LEADERBOARD);
    ^
    C:\Users\admin\AppData\Local\Temp\And717C.tmp\app\ src\main\java\Extensions\CRunGPGLeaderboard.java:6 61: error: cannot find symbol
    int timeSpan = (flgSpan == 0 ? LeaderboardVariant.TIME_SPAN_DAILY : (flgSpan == 1 ? LeaderboardVariant.TIME_SPAN_WEEKLY : LeaderboardVariant.TIME_SPAN_ALL_TIME));
    ^
    symbol: variable LeaderboardVariant
    location: class CRunGPGLeaderboard
    C:\Users\admin\AppData\Local\Temp\And717C.tmp\app\ src\main\java\Extensions\CRunGPGLeaderboard.java:6 61: error: cannot find symbol
    int timeSpan = (flgSpan == 0 ? LeaderboardVariant.TIME_SPAN_DAILY : (flgSpan == 1 ? LeaderboardVariant.TIME_SPAN_WEEKLY : LeaderboardVariant.TIME_SPAN_ALL_TIME));
    ^
    symbol: variable LeaderboardVariant
    location: class CRunGPGLeaderboard
    C:\Users\admin\AppData\Local\Temp\And717C.tmp\app\ src\main\java\Extensions\CRunGPGLeaderboard.java:6 61: error: cannot find symbol
    int timeSpan = (flgSpan == 0 ? LeaderboardVariant.TIME_SPAN_DAILY : (flgSpan == 1 ? LeaderboardVariant.TIME_SPAN_WEEKLY : LeaderboardVariant.TIME_SPAN_ALL_TIME));
    ^
    symbol: variable LeaderboardVariant
    location: class CRunGPGLeaderboard
    C:\Users\admin\AppData\Local\Temp\And717C.tmp\app\ src\main\java\Extensions\CRunGPGLeaderboard.java:6 62: error: cannot find symbol
    int collection = (flgColl == 0 ? LeaderboardVariant.COLLECTION_PUBLIC: LeaderboardVariant.COLLECTION_SOCIAL);
    ^
    symbol: variable LeaderboardVariant
    location: class CRunGPGLeaderboard
    C:\Users\admin\AppData\Local\Temp\And717C.tmp\app\ src\main\java\Extensions\CRunGPGLeaderboard.java:6 62: error: cannot find symbol
    int collection = (flgColl == 0 ? LeaderboardVariant.COLLECTION_PUBLIC: LeaderboardVariant.COLLECTION_SOCIAL);
    ^
    symbol: variable LeaderboardVariant
    location: class CRunGPGLeaderboard
    C:\Users\admin\AppData\Local\Temp\And717C.tmp\app\ src\main\java\Extensions\CRunGPGLeaderboard.java:6 71: error: package Leaderboards does not exist
    .setResultCallback(new ResultCallback<Leaderboards.LoadPlayerScoreResult> () {
    ^
    C:\Users\admin\AppData\Local\Temp\And717C.tmp\app\ src\main\java\Extensions\CRunGPGLeaderboard.java:6 73: error: package Leaderboards does not exist
    public void onResult(final Leaderboards.LoadPlayerScoreResult scoreResult) {
    ^
    C:\Users\admin\AppData\Local\Temp\And717C.tmp\app\ src\main\java\Extensions\CRunGPGLeaderboard.java:6 70: error: package Games does not exist
    Games.Leaderboards.loadCurrentPlayerLeaderboardSco re(mGoogleApiClient, LEADERBOARD_ID, timeSpan, collection)
    ^
    C:\Users\admin\AppData\Local\Temp\And717C.tmp\app\ src\main\java\Extensions\CRunGPGLeaderboard.java:6 96: error: cannot find symbol
    return scoreResult != null && GamesStatusCodes.STATUS_OK == scoreResult.getStatus().getStatusCode() && scoreResult.getScore() != null;
    ^
    symbol: variable GamesStatusCodes
    location: class CRunGPGLeaderboard
    C:\Users\admin\AppData\Local\Temp\And717C.tmp\app\ src\main\java\Extensions\CRunGPGLeaderboard.java:7 05: error: package Games does not exist
    Games.Leaderboards.getAllLeaderboardsIntent(mGoogl eApiClient), RC_LEADERBOARDS);
    ^
    Note: Some input files use or override a deprecated API.
    Note: Recompile with -Xlint:deprecation for details.
    Note: Some input files use unchecked or unsafe operations.
    Note: Recompile with -Xlint:unchecked for details.
    90 errors

    > Task :app:compileReleaseJavaWithJavac FAILED

    FAILURE: Build failed with an exception.

    * What went wrong:
    Execution failed for task ':app:compileReleaseJavaWithJavac'.
    > Compilation failed; see the compiler error output for details.

    * Try:
    Run with --stacktrace option to get the stack trace. Run with --info or --debug option to get more log output. Run with --scan to get full insights.

    * Get more help at https://help.gradle.org

    Deprecated Gradle features were used in this build, making it incompatible with Gradle 6.0.
    Use '--warning-mode all' to show the individual deprecation warnings.
    See https://docs.gradle.org/5.1.1/usergu..._line_warnings

    BUILD FAILED in 41s
    13 actionable tasks: 13 executed

  4. #124
    Clickteam Clickteam
    Fernando's Avatar
    Join Date
    Dec 2006
    Posts
    6,359
    Mentioned
    218 Post(s)
    Tagged
    4 Thread(s)
    maybe this link will help you

    https://steamcommunity.com/app/248170/discussions/0/1640918469750795515/
    Regards,


    Fernando Vivolo

    ... new things are coming ...

  5. #125
    Clicker Fusion 2.5
    Fusion 2.5 (Steam)Fusion 2.5 Developer (Steam)Android Export Module (Steam)

    Join Date
    Nov 2014
    Posts
    66
    Mentioned
    5 Post(s)
    Tagged
    0 Thread(s)
    Quote Originally Posted by Fernando View Post
    maybe this link will help you

    https://steamcommunity.com/app/248170/discussions/0/1640918469750795515/
    Should I just take this problem there then? I've updated to 292.11, but I keep getting the same error regarding "> Task :app:compileReleaseJavaWithJavac FAILED". I have no idea what that is, and haven't found anything in that thread that could help...so far.

  6. #126
    Clickteam Clickteam
    Fernando's Avatar
    Join Date
    Dec 2006
    Posts
    6,359
    Mentioned
    218 Post(s)
    Tagged
    4 Thread(s)
    @MrJustan you updated to 292.11 and you have the same error

    let checks the points you have made so far:


    • installed java 1.8 and update 221 or better. (not 9)
    • installed android sdk (new one that comes with command line in android studio page).
    • accepted the licenses to use the API.
    • set the new directories in fusion preferences.
    • updated to 292.11 (steam according your badges).




    • you run first a gradle checker (not have this information from you post here).
    • you are running fusion over ???.
    • Where are you located?
    Regards,


    Fernando Vivolo

    ... new things are coming ...

  7. #127
    Clicker Fusion 2.5
    Fusion 2.5 (Steam)Fusion 2.5 Developer (Steam)Android Export Module (Steam)

    Join Date
    Nov 2014
    Posts
    66
    Mentioned
    5 Post(s)
    Tagged
    0 Thread(s)
    EDIT: Double post

  8. #128
    Clicker Fusion 2.5
    Fusion 2.5 (Steam)Fusion 2.5 Developer (Steam)Android Export Module (Steam)

    Join Date
    Nov 2014
    Posts
    66
    Mentioned
    5 Post(s)
    Tagged
    0 Thread(s)
    Quote Originally Posted by Fernando View Post
    @MrJustan you updated to 292.11 and you have the same error

    let checks the points you have made so far:


    • installed java 1.8 and update 221 or better. (not 9)
    • installed android sdk (new one that comes with command line in android studio page).
    • accepted the licenses to use the API.
    • set the new directories in fusion preferences.
    • updated to 292.11 (steam according your badges).




    • you run first a gradle checker (not have this information from you post here).
    • you are running fusion over ???.
    • Where are you located?
    I finally got Gradle up and going, I believe. Fusion is running on Win 8.1, if that's what you're asking, I'm located in Michigan, USA.

    gradle.png

    general pref.png

  9. #129
    Clickteam Clickteam
    Fernando's Avatar
    Join Date
    Dec 2006
    Posts
    6,359
    Mentioned
    218 Post(s)
    Tagged
    4 Thread(s)
    @MrJustan ok so it is working OK then, right?
    Regards,


    Fernando Vivolo

    ... new things are coming ...

  10. #130
    Clicker Fusion 2.5
    Fusion 2.5 (Steam)Fusion 2.5 Developer (Steam)Android Export Module (Steam)

    Join Date
    Nov 2014
    Posts
    66
    Mentioned
    5 Post(s)
    Tagged
    0 Thread(s)
    @Fernando , unfortunately it is not.

Page 13 of 23 FirstFirst ... 3 11 12 13 14 15 ... LastLast

Similar Threads

  1. Users that cannot build with Android Studio (ant\build.xml error)
    By Perry in forum Android Export Module 2.5
    Replies: 102
    Last Post: 28th November 2019, 08:02 PM
  2. Replies: 56
    Last Post: 26th December 2017, 09:53 PM
  3. Cannot build my Android app (ant/build.xml error)
    By oaklan5 in forum Fusion 2.5
    Replies: 1
    Last Post: 27th July 2017, 07:59 PM
  4. Replies: 15
    Last Post: 27th November 2014, 11:08 AM

Posting Permissions

  • You may not post new threads
  • You may not post replies
  • You may not post attachments
  • You may not edit your posts
  •