User Tag List

Page 29 of 32 FirstFirst ... 19 27 28 29 30 31 ... LastLast
Results 281 to 290 of 313

Thread: Android Runtime - Build 292

  1. #281
    Clicker Fusion 2.5 DeveloperAndroid Export ModuleiOS Export Module
    VBEinc's Avatar
    Join Date
    Oct 2015
    Posts
    496
    Mentioned
    12 Post(s)
    Tagged
    0 Thread(s)
    Quote Originally Posted by Fernando View Post
    Hi,

    Please check that you have the latest version of android studio, the latest patch of fusion installed after installing the MMF dev + android exporter.

    This could be related to several things

    1.- using an old gradlew wrapper (the latest patch will solve this)

    2.- JDK open a CMD windows and run javac -version, the latest version of Gradlew use version 302 your is 152, check that android studio is the latest version.
    WINNER! Android Studio was the cause yet again. Thank you Fernando

  2. #282
    Clicker Fusion 2.5 DeveloperAndroid Export ModuleiOS Export Module

    Join Date
    Jun 2015
    Posts
    105
    Mentioned
    2 Post(s)
    Tagged
    0 Thread(s)
    Not sure if this is the correct place for this questions but it's similar issue:

    Build failed with GPGConnect in project. Build successful otherwise.

    Version 2.5+ (Build R293.10) (Dec 3 2021)
    GPGConnect ojbect V-2.0e
    Build293.7orAbove_211022
    javac 16.0.2
    jdk1.8.0_221
    Android Studio android-32
    Artic Fox 2020.3.1 Patch 4 (latest update checked)


    Warning: Mapping new ns http://schemas.android.com/repository/android/common/02 to old ns http://schemas.android.com/repository/android/common/01
    Warning: Mapping new ns http://schemas.android.com/repositor...oid/generic/02 to old ns http://schemas.android.com/repositor...oid/generic/01
    Warning: Mapping new ns http://schemas.android.com/sdk/android/repo/addon2/02 to old ns http://schemas.android.com/sdk/android/repo/addon2/01
    Warning: Mapping new ns http://schemas.android.com/sdk/andro...repository2/02 to old ns http://schemas.android.com/sdk/andro...repository2/01
    Warning: Mapping new ns http://schemas.android.com/sdk/android/repo/sys-img2/02 to old ns http://schemas.android.com/sdk/android/repo/sys-img2/01
    > Task :app:preBuild UP-TO-DATE
    > Task :app:preReleaseBuild UP-TO-DATE
    > Task :app:writeReleaseApplicationId
    > Task :app:analyticsRecordingRelease
    > Task :app:compileReleaseRenderscript NO-SOURCE
    > Task :app:generateReleaseResValues
    > Task :app:generateReleaseResources
    > Task :app:createReleaseCompatibleScreenManifests
    > Task :app:extractDeepLinksRelease
    > Task :app:processReleaseMainManifest
    > Task :app:processReleaseManifest
    > Task :app:processApplicationManifestReleaseForBundle
    > Task :app:compileReleaseAidl NO-SOURCE
    > Task :app:generateReleaseBuildConfig
    > Task :app:javaPreCompileRelease
    > Task :app:checkReleaseAarMetadata
    > Task :app:checkReleaseDuplicateClasses
    > Task :app:mergeReleaseShaders
    > Task :app:compileReleaseShaders NO-SOURCE
    > Task :app:generateReleaseAssets UP-TO-DATE
    > Task :app:mergeReleaseAssets
    > Task :app:processReleaseJavaRes NO-SOURCE
    > Task :app:mergeReleaseJniLibFolders
    > Task :app:desugarReleaseFileDependencies
    > Task :app:mergeReleaseResources
    > Task :app:collectReleaseDependencies
    > Task :app:configureReleaseDependencies
    > Task :app:parseReleaseIntegrityConfig
    > Task :app:writeReleaseAppMetadata
    > Task :app:validateSigningRelease
    > Task :app:processReleaseManifestForPackage
    > Task :app:mergeReleaseJavaResource
    > Task :app:mergeReleaseNativeLibs

    > Task :app:stripReleaseDebugSymbols
    Unable to strip the following libraries, packaging them as they are: libES1Renderer.so, libES2Renderer.so, libES3Renderer.so, libRuntimeNative.so, libgdx.so.

    > Task :app:extractReleaseNativeSymbolTables
    Unable to extract native debug metadata from C:\Users\Protoman\AppData\Local\Temp\And85E1.tmp\a pp\build\intermediates\merged_native_libs\release\ out\lib\arm64-v8a\libES1Renderer.so because unable to locate the objcopy executable for the arm64-v8a ABI.
    Unable to extract native debug metadata from C:\Users\Protoman\AppData\Local\Temp\And85E1.tmp\a pp\build\intermediates\merged_native_libs\release\ out\lib\arm64-v8a\libES2Renderer.so because unable to locate the objcopy executable for the arm64-v8a ABI.
    Unable to extract native debug metadata from C:\Users\Protoman\AppData\Local\Temp\And85E1.tmp\a pp\build\intermediates\merged_native_libs\release\ out\lib\arm64-v8a\libES3Renderer.so because unable to locate the objcopy executable for the arm64-v8a ABI.
    Unable to extract native debug metadata from C:\Users\Protoman\AppData\Local\Temp\And85E1.tmp\a pp\build\intermediates\merged_native_libs\release\ out\lib\arm64-v8a\libgdx.so because unable to locate the objcopy executable for the arm64-v8a ABI.
    Unable to extract native debug metadata from C:\Users\Protoman\AppData\Local\Temp\And85E1.tmp\a pp\build\intermediates\merged_native_libs\release\ out\lib\arm64-v8a\libRuntimeNative.so because unable to locate the objcopy executable for the arm64-v8a ABI.
    Unable to extract native debug metadata from C:\Users\Protoman\AppData\Local\Temp\And85E1.tmp\a pp\build\intermediates\merged_native_libs\release\ out\lib\armeabi-v7a\libES1Renderer.so because unable to locate the objcopy executable for the armeabi-v7a ABI.
    Unable to extract native debug metadata from C:\Users\Protoman\AppData\Local\Temp\And85E1.tmp\a pp\build\intermediates\merged_native_libs\release\ out\lib\armeabi-v7a\libES2Renderer.so because unable to locate the objcopy executable for the armeabi-v7a ABI.
    Unable to extract native debug metadata from C:\Users\Protoman\AppData\Local\Temp\And85E1.tmp\a pp\build\intermediates\merged_native_libs\release\ out\lib\armeabi-v7a\libES3Renderer.so because unable to locate the objcopy executable for the armeabi-v7a ABI.
    Unable to extract native debug metadata from C:\Users\Protoman\AppData\Local\Temp\And85E1.tmp\a pp\build\intermediates\merged_native_libs\release\ out\lib\armeabi-v7a\libgdx.so because unable to locate the objcopy executable for the armeabi-v7a ABI.
    Unable to extract native debug metadata from C:\Users\Protoman\AppData\Local\Temp\And85E1.tmp\a pp\build\intermediates\merged_native_libs\release\ out\lib\armeabi-v7a\libRuntimeNative.so because unable to locate the objcopy executable for the armeabi-v7a ABI.
    Unable to extract native debug metadata from C:\Users\Protoman\AppData\Local\Temp\And85E1.tmp\a pp\build\intermediates\merged_native_libs\release\ out\lib\x86\libES1Renderer.so because unable to locate the objcopy executable for the x86 ABI.
    Unable to extract native debug metadata from C:\Users\Protoman\AppData\Local\Temp\And85E1.tmp\a pp\build\intermediates\merged_native_libs\release\ out\lib\x86\libES2Renderer.so because unable to locate the objcopy executable for the x86 ABI.
    Unable to extract native debug metadata from C:\Users\Protoman\AppData\Local\Temp\And85E1.tmp\a pp\build\intermediates\merged_native_libs\release\ out\lib\x86\libES3Renderer.so because unable to locate the objcopy executable for the x86 ABI.
    Unable to extract native debug metadata from C:\Users\Protoman\AppData\Local\Temp\And85E1.tmp\a pp\build\intermediates\merged_native_libs\release\ out\lib\x86\libgdx.so because unable to locate the objcopy executable for the x86 ABI.
    Unable to extract native debug metadata from C:\Users\Protoman\AppData\Local\Temp\And85E1.tmp\a pp\build\intermediates\merged_native_libs\release\ out\lib\x86\libRuntimeNative.so because unable to locate the objcopy executable for the x86 ABI.
    Unable to extract native debug metadata from C:\Users\Protoman\AppData\Local\Temp\And85E1.tmp\a pp\build\intermediates\merged_native_libs\release\ out\lib\x86_64\libES1Renderer.so because unable to locate the objcopy executable for the x86_64 ABI.
    Unable to extract native debug metadata from C:\Users\Protoman\AppData\Local\Temp\And85E1.tmp\a pp\build\intermediates\merged_native_libs\release\ out\lib\x86_64\libES2Renderer.so because unable to locate the objcopy executable for the x86_64 ABI.
    Unable to extract native debug metadata from C:\Users\Protoman\AppData\Local\Temp\And85E1.tmp\a pp\build\intermediates\merged_native_libs\release\ out\lib\x86_64\libES3Renderer.so because unable to locate the objcopy executable for the x86_64 ABI.
    Unable to extract native debug metadata from C:\Users\Protoman\AppData\Local\Temp\And85E1.tmp\a pp\build\intermediates\merged_native_libs\release\ out\lib\x86_64\libgdx.so because unable to locate the objcopy executable for the x86_64 ABI.
    Unable to extract native debug metadata from C:\Users\Protoman\AppData\Local\Temp\And85E1.tmp\a pp\build\intermediates\merged_native_libs\release\ out\lib\x86_64\libRuntimeNative.so because unable to locate the objcopy executable for the x86_64 ABI.
    aapt2.exe W 01-22 10:03:31 9368 15888 LoadedArsc.cpp:682] Unknown chunk type '200'.

    aapt2.exe W 01-22 10:03:31 14508 14500 LoadedArsc.cpp:682] Unknown chunk type '200'.


    > Task :app:bundleReleaseResources
    > Task :app:mergeExtDexRelease
    > Task :app:processReleaseResources

    > Task :app:compileReleaseJavaWithJavac FAILED
    An exception has occurred in the compiler (1.8.0_221). Please file a bug against the Java compiler via the Java bug reporting page (http://bugreport.java.com) after checking the Bug Database (http://bugs.java.com) for duplicates. Include your program and the following diagnostic in your report. Thank you.
    java.lang.AssertionError: annotationType(): unrecognized Attribute name MODULE (class com.sun.tools.javac.util.UnsharedNameTable$NameImp l)
    at com.sun.tools.javac.util.Assert.error(Assert.java: 133)
    at com.sun.tools.javac.code.TypeAnnotations.annotatio nType(TypeAnnotations.java:231)
    at com.sun.tools.javac.code.TypeAnnotations$TypeAnnot ationPositions.separateAnnotationsKinds(TypeAnnota tions.java:294)
    at com.sun.tools.javac.code.TypeAnnotations$TypeAnnot ationPositions.visitMethodDef(TypeAnnotations.java :1066)
    at com.sun.tools.javac.tree.JCTree$JCMethodDecl.accep t(JCTree.java:778)
    at com.sun.tools.javac.tree.TreeScanner.scan(TreeScan ner.java:49)
    at com.sun.tools.javac.code.TypeAnnotations$TypeAnnot ationPositions.scan(TypeAnnotations.java:275)
    at com.sun.tools.javac.tree.TreeScanner.scan(TreeScan ner.java:57)
    at com.sun.tools.javac.code.TypeAnnotations$TypeAnnot ationPositions.visitClassDef(TypeAnnotations.java: 1042)
    at com.sun.tools.javac.tree.JCTree$JCClassDecl.accept (JCTree.java:693)
    at com.sun.tools.javac.tree.TreeScanner.scan(TreeScan ner.java:49)
    at com.sun.tools.javac.code.TypeAnnotations$TypeAnnot ationPositions.scan(TypeAnnotations.java:275)
    at com.sun.tools.javac.code.TypeAnnotations$1.run(Typ eAnnotations.java:127)
    at com.sun.tools.javac.comp.Annotate.flush(Annotate.j ava:152)
    at com.sun.tools.javac.comp.Annotate.enterDone(Annota te.java:129)
    at com.sun.tools.javac.comp.Enter.complete(Enter.java :512)
    at com.sun.tools.javac.comp.Enter.main(Enter.java:471 )
    at com.sun.tools.javac.main.JavaCompiler.enterTrees(J avaCompiler.java:982)
    at com.sun.tools.javac.main.JavaCompiler.compile(Java Compiler.java:857)
    at com.sun.tools.javac.main.Main.compile(Main.java:52 3)
    at com.sun.tools.javac.api.JavacTaskImpl.doCall(Javac TaskImpl.java:129)
    at com.sun.tools.javac.api.JavacTaskImpl.call(JavacTa skImpl.java:138)
    at org.gradle.internal.compiler.java.IncrementalCompi leTask.call(IncrementalCompileTask.java:77)
    at org.gradle.api.internal.tasks.compile.AnnotationPr ocessingCompileTask.call(AnnotationProcessingCompi leTask.java:94)
    at org.gradle.api.internal.tasks.compile.ResourceClea ningCompilationTask.call(ResourceCleaningCompilati onTask.java:57)
    at org.gradle.api.internal.tasks.compile.JdkJavaCompi ler.execute(JdkJavaCompiler.java:55)
    at org.gradle.api.internal.tasks.compile.JdkJavaCompi ler.execute(JdkJavaCompiler.java:40)
    at org.gradle.api.internal.tasks.compile.NormalizingJ avaCompiler.delegateAndHandleErrors(NormalizingJav aCompiler.java:97)
    at org.gradle.api.internal.tasks.compile.NormalizingJ avaCompiler.execute(NormalizingJavaCompiler.java:5 1)
    at org.gradle.api.internal.tasks.compile.NormalizingJ avaCompiler.execute(NormalizingJavaCompiler.java:3 7)
    at org.gradle.api.internal.tasks.compile.AnnotationPr ocessorDiscoveringCompiler.execute(AnnotationProce ssorDiscoveringCompiler.java:51)
    at org.gradle.api.internal.tasks.compile.AnnotationPr ocessorDiscoveringCompiler.execute(AnnotationProce ssorDiscoveringCompiler.java:37)
    at org.gradle.api.internal.tasks.compile.ModuleApplic ationNameWritingCompiler.execute(ModuleApplication NameWritingCompiler.java:46)
    at org.gradle.api.internal.tasks.compile.ModuleApplic ationNameWritingCompiler.execute(ModuleApplication NameWritingCompiler.java:36)
    at org.gradle.jvm.toolchain.internal.DefaultToolchain JavaCompiler.execute(DefaultToolchainJavaCompiler. java:57)
    at org.gradle.api.tasks.compile.JavaCompile.lambda$cr eateToolchainCompiler$1(JavaCompile.java:251)
    at org.gradle.api.internal.tasks.compile.CleaningJava Compiler.execute(CleaningJavaCompiler.java:53)
    at org.gradle.api.internal.tasks.compile.incremental. IncrementalCompilerFactory.lambda$createRebuildAll Compiler$0(IncrementalCompilerFactory.java:98)
    at org.gradle.api.internal.tasks.compile.incremental. IncrementalResultStoringCompiler.execute(Increment alResultStoringCompiler.java:61)
    at org.gradle.api.internal.tasks.compile.incremental. IncrementalResultStoringCompiler.execute(Increment alResultStoringCompiler.java:45)
    at org.gradle.api.internal.tasks.compile.CompileJavaB uildOperationReportingCompiler$2.call(CompileJavaB uildOperationReportingCompiler.java:59)
    at org.gradle.api.internal.tasks.compile.CompileJavaB uildOperationReportingCompiler$2.call(CompileJavaB uildOperationReportingCompiler.java:51)
    at org.gradle.internal.operations.DefaultBuildOperati onRunner$CallableBuildOperationWorker.execute(Defa ultBuildOperationRunner.java:200)
    at org.gradle.internal.operations.DefaultBuildOperati onRunner$CallableBuildOperationWorker.execute(Defa ultBuildOperationRunner.java:195)
    at org.gradle.internal.operations.DefaultBuildOperati onRunner$3.execute(DefaultBuildOperationRunner.jav a:75)
    at org.gradle.internal.operations.DefaultBuildOperati onRunner$3.execute(DefaultBuildOperationRunner.jav a:68)
    at org.gradle.internal.operations.DefaultBuildOperati onRunner.execute(DefaultBuildOperationRunner.java: 153)
    at org.gradle.internal.operations.DefaultBuildOperati onRunner.execute(DefaultBuildOperationRunner.java: 68)
    at org.gradle.internal.operations.DefaultBuildOperati onRunner.call(DefaultBuildOperationRunner.java:62)
    at org.gradle.internal.operations.DefaultBuildOperati onExecutor.lambda$call$2(DefaultBuildOperationExec utor.java:76)
    at org.gradle.internal.operations.UnmanagedBuildOpera tionWrapper.callWithUnmanagedSupport(UnmanagedBuil dOperationWrapper.java:54)
    at org.gradle.internal.operations.DefaultBuildOperati onExecutor.call(DefaultBuildOperationExecutor.java :76)
    at org.gradle.api.internal.tasks.compile.CompileJavaB uildOperationReportingCompiler.execute(CompileJava BuildOperationReportingCompiler.java:51)
    at org.gradle.api.tasks.compile.JavaCompile.performCo mpilation(JavaCompile.java:300)
    at org.gradle.api.tasks.compile.JavaCompile.performIn crementalCompilation(JavaCompile.java:179)
    at org.gradle.api.tasks.compile.JavaCompile.compile(J avaCompile.java:152)
    at sun.reflect.NativeMethodAccessorImpl.invoke0(Nativ e Method)
    at sun.reflect.NativeMethodAccessorImpl.invoke(Native MethodAccessorImpl.java:62)
    at sun.reflect.DelegatingMethodAccessorImpl.invoke(De legatingMethodAccessorImpl.java:43)
    at java.lang.reflect.Method.invoke(Method.java:498)
    at org.gradle.internal.reflect.JavaMethod.invoke(Java Method.java:104)
    at org.gradle.api.internal.project.taskfactory.Increm entalInputsTaskAction.doExecute(IncrementalInputsT askAction.java:32)
    at org.gradle.api.internal.project.taskfactory.Standa rdTaskAction.execute(StandardTaskAction.java:51)
    at org.gradle.api.internal.project.taskfactory.Abstra ctIncrementalTaskAction.execute(AbstractIncrementa lTaskAction.java:25)
    at org.gradle.api.internal.project.taskfactory.Standa rdTaskAction.execute(StandardTaskAction.java:29)
    at org.gradle.api.internal.tasks.execution.ExecuteAct ionsTaskExecuter$2.run(ExecuteActionsTaskExecuter. java:498)
    at org.gradle.internal.operations.DefaultBuildOperati onRunner$1.execute(DefaultBuildOperationRunner.jav a:29)
    at org.gradle.internal.operations.DefaultBuildOperati onRunner$1.execute(DefaultBuildOperationRunner.jav a:26)
    at org.gradle.internal.operations.DefaultBuildOperati onRunner$3.execute(DefaultBuildOperationRunner.jav a:75)
    at org.gradle.internal.operations.DefaultBuildOperati onRunner$3.execute(DefaultBuildOperationRunner.jav a:68)
    at org.gradle.internal.operations.DefaultBuildOperati onRunner.execute(DefaultBuildOperationRunner.java: 153)
    at org.gradle.internal.operations.DefaultBuildOperati onRunner.execute(DefaultBuildOperationRunner.java: 68)
    at org.gradle.internal.operations.DefaultBuildOperati onRunner.run(DefaultBuildOperationRunner.java:56)
    at org.gradle.internal.operations.DefaultBuildOperati onExecutor.lambda$run$1(DefaultBuildOperationExecu tor.java:71)
    at org.gradle.internal.operations.UnmanagedBuildOpera tionWrapper.runWithUnmanagedSupport(UnmanagedBuild OperationWrapper.java:45)
    at org.gradle.internal.operations.DefaultBuildOperati onExecutor.run(DefaultBuildOperationExecutor.java: 71)
    at org.gradle.api.internal.tasks.execution.ExecuteAct ionsTaskExecuter.executeAction(ExecuteActionsTaskE xecuter.java:483)
    at org.gradle.api.internal.tasks.execution.ExecuteAct ionsTaskExecuter.executeActions(ExecuteActionsTask Executer.java:466)
    at org.gradle.api.internal.tasks.execution.ExecuteAct ionsTaskExecuter.access$300(ExecuteActionsTaskExec uter.java:105)
    at org.gradle.api.internal.tasks.execution.ExecuteAct ionsTaskExecuter$TaskExecution.executeWithPrevious OutputFiles(ExecuteActionsTaskExecuter.java:270)
    at org.gradle.api.internal.tasks.execution.ExecuteAct ionsTaskExecuter$TaskExecution.execute(ExecuteActi onsTaskExecuter.java:248)
    at org.gradle.internal.execution.steps.ExecuteStep.ex ecuteInternal(ExecuteStep.java:83)
    at org.gradle.internal.execution.steps.ExecuteStep.ac cess$000(ExecuteStep.java:37)
    at org.gradle.internal.execution.steps.ExecuteStep$1. call(ExecuteStep.java:50)
    at org.gradle.internal.execution.steps.ExecuteStep$1. call(ExecuteStep.java:47)
    at org.gradle.internal.operations.DefaultBuildOperati onRunner$CallableBuildOperationWorker.execute(Defa ultBuildOperationRunner.java:200)
    at org.gradle.internal.operations.DefaultBuildOperati onRunner$CallableBuildOperationWorker.execute(Defa ultBuildOperationRunner.java:195)
    at org.gradle.internal.operations.DefaultBuildOperati onRunner$3.execute(DefaultBuildOperationRunner.jav a:75)
    at org.gradle.internal.operations.DefaultBuildOperati onRunner$3.execute(DefaultBuildOperationRunner.jav a:68)
    at org.gradle.internal.operations.DefaultBuildOperati onRunner.execute(DefaultBuildOperationRunner.java: 153)
    at org.gradle.internal.operations.DefaultBuildOperati onRunner.execute(DefaultBuildOperationRunner.java: 68)
    at org.gradle.internal.operations.DefaultBuildOperati onRunner.call(DefaultBuildOperationRunner.java:62)
    at org.gradle.internal.operations.DefaultBuildOperati onExecutor.lambda$call$2(DefaultBuildOperationExec utor.java:76)
    at org.gradle.internal.operations.UnmanagedBuildOpera tionWrapper.callWithUnmanagedSupport(UnmanagedBuil dOperationWrapper.java:54)
    at org.gradle.internal.operations.DefaultBuildOperati onExecutor.call(DefaultBuildOperationExecutor.java :76)
    at org.gradle.internal.execution.steps.ExecuteStep.ex ecute(ExecuteStep.java:47)
    at org.gradle.internal.execution.steps.ExecuteStep.ex ecute(ExecuteStep.java:37)
    at org.gradle.internal.execution.steps.RemovePrevious OutputsStep.execute(RemovePreviousOutputsStep.java :68)
    at org.gradle.internal.execution.steps.RemovePrevious OutputsStep.execute(RemovePreviousOutputsStep.java :38)
    at org.gradle.internal.execution.steps.ResolveInputCh angesStep.execute(ResolveInputChangesStep.java:50)
    at org.gradle.internal.execution.steps.ResolveInputCh angesStep.execute(ResolveInputChangesStep.java:36)
    at org.gradle.internal.execution.steps.CancelExecutio nStep.execute(CancelExecutionStep.java:41)
    at org.gradle.internal.execution.steps.TimeoutStep.ex ecuteWithoutTimeout(TimeoutStep.java:74)
    at org.gradle.internal.execution.steps.TimeoutStep.ex ecute(TimeoutStep.java:55)
    at org.gradle.internal.execution.steps.CreateOutputsS tep.execute(CreateOutputsStep.java:51)
    at org.gradle.internal.execution.steps.CreateOutputsS tep.execute(CreateOutputsStep.java:29)
    at org.gradle.internal.execution.steps.CaptureStateAf terExecutionStep.execute(CaptureStateAfterExecutio nStep.java:54)
    at org.gradle.internal.execution.steps.CaptureStateAf terExecutionStep.execute(CaptureStateAfterExecutio nStep.java:35)
    at org.gradle.internal.execution.steps.BroadcastChang ingOutputsStep.execute(BroadcastChangingOutputsSte p.java:60)
    at org.gradle.internal.execution.steps.BroadcastChang ingOutputsStep.execute(BroadcastChangingOutputsSte p.java:27)
    at org.gradle.internal.execution.steps.BuildCacheStep .executeWithoutCache(BuildCacheStep.java:174)
    at org.gradle.internal.execution.steps.BuildCacheStep .execute(BuildCacheStep.java:74)
    at org.gradle.internal.execution.steps.BuildCacheStep .execute(BuildCacheStep.java:45)
    at org.gradle.internal.execution.steps.StoreExecution StateStep.execute(StoreExecutionStateStep.java:40)
    at org.gradle.internal.execution.steps.StoreExecution StateStep.execute(StoreExecutionStateStep.java:29)
    at org.gradle.internal.execution.steps.RecordOutputsS tep.execute(RecordOutputsStep.java:36)
    at org.gradle.internal.execution.steps.RecordOutputsS tep.execute(RecordOutputsStep.java:22)
    at org.gradle.internal.execution.steps.SkipUpToDateSt ep.executeBecause(SkipUpToDateStep.java:99)
    at org.gradle.internal.execution.steps.SkipUpToDateSt ep.lambda$execute$0(SkipUpToDateStep.java:92)
    at java.util.Optional.map(Optional.java:215)
    at org.gradle.internal.execution.steps.SkipUpToDateSt ep.execute(SkipUpToDateStep.java:52)
    at org.gradle.internal.execution.steps.SkipUpToDateSt ep.execute(SkipUpToDateStep.java:36)
    at org.gradle.internal.execution.steps.ResolveChanges Step.execute(ResolveChangesStep.java:84)
    at org.gradle.internal.execution.steps.ResolveChanges Step.execute(ResolveChangesStep.java:41)
    at org.gradle.internal.execution.steps.legacy.MarkSna pshottingInputsFinishedStep.execute(MarkSnapshotti ngInputsFinishedStep.java:37)
    at org.gradle.internal.execution.steps.legacy.MarkSna pshottingInputsFinishedStep.execute(MarkSnapshotti ngInputsFinishedStep.java:27)
    at org.gradle.internal.execution.steps.ResolveCaching StateStep.execute(ResolveCachingStateStep.java:91)
    at org.gradle.internal.execution.steps.ResolveCaching StateStep.execute(ResolveCachingStateStep.java:49)
    at org.gradle.internal.execution.steps.CaptureStateBe foreExecutionStep.execute(CaptureStateBeforeExecut ionStep.java:78)
    at org.gradle.internal.execution.steps.CaptureStateBe foreExecutionStep.execute(CaptureStateBeforeExecut ionStep.java:49)
    at org.gradle.internal.execution.steps.ValidateStep.e xecute(ValidateStep.java:105)
    at org.gradle.internal.execution.steps.ValidateStep.e xecute(ValidateStep.java:50)
    at org.gradle.internal.execution.steps.SkipEmptyWorkS tep.lambda$execute$2(SkipEmptyWorkStep.java:86)
    at java.util.Optional.orElseGet(Optional.java:267)
    at org.gradle.internal.execution.steps.SkipEmptyWorkS tep.execute(SkipEmptyWorkStep.java:86)
    at org.gradle.internal.execution.steps.SkipEmptyWorkS tep.execute(SkipEmptyWorkStep.java:32)
    at org.gradle.internal.execution.steps.legacy.MarkSna pshottingInputsStartedStep.execute(MarkSnapshottin gInputsStartedStep.java:38)
    at org.gradle.internal.execution.steps.LoadExecutionS tateStep.execute(LoadExecutionStateStep.java:43)
    at org.gradle.internal.execution.steps.LoadExecutionS tateStep.execute(LoadExecutionStateStep.java:31)
    at org.gradle.internal.execution.steps.AssignWorkspac eStep.lambda$execute$0(AssignWorkspaceStep.java:40 )
    at org.gradle.api.internal.tasks.execution.ExecuteAct ionsTaskExecuter$TaskExecution$2.withWorkspace(Exe cuteActionsTaskExecuter.java:283)
    at org.gradle.internal.execution.steps.AssignWorkspac eStep.execute(AssignWorkspaceStep.java:40)
    at org.gradle.internal.execution.steps.AssignWorkspac eStep.execute(AssignWorkspaceStep.java:30)
    at org.gradle.internal.execution.steps.IdentityCacheS tep.execute(IdentityCacheStep.java:37)
    at org.gradle.internal.execution.steps.IdentityCacheS tep.execute(IdentityCacheStep.java:27)
    at org.gradle.internal.execution.steps.IdentifyStep.e xecute(IdentifyStep.java:49)
    at org.gradle.internal.execution.steps.IdentifyStep.e xecute(IdentifyStep.java:35)
    at org.gradle.internal.execution.impl.DefaultExecutio nEngine$1.execute(DefaultExecutionEngine.java:76)
    at org.gradle.api.internal.tasks.execution.ExecuteAct ionsTaskExecuter.executeIfValid(ExecuteActionsTask Executer.java:184)
    at org.gradle.api.internal.tasks.execution.ExecuteAct ionsTaskExecuter.execute(ExecuteActionsTaskExecute r.java:173)
    at org.gradle.api.internal.tasks.execution.CleanupSta leOutputsExecuter.execute(CleanupStaleOutputsExecu ter.java:109)
    at org.gradle.api.internal.tasks.execution.FinalizePr opertiesTaskExecuter.execute(FinalizePropertiesTas kExecuter.java:46)
    at org.gradle.api.internal.tasks.execution.ResolveTas kExecutionModeExecuter.execute(ResolveTaskExecutio nModeExecuter.java:51)
    at org.gradle.api.internal.tasks.execution.SkipTaskWi thNoActionsExecuter.execute(SkipTaskWithNoActionsE xecuter.java:57)
    at org.gradle.api.internal.tasks.execution.SkipOnlyIf TaskExecuter.execute(SkipOnlyIfTaskExecuter.java:5 6)
    at org.gradle.api.internal.tasks.execution.CatchExcep tionTaskExecuter.execute(CatchExceptionTaskExecute r.java:36)
    at org.gradle.api.internal.tasks.execution.EventFirin gTaskExecuter$1.executeTask(EventFiringTaskExecute r.java:77)
    at org.gradle.api.internal.tasks.execution.EventFirin gTaskExecuter$1.call(EventFiringTaskExecuter.java: 55)
    at org.gradle.api.internal.tasks.execution.EventFirin gTaskExecuter$1.call(EventFiringTaskExecuter.java: 52)
    at org.gradle.internal.operations.DefaultBuildOperati onRunner$CallableBuildOperationWorker.execute(Defa ultBuildOperationRunner.java:200)
    at org.gradle.internal.operations.DefaultBuildOperati onRunner$CallableBuildOperationWorker.execute(Defa ultBuildOperationRunner.java:195)
    at org.gradle.internal.operations.DefaultBuildOperati onRunner$3.execute(DefaultBuildOperationRunner.jav a:75)
    at org.gradle.internal.operations.DefaultBuildOperati onRunner$3.execute(DefaultBuildOperationRunner.jav a:68)
    at org.gradle.internal.operations.DefaultBuildOperati onRunner.execute(DefaultBuildOperationRunner.java: 153)
    at org.gradle.internal.operations.DefaultBuildOperati onRunner.execute(DefaultBuildOperationRunner.java: 68)
    at org.gradle.internal.operations.DefaultBuildOperati onRunner.call(DefaultBuildOperationRunner.java:62)
    at org.gradle.internal.operations.DefaultBuildOperati onExecutor.lambda$call$2(DefaultBuildOperationExec utor.java:76)
    at org.gradle.internal.operations.UnmanagedBuildOpera tionWrapper.callWithUnmanagedSupport(UnmanagedBuil dOperationWrapper.java:54)
    at org.gradle.internal.operations.DefaultBuildOperati onExecutor.call(DefaultBuildOperationExecutor.java :76)
    at org.gradle.api.internal.tasks.execution.EventFirin gTaskExecuter.execute(EventFiringTaskExecuter.java :52)
    at org.gradle.execution.plan.LocalTaskNodeExecutor.ex ecute(LocalTaskNodeExecutor.java:74)
    at org.gradle.execution.taskgraph.DefaultTaskExecutio nGraph$InvokeNodeExecutorsAction.execute(DefaultTa skExecutionGraph.java:408)
    at org.gradle.execution.taskgraph.DefaultTaskExecutio nGraph$InvokeNodeExecutorsAction.execute(DefaultTa skExecutionGraph.java:395)
    at org.gradle.execution.taskgraph.DefaultTaskExecutio nGraph$BuildOperationAwareExecutionAction.execute( DefaultTaskExecutionGraph.java:388)
    at org.gradle.execution.taskgraph.DefaultTaskExecutio nGraph$BuildOperationAwareExecutionAction.execute( DefaultTaskExecutionGraph.java:374)
    at org.gradle.execution.plan.DefaultPlanExecutor$Exec utorWorker.lambda$run$0(DefaultPlanExecutor.java:1 27)
    at org.gradle.execution.plan.DefaultPlanExecutor$Exec utorWorker.execute(DefaultPlanExecutor.java:191)
    at org.gradle.execution.plan.DefaultPlanExecutor$Exec utorWorker.executeNextNode(DefaultPlanExecutor.jav a:182)
    at org.gradle.execution.plan.DefaultPlanExecutor$Exec utorWorker.run(DefaultPlanExecutor.java:124)
    at org.gradle.internal.concurrent.ExecutorPolicy$Catc hAndRecordFailures.onExecute(ExecutorPolicy.java:6 4)
    at org.gradle.internal.concurrent.ManagedExecutorImpl $1.run(ManagedExecutorImpl.java:48)
    at java.util.concurrent.ThreadPoolExecutor.runWorker( ThreadPoolExecutor.java:1149)
    at java.util.concurrent.ThreadPoolExecutor$Worker.run (ThreadPoolExecutor.java:624)
    at org.gradle.internal.concurrent.ThreadFactoryImpl$M anagedThreadRunnable.run(ThreadFactoryImpl.java:56 )
    at java.lang.Thread.run(Thread.java:748)

    FAILURE: Build failed with an exception.

    * What went wrong:
    Execution failed for task ':app:compileReleaseJavaWithJavac'.
    > Compilation failed; see the compiler error output for details.

    * Try:
    Run with --stacktrace option to get the stack trace. Run with --info or --debug option to get more log output. Run with --scan to get full insights.

    * Get more help at https://help.gradle.org

    BUILD FAILED in 4s
    31 actionable tasks: 31 executed

  3. #283
    Clicker Fusion 2.5 DeveloperAndroid Export ModuleiOS Export Module

    Join Date
    Jun 2015
    Posts
    105
    Mentioned
    2 Post(s)
    Tagged
    0 Thread(s)
    Sorry... just tried the latest Java... STILL error - I can not edit my previous post or delete it so I am making another:

    Starting a Gradle Daemon, 3 incompatible Daemons could not be reused, use --status for details
    Warning: Mapping new ns http://schemas.android.com/repository/android/common/02 to old ns http://schemas.android.com/repository/android/common/01
    Warning: Mapping new ns http://schemas.android.com/repositor...oid/generic/02 to old ns http://schemas.android.com/repositor...oid/generic/01
    Warning: Mapping new ns http://schemas.android.com/sdk/android/repo/addon2/02 to old ns http://schemas.android.com/sdk/android/repo/addon2/01
    Warning: Mapping new ns http://schemas.android.com/sdk/andro...repository2/02 to old ns http://schemas.android.com/sdk/andro...repository2/01
    Warning: Mapping new ns http://schemas.android.com/sdk/android/repo/sys-img2/02 to old ns http://schemas.android.com/sdk/android/repo/sys-img2/01
    > Task :app:preBuild UP-TO-DATE
    > Task :app:preReleaseBuild UP-TO-DATE
    > Task :app:writeReleaseApplicationId
    > Task :app:analyticsRecordingRelease
    > Task :app:compileReleaseRenderscript NO-SOURCE
    > Task :app:generateReleaseResValues
    > Task :app:generateReleaseResources
    > Task :app:createReleaseCompatibleScreenManifests
    > Task :app:extractDeepLinksRelease
    > Task :app:processReleaseMainManifest
    > Task :app:mergeReleaseResources
    > Task :app:processReleaseManifest
    > Task :app:processApplicationManifestReleaseForBundle
    > Task :app:compileReleaseAidl NO-SOURCE
    > Task :app:generateReleaseBuildConfig
    > Task :app:checkReleaseDuplicateClasses
    > Task :app:javaPreCompileRelease
    > Task :app:checkReleaseAarMetadata
    > Task :app:mergeReleaseShaders
    > Task :app:compileReleaseShaders NO-SOURCE
    > Task :app:generateReleaseAssets UP-TO-DATE
    > Task :app:mergeReleaseAssets
    > Task :app:processReleaseJavaRes NO-SOURCE
    > Task :app:mergeReleaseJniLibFolders
    > Task :app:collectReleaseDependencies
    > Task :app:configureReleaseDependencies
    > Task :app:parseReleaseIntegrityConfig
    > Task :app:writeReleaseAppMetadata
    > Task :app:validateSigningRelease
    > Task :app:processReleaseManifestForPackage
    > Task :app:desugarReleaseFileDependencies
    aapt2.exe W 01-22 10:20:21 13204 15064 LoadedArsc.cpp:682] Unknown chunk type '200'.

    > Task :app:bundleReleaseResources
    > Task :app:mergeReleaseNativeLibs
    > Task :app:mergeReleaseJavaResource

    > Task :app:stripReleaseDebugSymbols
    Unable to strip the following libraries, packaging them as they are: libES1Renderer.so, libES2Renderer.so, libES3Renderer.so, libRuntimeNative.so, libgdx.so.

    > Task :app:extractReleaseNativeSymbolTables
    Unable to extract native debug metadata from C:\Users\Protoman\AppData\Local\Temp\AndBA98.tmp\a pp\build\intermediates\merged_native_libs\release\ out\lib\arm64-v8a\libES1Renderer.so because unable to locate the objcopy executable for the arm64-v8a ABI.
    Unable to extract native debug metadata from C:\Users\Protoman\AppData\Local\Temp\AndBA98.tmp\a pp\build\intermediates\merged_native_libs\release\ out\lib\arm64-v8a\libES2Renderer.so because unable to locate the objcopy executable for the arm64-v8a ABI.
    Unable to extract native debug metadata from C:\Users\Protoman\AppData\Local\Temp\AndBA98.tmp\a pp\build\intermediates\merged_native_libs\release\ out\lib\arm64-v8a\libES3Renderer.so because unable to locate the objcopy executable for the arm64-v8a ABI.
    Unable to extract native debug metadata from C:\Users\Protoman\AppData\Local\Temp\AndBA98.tmp\a pp\build\intermediates\merged_native_libs\release\ out\lib\arm64-v8a\libgdx.so because unable to locate the objcopy executable for the arm64-v8a ABI.
    Unable to extract native debug metadata from C:\Users\Protoman\AppData\Local\Temp\AndBA98.tmp\a pp\build\intermediates\merged_native_libs\release\ out\lib\arm64-v8a\libRuntimeNative.so because unable to locate the objcopy executable for the arm64-v8a ABI.
    Unable to extract native debug metadata from C:\Users\Protoman\AppData\Local\Temp\AndBA98.tmp\a pp\build\intermediates\merged_native_libs\release\ out\lib\armeabi-v7a\libES1Renderer.so because unable to locate the objcopy executable for the armeabi-v7a ABI.
    Unable to extract native debug metadata from C:\Users\Protoman\AppData\Local\Temp\AndBA98.tmp\a pp\build\intermediates\merged_native_libs\release\ out\lib\armeabi-v7a\libES2Renderer.so because unable to locate the objcopy executable for the armeabi-v7a ABI.
    Unable to extract native debug metadata from C:\Users\Protoman\AppData\Local\Temp\AndBA98.tmp\a pp\build\intermediates\merged_native_libs\release\ out\lib\armeabi-v7a\libES3Renderer.so because unable to locate the objcopy executable for the armeabi-v7a ABI.
    Unable to extract native debug metadata from C:\Users\Protoman\AppData\Local\Temp\AndBA98.tmp\a pp\build\intermediates\merged_native_libs\release\ out\lib\armeabi-v7a\libgdx.so because unable to locate the objcopy executable for the armeabi-v7a ABI.
    Unable to extract native debug metadata from C:\Users\Protoman\AppData\Local\Temp\AndBA98.tmp\a pp\build\intermediates\merged_native_libs\release\ out\lib\armeabi-v7a\libRuntimeNative.so because unable to locate the objcopy executable for the armeabi-v7a ABI.
    Unable to extract native debug metadata from C:\Users\Protoman\AppData\Local\Temp\AndBA98.tmp\a pp\build\intermediates\merged_native_libs\release\ out\lib\x86\libES1Renderer.so because unable to locate the objcopy executable for the x86 ABI.
    Unable to extract native debug metadata from C:\Users\Protoman\AppData\Local\Temp\AndBA98.tmp\a pp\build\intermediates\merged_native_libs\release\ out\lib\x86\libES2Renderer.so because unable to locate the objcopy executable for the x86 ABI.
    Unable to extract native debug metadata from C:\Users\Protoman\AppData\Local\Temp\AndBA98.tmp\a pp\build\intermediates\merged_native_libs\release\ out\lib\x86\libES3Renderer.so because unable to locate the objcopy executable for the x86 ABI.
    Unable to extract native debug metadata from C:\Users\Protoman\AppData\Local\Temp\AndBA98.tmp\a pp\build\intermediates\merged_native_libs\release\ out\lib\x86\libgdx.so because unable to locate the objcopy executable for the x86 ABI.
    Unable to extract native debug metadata from C:\Users\Protoman\AppData\Local\Temp\AndBA98.tmp\a pp\build\intermediates\merged_native_libs\release\ out\lib\x86\libRuntimeNative.so because unable to locate the objcopy executable for the x86 ABI.
    Unable to extract native debug metadata from C:\Users\Protoman\AppData\Local\Temp\AndBA98.tmp\a pp\build\intermediates\merged_native_libs\release\ out\lib\x86_64\libES1Renderer.so because unable to locate the objcopy executable for the x86_64 ABI.
    Unable to extract native debug metadata from C:\Users\Protoman\AppData\Local\Temp\AndBA98.tmp\a pp\build\intermediates\merged_native_libs\release\ out\lib\x86_64\libES2Renderer.so because unable to locate the objcopy executable for the x86_64 ABI.
    Unable to extract native debug metadata from C:\Users\Protoman\AppData\Local\Temp\AndBA98.tmp\a pp\build\intermediates\merged_native_libs\release\ out\lib\x86_64\libES3Renderer.so because unable to locate the objcopy executable for the x86_64 ABI.
    Unable to extract native debug metadata from C:\Users\Protoman\AppData\Local\Temp\AndBA98.tmp\a pp\build\intermediates\merged_native_libs\release\ out\lib\x86_64\libgdx.so because unable to locate the objcopy executable for the x86_64 ABI.
    Unable to extract native debug metadata from C:\Users\Protoman\AppData\Local\Temp\AndBA98.tmp\a pp\build\intermediates\merged_native_libs\release\ out\lib\x86_64\libRuntimeNative.so because unable to locate the objcopy executable for the x86_64 ABI.
    aapt2.exe W 01-22 10:20:21 17092 9700 LoadedArsc.cpp:682] Unknown chunk type '200'.


    > Task :app:processReleaseResources
    > Task :app:mergeExtDexRelease

    > Task :app:compileReleaseJavaWithJavac FAILED
    An exception has occurred in the compiler (1.8.0_321). Please file a bug against the Java compiler via the Java bug reporting page (http://bugreport.java.com) after checking the Bug Database (http://bugs.java.com) for duplicates. Include your program and the following diagnostic in your report. Thank you.
    java.lang.AssertionError: annotationType(): unrecognized Attribute name MODULE (class com.sun.tools.javac.util.UnsharedNameTable$NameImp l)
    at com.sun.tools.javac.util.Assert.error(Assert.java: 133)
    at com.sun.tools.javac.code.TypeAnnotations.annotatio nType(TypeAnnotations.java:231)
    at com.sun.tools.javac.code.TypeAnnotations$TypeAnnot ationPositions.separateAnnotationsKinds(TypeAnnota tions.java:294)
    at com.sun.tools.javac.code.TypeAnnotations$TypeAnnot ationPositions.visitMethodDef(TypeAnnotations.java :1066)
    at com.sun.tools.javac.tree.JCTree$JCMethodDecl.accep t(JCTree.java:778)
    at com.sun.tools.javac.tree.TreeScanner.scan(TreeScan ner.java:49)
    at com.sun.tools.javac.code.TypeAnnotations$TypeAnnot ationPositions.scan(TypeAnnotations.java:275)
    at com.sun.tools.javac.tree.TreeScanner.scan(TreeScan ner.java:57)
    at com.sun.tools.javac.code.TypeAnnotations$TypeAnnot ationPositions.visitClassDef(TypeAnnotations.java: 1042)
    at com.sun.tools.javac.tree.JCTree$JCClassDecl.accept (JCTree.java:693)
    at com.sun.tools.javac.tree.TreeScanner.scan(TreeScan ner.java:49)
    at com.sun.tools.javac.code.TypeAnnotations$TypeAnnot ationPositions.scan(TypeAnnotations.java:275)
    at com.sun.tools.javac.code.TypeAnnotations$1.run(Typ eAnnotations.java:127)
    at com.sun.tools.javac.comp.Annotate.flush(Annotate.j ava:152)
    at com.sun.tools.javac.comp.Annotate.enterDone(Annota te.java:129)
    at com.sun.tools.javac.comp.Enter.complete(Enter.java :512)
    at com.sun.tools.javac.comp.Enter.main(Enter.java:471 )
    at com.sun.tools.javac.main.JavaCompiler.enterTrees(J avaCompiler.java:982)
    at com.sun.tools.javac.main.JavaCompiler.compile(Java Compiler.java:857)
    at com.sun.tools.javac.main.Main.compile(Main.java:52 3)
    at com.sun.tools.javac.api.JavacTaskImpl.doCall(Javac TaskImpl.java:129)
    at com.sun.tools.javac.api.JavacTaskImpl.call(JavacTa skImpl.java:138)
    at org.gradle.internal.compiler.java.IncrementalCompi leTask.call(IncrementalCompileTask.java:77)
    at org.gradle.api.internal.tasks.compile.AnnotationPr ocessingCompileTask.call(AnnotationProcessingCompi leTask.java:94)
    at org.gradle.api.internal.tasks.compile.ResourceClea ningCompilationTask.call(ResourceCleaningCompilati onTask.java:57)
    at org.gradle.api.internal.tasks.compile.JdkJavaCompi ler.execute(JdkJavaCompiler.java:55)
    at org.gradle.api.internal.tasks.compile.JdkJavaCompi ler.execute(JdkJavaCompiler.java:40)
    at org.gradle.api.internal.tasks.compile.NormalizingJ avaCompiler.delegateAndHandleErrors(NormalizingJav aCompiler.java:97)
    at org.gradle.api.internal.tasks.compile.NormalizingJ avaCompiler.execute(NormalizingJavaCompiler.java:5 1)
    at org.gradle.api.internal.tasks.compile.NormalizingJ avaCompiler.execute(NormalizingJavaCompiler.java:3 7)
    at org.gradle.api.internal.tasks.compile.AnnotationPr ocessorDiscoveringCompiler.execute(AnnotationProce ssorDiscoveringCompiler.java:51)
    at org.gradle.api.internal.tasks.compile.AnnotationPr ocessorDiscoveringCompiler.execute(AnnotationProce ssorDiscoveringCompiler.java:37)
    at org.gradle.api.internal.tasks.compile.ModuleApplic ationNameWritingCompiler.execute(ModuleApplication NameWritingCompiler.java:46)
    at org.gradle.api.internal.tasks.compile.ModuleApplic ationNameWritingCompiler.execute(ModuleApplication NameWritingCompiler.java:36)
    at org.gradle.jvm.toolchain.internal.DefaultToolchain JavaCompiler.execute(DefaultToolchainJavaCompiler. java:57)
    at org.gradle.api.tasks.compile.JavaCompile.lambda$cr eateToolchainCompiler$1(JavaCompile.java:251)
    at org.gradle.api.internal.tasks.compile.CleaningJava Compiler.execute(CleaningJavaCompiler.java:53)
    at org.gradle.api.internal.tasks.compile.incremental. IncrementalCompilerFactory.lambda$createRebuildAll Compiler$0(IncrementalCompilerFactory.java:98)
    at org.gradle.api.internal.tasks.compile.incremental. IncrementalResultStoringCompiler.execute(Increment alResultStoringCompiler.java:61)
    at org.gradle.api.internal.tasks.compile.incremental. IncrementalResultStoringCompiler.execute(Increment alResultStoringCompiler.java:45)
    at org.gradle.api.internal.tasks.compile.CompileJavaB uildOperationReportingCompiler$2.call(CompileJavaB uildOperationReportingCompiler.java:59)
    at org.gradle.api.internal.tasks.compile.CompileJavaB uildOperationReportingCompiler$2.call(CompileJavaB uildOperationReportingCompiler.java:51)
    at org.gradle.internal.operations.DefaultBuildOperati onRunner$CallableBuildOperationWorker.execute(Defa ultBuildOperationRunner.java:200)
    at org.gradle.internal.operations.DefaultBuildOperati onRunner$CallableBuildOperationWorker.execute(Defa ultBuildOperationRunner.java:195)
    at org.gradle.internal.operations.DefaultBuildOperati onRunner$3.execute(DefaultBuildOperationRunner.jav a:75)
    at org.gradle.internal.operations.DefaultBuildOperati onRunner$3.execute(DefaultBuildOperationRunner.jav a:68)
    at org.gradle.internal.operations.DefaultBuildOperati onRunner.execute(DefaultBuildOperationRunner.java: 153)
    at org.gradle.internal.operations.DefaultBuildOperati onRunner.execute(DefaultBuildOperationRunner.java: 68)
    at org.gradle.internal.operations.DefaultBuildOperati onRunner.call(DefaultBuildOperationRunner.java:62)
    at org.gradle.internal.operations.DefaultBuildOperati onExecutor.lambda$call$2(DefaultBuildOperationExec utor.java:76)
    at org.gradle.internal.operations.UnmanagedBuildOpera tionWrapper.callWithUnmanagedSupport(UnmanagedBuil dOperationWrapper.java:54)
    at org.gradle.internal.operations.DefaultBuildOperati onExecutor.call(DefaultBuildOperationExecutor.java :76)
    at org.gradle.api.internal.tasks.compile.CompileJavaB uildOperationReportingCompiler.execute(CompileJava BuildOperationReportingCompiler.java:51)
    at org.gradle.api.tasks.compile.JavaCompile.performCo mpilation(JavaCompile.java:300)
    at org.gradle.api.tasks.compile.JavaCompile.performIn crementalCompilation(JavaCompile.java:179)
    at org.gradle.api.tasks.compile.JavaCompile.compile(J avaCompile.java:152)
    at sun.reflect.NativeMethodAccessorImpl.invoke0(Nativ e Method)
    at sun.reflect.NativeMethodAccessorImpl.invoke(Native MethodAccessorImpl.java:62)
    at sun.reflect.DelegatingMethodAccessorImpl.invoke(De legatingMethodAccessorImpl.java:43)
    at java.lang.reflect.Method.invoke(Method.java:498)
    at org.gradle.internal.reflect.JavaMethod.invoke(Java Method.java:104)
    at org.gradle.api.internal.project.taskfactory.Increm entalInputsTaskAction.doExecute(IncrementalInputsT askAction.java:32)
    at org.gradle.api.internal.project.taskfactory.Standa rdTaskAction.execute(StandardTaskAction.java:51)
    at org.gradle.api.internal.project.taskfactory.Abstra ctIncrementalTaskAction.execute(AbstractIncrementa lTaskAction.java:25)
    at org.gradle.api.internal.project.taskfactory.Standa rdTaskAction.execute(StandardTaskAction.java:29)
    at org.gradle.api.internal.tasks.execution.ExecuteAct ionsTaskExecuter$2.run(ExecuteActionsTaskExecuter. java:498)
    at org.gradle.internal.operations.DefaultBuildOperati onRunner$1.execute(DefaultBuildOperationRunner.jav a:29)
    at org.gradle.internal.operations.DefaultBuildOperati onRunner$1.execute(DefaultBuildOperationRunner.jav a:26)
    at org.gradle.internal.operations.DefaultBuildOperati onRunner$3.execute(DefaultBuildOperationRunner.jav a:75)
    at org.gradle.internal.operations.DefaultBuildOperati onRunner$3.execute(DefaultBuildOperationRunner.jav a:68)
    at org.gradle.internal.operations.DefaultBuildOperati onRunner.execute(DefaultBuildOperationRunner.java: 153)
    at org.gradle.internal.operations.DefaultBuildOperati onRunner.execute(DefaultBuildOperationRunner.java: 68)
    at org.gradle.internal.operations.DefaultBuildOperati onRunner.run(DefaultBuildOperationRunner.java:56)
    at org.gradle.internal.operations.DefaultBuildOperati onExecutor.lambda$run$1(DefaultBuildOperationExecu tor.java:71)
    at org.gradle.internal.operations.UnmanagedBuildOpera tionWrapper.runWithUnmanagedSupport(UnmanagedBuild OperationWrapper.java:45)
    at org.gradle.internal.operations.DefaultBuildOperati onExecutor.run(DefaultBuildOperationExecutor.java: 71)
    at org.gradle.api.internal.tasks.execution.ExecuteAct ionsTaskExecuter.executeAction(ExecuteActionsTaskE xecuter.java:483)
    at org.gradle.api.internal.tasks.execution.ExecuteAct ionsTaskExecuter.executeActions(ExecuteActionsTask Executer.java:466)
    at org.gradle.api.internal.tasks.execution.ExecuteAct ionsTaskExecuter.access$300(ExecuteActionsTaskExec uter.java:105)
    at org.gradle.api.internal.tasks.execution.ExecuteAct ionsTaskExecuter$TaskExecution.executeWithPrevious OutputFiles(ExecuteActionsTaskExecuter.java:270)
    at org.gradle.api.internal.tasks.execution.ExecuteAct ionsTaskExecuter$TaskExecution.execute(ExecuteActi onsTaskExecuter.java:248)
    at org.gradle.internal.execution.steps.ExecuteStep.ex ecuteInternal(ExecuteStep.java:83)
    at org.gradle.internal.execution.steps.ExecuteStep.ac cess$000(ExecuteStep.java:37)
    at org.gradle.internal.execution.steps.ExecuteStep$1. call(ExecuteStep.java:50)
    at org.gradle.internal.execution.steps.ExecuteStep$1. call(ExecuteStep.java:47)
    at org.gradle.internal.operations.DefaultBuildOperati onRunner$CallableBuildOperationWorker.execute(Defa ultBuildOperationRunner.java:200)
    at org.gradle.internal.operations.DefaultBuildOperati onRunner$CallableBuildOperationWorker.execute(Defa ultBuildOperationRunner.java:195)
    at org.gradle.internal.operations.DefaultBuildOperati onRunner$3.execute(DefaultBuildOperationRunner.jav a:75)
    at org.gradle.internal.operations.DefaultBuildOperati onRunner$3.execute(DefaultBuildOperationRunner.jav a:68)
    at org.gradle.internal.operations.DefaultBuildOperati onRunner.execute(DefaultBuildOperationRunner.java: 153)
    at org.gradle.internal.operations.DefaultBuildOperati onRunner.execute(DefaultBuildOperationRunner.java: 68)
    at org.gradle.internal.operations.DefaultBuildOperati onRunner.call(DefaultBuildOperationRunner.java:62)
    at org.gradle.internal.operations.DefaultBuildOperati onExecutor.lambda$call$2(DefaultBuildOperationExec utor.java:76)
    at org.gradle.internal.operations.UnmanagedBuildOpera tionWrapper.callWithUnmanagedSupport(UnmanagedBuil dOperationWrapper.java:54)
    at org.gradle.internal.operations.DefaultBuildOperati onExecutor.call(DefaultBuildOperationExecutor.java :76)
    at org.gradle.internal.execution.steps.ExecuteStep.ex ecute(ExecuteStep.java:47)
    at org.gradle.internal.execution.steps.ExecuteStep.ex ecute(ExecuteStep.java:37)
    at org.gradle.internal.execution.steps.RemovePrevious OutputsStep.execute(RemovePreviousOutputsStep.java :68)
    at org.gradle.internal.execution.steps.RemovePrevious OutputsStep.execute(RemovePreviousOutputsStep.java :38)
    at org.gradle.internal.execution.steps.ResolveInputCh angesStep.execute(ResolveInputChangesStep.java:50)
    at org.gradle.internal.execution.steps.ResolveInputCh angesStep.execute(ResolveInputChangesStep.java:36)
    at org.gradle.internal.execution.steps.CancelExecutio nStep.execute(CancelExecutionStep.java:41)
    at org.gradle.internal.execution.steps.TimeoutStep.ex ecuteWithoutTimeout(TimeoutStep.java:74)
    at org.gradle.internal.execution.steps.TimeoutStep.ex ecute(TimeoutStep.java:55)
    at org.gradle.internal.execution.steps.CreateOutputsS tep.execute(CreateOutputsStep.java:51)
    at org.gradle.internal.execution.steps.CreateOutputsS tep.execute(CreateOutputsStep.java:29)
    at org.gradle.internal.execution.steps.CaptureStateAf terExecutionStep.execute(CaptureStateAfterExecutio nStep.java:54)
    at org.gradle.internal.execution.steps.CaptureStateAf terExecutionStep.execute(CaptureStateAfterExecutio nStep.java:35)
    at org.gradle.internal.execution.steps.BroadcastChang ingOutputsStep.execute(BroadcastChangingOutputsSte p.java:60)
    at org.gradle.internal.execution.steps.BroadcastChang ingOutputsStep.execute(BroadcastChangingOutputsSte p.java:27)
    at org.gradle.internal.execution.steps.BuildCacheStep .executeWithoutCache(BuildCacheStep.java:174)
    at org.gradle.internal.execution.steps.BuildCacheStep .execute(BuildCacheStep.java:74)
    at org.gradle.internal.execution.steps.BuildCacheStep .execute(BuildCacheStep.java:45)
    at org.gradle.internal.execution.steps.StoreExecution StateStep.execute(StoreExecutionStateStep.java:40)
    at org.gradle.internal.execution.steps.StoreExecution StateStep.execute(StoreExecutionStateStep.java:29)
    at org.gradle.internal.execution.steps.RecordOutputsS tep.execute(RecordOutputsStep.java:36)
    at org.gradle.internal.execution.steps.RecordOutputsS tep.execute(RecordOutputsStep.java:22)
    at org.gradle.internal.execution.steps.SkipUpToDateSt ep.executeBecause(SkipUpToDateStep.java:99)
    at org.gradle.internal.execution.steps.SkipUpToDateSt ep.lambda$execute$0(SkipUpToDateStep.java:92)
    at java.util.Optional.map(Optional.java:215)
    at org.gradle.internal.execution.steps.SkipUpToDateSt ep.execute(SkipUpToDateStep.java:52)
    at org.gradle.internal.execution.steps.SkipUpToDateSt ep.execute(SkipUpToDateStep.java:36)
    at org.gradle.internal.execution.steps.ResolveChanges Step.execute(ResolveChangesStep.java:84)
    at org.gradle.internal.execution.steps.ResolveChanges Step.execute(ResolveChangesStep.java:41)
    at org.gradle.internal.execution.steps.legacy.MarkSna pshottingInputsFinishedStep.execute(MarkSnapshotti ngInputsFinishedStep.java:37)
    at org.gradle.internal.execution.steps.legacy.MarkSna pshottingInputsFinishedStep.execute(MarkSnapshotti ngInputsFinishedStep.java:27)
    at org.gradle.internal.execution.steps.ResolveCaching StateStep.execute(ResolveCachingStateStep.java:91)
    at org.gradle.internal.execution.steps.ResolveCaching StateStep.execute(ResolveCachingStateStep.java:49)
    at org.gradle.internal.execution.steps.CaptureStateBe foreExecutionStep.execute(CaptureStateBeforeExecut ionStep.java:78)
    at org.gradle.internal.execution.steps.CaptureStateBe foreExecutionStep.execute(CaptureStateBeforeExecut ionStep.java:49)
    at org.gradle.internal.execution.steps.ValidateStep.e xecute(ValidateStep.java:105)
    at org.gradle.internal.execution.steps.ValidateStep.e xecute(ValidateStep.java:50)
    at org.gradle.internal.execution.steps.SkipEmptyWorkS tep.lambda$execute$2(SkipEmptyWorkStep.java:86)
    at java.util.Optional.orElseGet(Optional.java:267)
    at org.gradle.internal.execution.steps.SkipEmptyWorkS tep.execute(SkipEmptyWorkStep.java:86)
    at org.gradle.internal.execution.steps.SkipEmptyWorkS tep.execute(SkipEmptyWorkStep.java:32)
    at org.gradle.internal.execution.steps.legacy.MarkSna pshottingInputsStartedStep.execute(MarkSnapshottin gInputsStartedStep.java:38)
    at org.gradle.internal.execution.steps.LoadExecutionS tateStep.execute(LoadExecutionStateStep.java:43)
    at org.gradle.internal.execution.steps.LoadExecutionS tateStep.execute(LoadExecutionStateStep.java:31)
    at org.gradle.internal.execution.steps.AssignWorkspac eStep.lambda$execute$0(AssignWorkspaceStep.java:40 )
    at org.gradle.api.internal.tasks.execution.ExecuteAct ionsTaskExecuter$TaskExecution$2.withWorkspace(Exe cuteActionsTaskExecuter.java:283)
    at org.gradle.internal.execution.steps.AssignWorkspac eStep.execute(AssignWorkspaceStep.java:40)
    at org.gradle.internal.execution.steps.AssignWorkspac eStep.execute(AssignWorkspaceStep.java:30)
    at org.gradle.internal.execution.steps.IdentityCacheS tep.execute(IdentityCacheStep.java:37)
    at org.gradle.internal.execution.steps.IdentityCacheS tep.execute(IdentityCacheStep.java:27)
    at org.gradle.internal.execution.steps.IdentifyStep.e xecute(IdentifyStep.java:49)
    at org.gradle.internal.execution.steps.IdentifyStep.e xecute(IdentifyStep.java:35)
    at org.gradle.internal.execution.impl.DefaultExecutio nEngine$1.execute(DefaultExecutionEngine.java:76)
    at org.gradle.api.internal.tasks.execution.ExecuteAct ionsTaskExecuter.executeIfValid(ExecuteActionsTask Executer.java:184)
    at org.gradle.api.internal.tasks.execution.ExecuteAct ionsTaskExecuter.execute(ExecuteActionsTaskExecute r.java:173)
    at org.gradle.api.internal.tasks.execution.CleanupSta leOutputsExecuter.execute(CleanupStaleOutputsExecu ter.java:109)
    at org.gradle.api.internal.tasks.execution.FinalizePr opertiesTaskExecuter.execute(FinalizePropertiesTas kExecuter.java:46)
    at org.gradle.api.internal.tasks.execution.ResolveTas kExecutionModeExecuter.execute(ResolveTaskExecutio nModeExecuter.java:51)
    at org.gradle.api.internal.tasks.execution.SkipTaskWi thNoActionsExecuter.execute(SkipTaskWithNoActionsE xecuter.java:57)
    at org.gradle.api.internal.tasks.execution.SkipOnlyIf TaskExecuter.execute(SkipOnlyIfTaskExecuter.java:5 6)
    at org.gradle.api.internal.tasks.execution.CatchExcep tionTaskExecuter.execute(CatchExceptionTaskExecute r.java:36)
    at org.gradle.api.internal.tasks.execution.EventFirin gTaskExecuter$1.executeTask(EventFiringTaskExecute r.java:77)
    at org.gradle.api.internal.tasks.execution.EventFirin gTaskExecuter$1.call(EventFiringTaskExecuter.java: 55)
    at org.gradle.api.internal.tasks.execution.EventFirin gTaskExecuter$1.call(EventFiringTaskExecuter.java: 52)
    at org.gradle.internal.operations.DefaultBuildOperati onRunner$CallableBuildOperationWorker.execute(Defa ultBuildOperationRunner.java:200)
    at org.gradle.internal.operations.DefaultBuildOperati onRunner$CallableBuildOperationWorker.execute(Defa ultBuildOperationRunner.java:195)
    at org.gradle.internal.operations.DefaultBuildOperati onRunner$3.execute(DefaultBuildOperationRunner.jav a:75)
    at org.gradle.internal.operations.DefaultBuildOperati onRunner$3.execute(DefaultBuildOperationRunner.jav a:68)
    at org.gradle.internal.operations.DefaultBuildOperati onRunner.execute(DefaultBuildOperationRunner.java: 153)
    at org.gradle.internal.operations.DefaultBuildOperati onRunner.execute(DefaultBuildOperationRunner.java: 68)
    at org.gradle.internal.operations.DefaultBuildOperati onRunner.call(DefaultBuildOperationRunner.java:62)
    at org.gradle.internal.operations.DefaultBuildOperati onExecutor.lambda$call$2(DefaultBuildOperationExec utor.java:76)
    at org.gradle.internal.operations.UnmanagedBuildOpera tionWrapper.callWithUnmanagedSupport(UnmanagedBuil dOperationWrapper.java:54)
    at org.gradle.internal.operations.DefaultBuildOperati onExecutor.call(DefaultBuildOperationExecutor.java :76)
    at org.gradle.api.internal.tasks.execution.EventFirin gTaskExecuter.execute(EventFiringTaskExecuter.java :52)
    at org.gradle.execution.plan.LocalTaskNodeExecutor.ex ecute(LocalTaskNodeExecutor.java:74)
    at org.gradle.execution.taskgraph.DefaultTaskExecutio nGraph$InvokeNodeExecutorsAction.execute(DefaultTa skExecutionGraph.java:408)
    at org.gradle.execution.taskgraph.DefaultTaskExecutio nGraph$InvokeNodeExecutorsAction.execute(DefaultTa skExecutionGraph.java:395)
    at org.gradle.execution.taskgraph.DefaultTaskExecutio nGraph$BuildOperationAwareExecutionAction.execute( DefaultTaskExecutionGraph.java:388)
    at org.gradle.execution.taskgraph.DefaultTaskExecutio nGraph$BuildOperationAwareExecutionAction.execute( DefaultTaskExecutionGraph.java:374)
    at org.gradle.execution.plan.DefaultPlanExecutor$Exec utorWorker.lambda$run$0(DefaultPlanExecutor.java:1 27)
    at org.gradle.execution.plan.DefaultPlanExecutor$Exec utorWorker.execute(DefaultPlanExecutor.java:191)
    at org.gradle.execution.plan.DefaultPlanExecutor$Exec utorWorker.executeNextNode(DefaultPlanExecutor.jav a:182)
    at org.gradle.execution.plan.DefaultPlanExecutor$Exec utorWorker.run(DefaultPlanExecutor.java:124)
    at org.gradle.internal.concurrent.ExecutorPolicy$Catc hAndRecordFailures.onExecute(ExecutorPolicy.java:6 4)
    at org.gradle.internal.concurrent.ManagedExecutorImpl $1.run(ManagedExecutorImpl.java:48)
    at java.util.concurrent.ThreadPoolExecutor.runWorker( ThreadPoolExecutor.java:1149)
    at java.util.concurrent.ThreadPoolExecutor$Worker.run (ThreadPoolExecutor.java:624)
    at org.gradle.internal.concurrent.ThreadFactoryImpl$M anagedThreadRunnable.run(ThreadFactoryImpl.java:56 )
    at java.lang.Thread.run(Thread.java:750)

    FAILURE: Build failed with an exception.

    * What went wrong:
    Execution failed for task ':app:compileReleaseJavaWithJavac'.
    > Compilation failed; see the compiler error output for details.

    * Try:
    Run with --stacktrace option to get the stack trace. Run with --info or --debug option to get more log output. Run with --scan to get full insights.

    * Get more help at https://help.gradle.org

    BUILD FAILED in 11s
    31 actionable tasks: 31 executed

  4. #284
    Clicker Fusion 2.5 DeveloperAndroid Export ModuleiOS Export Module

    Join Date
    Jun 2015
    Posts
    105
    Mentioned
    2 Post(s)
    Tagged
    0 Thread(s)
    I uninstalled and reinstalled AndroidStudio and now I have this error:

    Starting a Gradle Daemon, 8 incompatible and 2 stopped Daemons could not be reused, use --status for details
    Warning: Mapping new ns http://schemas.android.com/repository/android/common/02 to old ns http://schemas.android.com/repository/android/common/01
    Warning: Mapping new ns http://schemas.android.com/repositor...oid/generic/02 to old ns http://schemas.android.com/repositor...oid/generic/01
    Warning: Mapping new ns http://schemas.android.com/sdk/android/repo/addon2/02 to old ns http://schemas.android.com/sdk/android/repo/addon2/01
    Warning: Mapping new ns http://schemas.android.com/sdk/andro...repository2/02 to old ns http://schemas.android.com/sdk/andro...repository2/01
    Warning: Mapping new ns http://schemas.android.com/sdk/android/repo/sys-img2/02 to old ns http://schemas.android.com/sdk/android/repo/sys-img2/01
    > Task :app:preBuild UP-TO-DATE
    > Task :app:preReleaseBuild UP-TO-DATE
    > Task :app:writeReleaseApplicationId
    > Task :app:analyticsRecordingRelease
    > Task :app:compileReleaseRenderscript NO-SOURCE
    > Task :app:generateReleaseResValues
    > Task :app:generateReleaseResources
    > Task :app:createReleaseCompatibleScreenManifests
    > Task :app:extractDeepLinksRelease
    > Task :app:processReleaseMainManifest
    > Task :app:mergeReleaseResources
    > Task :app:processReleaseManifest
    > Task :app:processApplicationManifestReleaseForBundle
    > Task :app:compileReleaseAidl NO-SOURCE
    > Task :app:generateReleaseBuildConfig
    > Task :app:javaPreCompileRelease
    > Task :app:checkReleaseDuplicateClasses
    > Task :app:checkReleaseAarMetadata
    > Task :app:mergeReleaseShaders
    > Task :app:compileReleaseShaders NO-SOURCE
    > Task :app:generateReleaseAssets UP-TO-DATE
    > Task :app:mergeReleaseAssets
    > Task :app:processReleaseJavaRes NO-SOURCE
    > Task :app:mergeReleaseJniLibFolders
    > Task :app:collectReleaseDependencies
    > Task :app:configureReleaseDependencies
    > Task :app:parseReleaseIntegrityConfig
    > Task :app:writeReleaseAppMetadata
    > Task :app:validateSigningRelease
    > Task :app:processReleaseManifestForPackage
    > Task :app:desugarReleaseFileDependencies
    > Task :app:mergeReleaseNativeLibs
    > Task :app:mergeReleaseJavaResource

    > Task :app:stripReleaseDebugSymbols
    Unable to strip the following libraries, packaging them as they are: libES1Renderer.so, libES2Renderer.so, libES3Renderer.so, libRuntimeNative.so, libgdx.so.

    > Task :app:extractReleaseNativeSymbolTables
    Unable to extract native debug metadata from C:\Users\Protoman\AppData\Local\Temp\AndEA73.tmp\a pp\build\intermediates\merged_native_libs\release\ out\lib\arm64-v8a\libES1Renderer.so because unable to locate the objcopy executable for the arm64-v8a ABI.
    Unable to extract native debug metadata from C:\Users\Protoman\AppData\Local\Temp\AndEA73.tmp\a pp\build\intermediates\merged_native_libs\release\ out\lib\arm64-v8a\libES2Renderer.so because unable to locate the objcopy executable for the arm64-v8a ABI.
    Unable to extract native debug metadata from C:\Users\Protoman\AppData\Local\Temp\AndEA73.tmp\a pp\build\intermediates\merged_native_libs\release\ out\lib\arm64-v8a\libES3Renderer.so because unable to locate the objcopy executable for the arm64-v8a ABI.
    Unable to extract native debug metadata from C:\Users\Protoman\AppData\Local\Temp\AndEA73.tmp\a pp\build\intermediates\merged_native_libs\release\ out\lib\arm64-v8a\libgdx.so because unable to locate the objcopy executable for the arm64-v8a ABI.
    Unable to extract native debug metadata from C:\Users\Protoman\AppData\Local\Temp\AndEA73.tmp\a pp\build\intermediates\merged_native_libs\release\ out\lib\arm64-v8a\libRuntimeNative.so because unable to locate the objcopy executable for the arm64-v8a ABI.
    Unable to extract native debug metadata from C:\Users\Protoman\AppData\Local\Temp\AndEA73.tmp\a pp\build\intermediates\merged_native_libs\release\ out\lib\armeabi-v7a\libES1Renderer.so because unable to locate the objcopy executable for the armeabi-v7a ABI.
    Unable to extract native debug metadata from C:\Users\Protoman\AppData\Local\Temp\AndEA73.tmp\a pp\build\intermediates\merged_native_libs\release\ out\lib\armeabi-v7a\libES2Renderer.so because unable to locate the objcopy executable for the armeabi-v7a ABI.
    Unable to extract native debug metadata from C:\Users\Protoman\AppData\Local\Temp\AndEA73.tmp\a pp\build\intermediates\merged_native_libs\release\ out\lib\armeabi-v7a\libES3Renderer.so because unable to locate the objcopy executable for the armeabi-v7a ABI.
    Unable to extract native debug metadata from C:\Users\Protoman\AppData\Local\Temp\AndEA73.tmp\a pp\build\intermediates\merged_native_libs\release\ out\lib\armeabi-v7a\libgdx.so because unable to locate the objcopy executable for the armeabi-v7a ABI.
    Unable to extract native debug metadata from C:\Users\Protoman\AppData\Local\Temp\AndEA73.tmp\a pp\build\intermediates\merged_native_libs\release\ out\lib\armeabi-v7a\libRuntimeNative.so because unable to locate the objcopy executable for the armeabi-v7a ABI.
    Unable to extract native debug metadata from C:\Users\Protoman\AppData\Local\Temp\AndEA73.tmp\a pp\build\intermediates\merged_native_libs\release\ out\lib\x86\libES1Renderer.so because unable to locate the objcopy executable for the x86 ABI.
    Unable to extract native debug metadata from C:\Users\Protoman\AppData\Local\Temp\AndEA73.tmp\a pp\build\intermediates\merged_native_libs\release\ out\lib\x86\libES2Renderer.so because unable to locate the objcopy executable for the x86 ABI.
    Unable to extract native debug metadata from C:\Users\Protoman\AppData\Local\Temp\AndEA73.tmp\a pp\build\intermediates\merged_native_libs\release\ out\lib\x86\libES3Renderer.so because unable to locate the objcopy executable for the x86 ABI.
    Unable to extract native debug metadata from C:\Users\Protoman\AppData\Local\Temp\AndEA73.tmp\a pp\build\intermediates\merged_native_libs\release\ out\lib\x86\libgdx.so because unable to locate the objcopy executable for the x86 ABI.
    Unable to extract native debug metadata from C:\Users\Protoman\AppData\Local\Temp\AndEA73.tmp\a pp\build\intermediates\merged_native_libs\release\ out\lib\x86\libRuntimeNative.so because unable to locate the objcopy executable for the x86 ABI.
    Unable to extract native debug metadata from C:\Users\Protoman\AppData\Local\Temp\AndEA73.tmp\a pp\build\intermediates\merged_native_libs\release\ out\lib\x86_64\libES1Renderer.so because unable to locate the objcopy executable for the x86_64 ABI.
    Unable to extract native debug metadata from C:\Users\Protoman\AppData\Local\Temp\AndEA73.tmp\a pp\build\intermediates\merged_native_libs\release\ out\lib\x86_64\libES2Renderer.so because unable to locate the objcopy executable for the x86_64 ABI.
    Unable to extract native debug metadata from C:\Users\Protoman\AppData\Local\Temp\AndEA73.tmp\a pp\build\intermediates\merged_native_libs\release\ out\lib\x86_64\libES3Renderer.so because unable to locate the objcopy executable for the x86_64 ABI.
    Unable to extract native debug metadata from C:\Users\Protoman\AppData\Local\Temp\AndEA73.tmp\a pp\build\intermediates\merged_native_libs\release\ out\lib\x86_64\libgdx.so because unable to locate the objcopy executable for the x86_64 ABI.
    Unable to extract native debug metadata from C:\Users\Protoman\AppData\Local\Temp\AndEA73.tmp\a pp\build\intermediates\merged_native_libs\release\ out\lib\x86_64\libRuntimeNative.so because unable to locate the objcopy executable for the x86_64 ABI.
    aapt2.exe W 01-22 12:10:12 8008 8004 LoadedArsc.cpp:682] Unknown chunk type '200'.


    > Task :app:bundleReleaseResources
    aapt2.exe W 01-22 12:10:13 3220 3224 LoadedArsc.cpp:682] Unknown chunk type '200'.

    > Task :app:processReleaseResources
    > Task :app:mergeExtDexRelease

    > Task :app:compileReleaseJavaWithJavac
    Note: Some input files use or override a deprecated API.
    Note: Recompile with -Xlint:deprecation for details.
    Note: Some input files use unchecked or unsafe operations.
    Note: Recompile with -Xlint:unchecked for details.

    > Task :app:dexBuilderRelease

    > Task :app:mergeDexRelease FAILED
    ERROR:: D8: Cannot fit requested classes in a single dex file (# methods: 67216 > 65536)
    com.android.builder.dexing.DexArchiveMergerExcepti on: Error while merging dex archives:
    The number of method references in a .dex file cannot exceed 64K.
    Learn how to resolve this issue at https://developer.android.com/tools/.../multidex.html
    at com.android.builder.dexing.D8DexArchiveMerger.getE xceptionToRethrow(D8DexArchiveMerger.java:128)
    at com.android.builder.dexing.D8DexArchiveMerger.merg eDexArchives(D8DexArchiveMerger.java:115)
    at com.android.build.gradle.internal.transforms.DexMe rgerTransformCallable.call(DexMergerTransformCalla ble.java:111)
    at com.android.build.gradle.internal.tasks.DexMerging WorkAction.merge(DexMergingTask.kt:805)
    at com.android.build.gradle.internal.tasks.DexMerging WorkAction.run(DexMergingTask.kt:760)
    at com.android.build.gradle.internal.profile.ProfileA wareWorkAction.execute(ProfileAwareWorkAction.kt:7 4)
    at org.gradle.workers.internal.DefaultWorkerServer.ex ecute(DefaultWorkerServer.java:63)
    at org.gradle.workers.internal.NoIsolationWorkerFacto ry$1$1.create(NoIsolationWorkerFactory.java:66)
    at org.gradle.workers.internal.NoIsolationWorkerFacto ry$1$1.create(NoIsolationWorkerFactory.java:62)
    at org.gradle.internal.classloader.ClassLoaderUtils.e xecuteInClassloader(ClassLoaderUtils.java:97)
    at org.gradle.workers.internal.NoIsolationWorkerFacto ry$1.lambda$execute$0(NoIsolationWorkerFactory.jav a:62)
    at org.gradle.workers.internal.AbstractWorker$1.call( AbstractWorker.java:44)
    at org.gradle.workers.internal.AbstractWorker$1.call( AbstractWorker.java:41)
    at org.gradle.internal.operations.DefaultBuildOperati onRunner$CallableBuildOperationWorker.execute(Defa ultBuildOperationRunner.java:200)
    at org.gradle.internal.operations.DefaultBuildOperati onRunner$CallableBuildOperationWorker.execute(Defa ultBuildOperationRunner.java:195)
    at org.gradle.internal.operations.DefaultBuildOperati onRunner$3.execute(DefaultBuildOperationRunner.jav a:75)
    at org.gradle.internal.operations.DefaultBuildOperati onRunner$3.execute(DefaultBuildOperationRunner.jav a:68)
    at org.gradle.internal.operations.DefaultBuildOperati onRunner.execute(DefaultBuildOperationRunner.java: 153)
    at org.gradle.internal.operations.DefaultBuildOperati onRunner.execute(DefaultBuildOperationRunner.java: 68)
    at org.gradle.internal.operations.DefaultBuildOperati onRunner.call(DefaultBuildOperationRunner.java:62)
    at org.gradle.internal.operations.DefaultBuildOperati onExecutor.lambda$call$2(DefaultBuildOperationExec utor.java:76)
    at org.gradle.internal.operations.UnmanagedBuildOpera tionWrapper.callWithUnmanagedSupport(UnmanagedBuil dOperationWrapper.java:54)
    at org.gradle.internal.operations.DefaultBuildOperati onExecutor.call(DefaultBuildOperationExecutor.java :76)
    at org.gradle.workers.internal.AbstractWorker.execute WrappedInBuildOperation(AbstractWorker.java:41)
    at org.gradle.workers.internal.NoIsolationWorkerFacto ry$1.execute(NoIsolationWorkerFactory.java:59)
    at org.gradle.workers.internal.DefaultWorkerExecutor. lambda$submitWork$2(DefaultWorkerExecutor.java:206 )
    at java.base/java.util.concurrent.FutureTask.run(FutureTask.jav a:264)
    at org.gradle.internal.work.DefaultConditionalExecuti onQueue$ExecutionRunner.runExecution(DefaultCondit ionalExecutionQueue.java:214)
    at org.gradle.internal.work.DefaultConditionalExecuti onQueue$ExecutionRunner.runBatch(DefaultConditiona lExecutionQueue.java:164)
    at org.gradle.internal.work.DefaultConditionalExecuti onQueue$ExecutionRunner.run(DefaultConditionalExec utionQueue.java:131)
    at java.base/java.util.concurrent.Executors$RunnableAdapter.cal l(Executors.java:515)
    at java.base/java.util.concurrent.FutureTask.run(FutureTask.jav a:264)
    at org.gradle.internal.concurrent.ExecutorPolicy$Catc hAndRecordFailures.onExecute(ExecutorPolicy.java:6 4)
    at org.gradle.internal.concurrent.ManagedExecutorImpl $1.run(ManagedExecutorImpl.java:48)
    at java.base/java.util.concurrent.ThreadPoolExecutor.runWorker( ThreadPoolExecutor.java:1128)
    at java.base/java.util.concurrent.ThreadPoolExecutor$Worker.run (ThreadPoolExecutor.java:628)
    at org.gradle.internal.concurrent.ThreadFactoryImpl$M anagedThreadRunnable.run(ThreadFactoryImpl.java:56 )
    at java.base/java.lang.Thread.run(Thread.java:834)
    Caused by: com.android.tools.r8.CompilationFailedException: Compilation failed to complete, position: null
    at Version.fakeStackEntry(Version_2.2.71.java:0)
    at com.android.tools.r8.utils.a0.a(SourceFile:89)
    at com.android.tools.r8.D8.run(D8.java:11)
    at com.android.builder.dexing.D8DexArchiveMerger.merg eDexArchives(D8DexArchiveMerger.java:113)
    ... 36 more
    Caused by: com.android.tools.r8.utils.b: Cannot fit requested classes in a single dex file (# methods: 67216 > 65536)
    at com.android.tools.r8.utils.V0.a(SourceFile:22)
    at com.android.tools.r8.utils.V0.a(SourceFile:25)
    at com.android.tools.r8.dex.P.a(SourceFile:55)
    at com.android.tools.r8.dex.P$h.a(SourceFile:7)
    at com.android.tools.r8.dex.b.a(SourceFile:14)
    at com.android.tools.r8.dex.b.c(SourceFile:30)
    at com.android.tools.r8.D8.d(D8.java:163)
    at com.android.tools.r8.D8.b(D8.java:1)
    at com.android.tools.r8.utils.a0.a(SourceFile:47)
    ... 38 more


    FAILURE: Build failed with an exception.

    * What went wrong:
    Execution failed for task ':app:mergeDexRelease'.
    > A failure occurred while executing com.android.build.gradle.internal.tasks.DexMerging TaskDelegate
    > There was a failure while executing work items
    > A failure occurred while executing com.android.build.gradle.internal.tasks.DexMerging WorkAction
    > com.android.builder.dexing.DexArchiveMergerExcepti on: Error while merging dex archives:
    The number of method references in a .dex file cannot exceed 64K.
    Learn how to resolve this issue at https://developer.android.com/tools/.../multidex.html

    * Try:
    Run with --stacktrace option to get the stack trace. Run with --info or --debug option to get more log output. Run with --scan to get full insights.

    * Get more help at https://help.gradle.org

    BUILD FAILED in 22s
    33 actionable tasks: 33 executed

  5. #285
    Clicker Fusion 2.5 DeveloperAndroid Export ModuleiOS Export Module

    Join Date
    Jun 2015
    Posts
    105
    Mentioned
    2 Post(s)
    Tagged
    0 Thread(s)
    SOLVED. - After I reinstalled AndroidStudio I had to change minimum version to 5.0 (the warning box actually said so as suggestion but after a few hours I guess I stopped reading that box)

  6. #286
    Clicker Fusion 2.5 DeveloperAndroid Export ModuleiOS Export Module

    Join Date
    Jun 2015
    Posts
    105
    Mentioned
    2 Post(s)
    Tagged
    0 Thread(s)
    BUT NOT REALLY - I just tried to run an export of another app - this app has Connect, Leaderboard, and Achievements (the previous one for only had Connect). I am getting a different error now O.o

    Warning: Mapping new ns http://schemas.android.com/repository/android/common/02 to old ns http://schemas.android.com/repository/android/common/01
    Warning: Mapping new ns http://schemas.android.com/repositor...oid/generic/02 to old ns http://schemas.android.com/repositor...oid/generic/01
    Warning: Mapping new ns http://schemas.android.com/sdk/android/repo/addon2/02 to old ns http://schemas.android.com/sdk/android/repo/addon2/01
    Warning: Mapping new ns http://schemas.android.com/sdk/andro...repository2/02 to old ns http://schemas.android.com/sdk/andro...repository2/01
    Warning: Mapping new ns http://schemas.android.com/sdk/android/repo/sys-img2/02 to old ns http://schemas.android.com/sdk/android/repo/sys-img2/01
    > Task :app:preBuild UP-TO-DATE
    > Task :app:preReleaseBuild UP-TO-DATE
    > Task :app:writeReleaseApplicationId
    > Task :app:analyticsRecordingRelease
    > Task :app:compileReleaseRenderscript NO-SOURCE
    > Task :app:generateReleaseResValues
    > Task :app:generateReleaseResources
    > Task :app:createReleaseCompatibleScreenManifests
    > Task :app:extractDeepLinksRelease
    > Task :app:processReleaseMainManifest
    > Task :app:processReleaseManifest
    > Task :app:processApplicationManifestReleaseForBundle
    > Task :app:compileReleaseAidl NO-SOURCE
    > Task :app:generateReleaseBuildConfig
    > Task :app:checkReleaseDuplicateClasses
    > Task :app:javaPreCompileRelease
    > Task :app:checkReleaseAarMetadata
    > Task :app:mergeReleaseShaders
    > Task :app:compileReleaseShaders NO-SOURCE
    > Task :app:generateReleaseAssets UP-TO-DATE
    > Task :app:mergeReleaseAssets
    > Task :app:processReleaseJavaRes NO-SOURCE
    > Task :app:desugarReleaseFileDependencies
    > Task :app:mergeReleaseJniLibFolders
    > Task :app:mergeReleaseResources
    > Task :app:collectReleaseDependencies
    > Task :app:configureReleaseDependencies
    > Task :app:parseReleaseIntegrityConfig
    > Task :app:processReleaseManifestForPackage
    > Task :app:writeReleaseAppMetadata
    > Task :app:validateSigningRelease
    > Task :app:mergeReleaseJavaResource
    > Task :app:mergeReleaseNativeLibs

    > Task :app:stripReleaseDebugSymbols
    Unable to strip the following libraries, packaging them as they are: libES1Renderer.so, libES2Renderer.so, libES3Renderer.so, libRuntimeNative.so, libgdx.so.

    > Task :app:extractReleaseNativeSymbolTables
    Unable to extract native debug metadata from C:\Users\Protoman\AppData\Local\Temp\AndD993.tmp\a pp\build\intermediates\merged_native_libs\release\ out\lib\arm64-v8a\libES1Renderer.so because unable to locate the objcopy executable for the arm64-v8a ABI.
    Unable to extract native debug metadata from C:\Users\Protoman\AppData\Local\Temp\AndD993.tmp\a pp\build\intermediates\merged_native_libs\release\ out\lib\arm64-v8a\libES2Renderer.so because unable to locate the objcopy executable for the arm64-v8a ABI.
    Unable to extract native debug metadata from C:\Users\Protoman\AppData\Local\Temp\AndD993.tmp\a pp\build\intermediates\merged_native_libs\release\ out\lib\arm64-v8a\libES3Renderer.so because unable to locate the objcopy executable for the arm64-v8a ABI.
    Unable to extract native debug metadata from C:\Users\Protoman\AppData\Local\Temp\AndD993.tmp\a pp\build\intermediates\merged_native_libs\release\ out\lib\arm64-v8a\libgdx.so because unable to locate the objcopy executable for the arm64-v8a ABI.
    Unable to extract native debug metadata from C:\Users\Protoman\AppData\Local\Temp\AndD993.tmp\a pp\build\intermediates\merged_native_libs\release\ out\lib\arm64-v8a\libRuntimeNative.so because unable to locate the objcopy executable for the arm64-v8a ABI.
    Unable to extract native debug metadata from C:\Users\Protoman\AppData\Local\Temp\AndD993.tmp\a pp\build\intermediates\merged_native_libs\release\ out\lib\armeabi-v7a\libES1Renderer.so because unable to locate the objcopy executable for the armeabi-v7a ABI.
    Unable to extract native debug metadata from C:\Users\Protoman\AppData\Local\Temp\AndD993.tmp\a pp\build\intermediates\merged_native_libs\release\ out\lib\armeabi-v7a\libES2Renderer.so because unable to locate the objcopy executable for the armeabi-v7a ABI.
    Unable to extract native debug metadata from C:\Users\Protoman\AppData\Local\Temp\AndD993.tmp\a pp\build\intermediates\merged_native_libs\release\ out\lib\armeabi-v7a\libES3Renderer.so because unable to locate the objcopy executable for the armeabi-v7a ABI.
    Unable to extract native debug metadata from C:\Users\Protoman\AppData\Local\Temp\AndD993.tmp\a pp\build\intermediates\merged_native_libs\release\ out\lib\armeabi-v7a\libgdx.so because unable to locate the objcopy executable for the armeabi-v7a ABI.
    Unable to extract native debug metadata from C:\Users\Protoman\AppData\Local\Temp\AndD993.tmp\a pp\build\intermediates\merged_native_libs\release\ out\lib\armeabi-v7a\libRuntimeNative.so because unable to locate the objcopy executable for the armeabi-v7a ABI.
    Unable to extract native debug metadata from C:\Users\Protoman\AppData\Local\Temp\AndD993.tmp\a pp\build\intermediates\merged_native_libs\release\ out\lib\x86\libES1Renderer.so because unable to locate the objcopy executable for the x86 ABI.
    Unable to extract native debug metadata from C:\Users\Protoman\AppData\Local\Temp\AndD993.tmp\a pp\build\intermediates\merged_native_libs\release\ out\lib\x86\libES2Renderer.so because unable to locate the objcopy executable for the x86 ABI.
    Unable to extract native debug metadata from C:\Users\Protoman\AppData\Local\Temp\AndD993.tmp\a pp\build\intermediates\merged_native_libs\release\ out\lib\x86\libES3Renderer.so because unable to locate the objcopy executable for the x86 ABI.
    Unable to extract native debug metadata from C:\Users\Protoman\AppData\Local\Temp\AndD993.tmp\a pp\build\intermediates\merged_native_libs\release\ out\lib\x86\libgdx.so because unable to locate the objcopy executable for the x86 ABI.
    Unable to extract native debug metadata from C:\Users\Protoman\AppData\Local\Temp\AndD993.tmp\a pp\build\intermediates\merged_native_libs\release\ out\lib\x86\libRuntimeNative.so because unable to locate the objcopy executable for the x86 ABI.
    Unable to extract native debug metadata from C:\Users\Protoman\AppData\Local\Temp\AndD993.tmp\a pp\build\intermediates\merged_native_libs\release\ out\lib\x86_64\libES1Renderer.so because unable to locate the objcopy executable for the x86_64 ABI.
    Unable to extract native debug metadata from C:\Users\Protoman\AppData\Local\Temp\AndD993.tmp\a pp\build\intermediates\merged_native_libs\release\ out\lib\x86_64\libES2Renderer.so because unable to locate the objcopy executable for the x86_64 ABI.
    Unable to extract native debug metadata from C:\Users\Protoman\AppData\Local\Temp\AndD993.tmp\a pp\build\intermediates\merged_native_libs\release\ out\lib\x86_64\libES3Renderer.so because unable to locate the objcopy executable for the x86_64 ABI.
    Unable to extract native debug metadata from C:\Users\Protoman\AppData\Local\Temp\AndD993.tmp\a pp\build\intermediates\merged_native_libs\release\ out\lib\x86_64\libgdx.so because unable to locate the objcopy executable for the x86_64 ABI.
    Unable to extract native debug metadata from C:\Users\Protoman\AppData\Local\Temp\AndD993.tmp\a pp\build\intermediates\merged_native_libs\release\ out\lib\x86_64\libRuntimeNative.so because unable to locate the objcopy executable for the x86_64 ABI.
    aapt2.exe W 01-22 12:21:43 5016 10152 LoadedArsc.cpp:682] Unknown chunk type '200'.

    aapt2.exe W 01-22 12:21:43 2188 9384 LoadedArsc.cpp:682] Unknown chunk type '200'.


    > Task :app:bundleReleaseResources
    > Task :app:processReleaseResources
    > Task :app:mergeExtDexRelease

    > Task :app:compileReleaseJavaWithJavac FAILED
    C:\Users\Protoman\AppData\Local\Temp\AndD993.tmp\a pp\src\main\java\com\clickteam\special\CTSignInCli ent.java:165: error: cannot find symbol
    public boolean isConnected() { return mGoogleSignInClient.getInstanceId() != 0;}
    ^
    symbol: method getInstanceId()
    location: variable mGoogleSignInClient of type GoogleSignInClient
    Note: Some input files use or override a deprecated API.
    Note: Recompile with -Xlint:deprecation for details.
    Note: Some input files use unchecked or unsafe operations.
    Note: Recompile with -Xlint:unchecked for details.
    1 error

    FAILURE: Build failed with an exception.

    * What went wrong:
    Execution failed for task ':app:compileReleaseJavaWithJavac'.
    > Compilation failed; see the compiler error output for details.

    * Try:
    Run with --stacktrace option to get the stack trace. Run with --info or --debug option to get more log output. Run with --scan to get full insights.

    * Get more help at https://help.gradle.org

    BUILD FAILED in 5s
    31 actionable tasks: 31 executed

  7. #287
    Clicker Fusion 2.5 DeveloperAndroid Export ModuleiOS Export Module

    Join Date
    Jun 2015
    Posts
    105
    Mentioned
    2 Post(s)
    Tagged
    0 Thread(s)
    I just inserted the other GPG objects now the test app has connect, acheivements, highscore, just like the app that won't compile... except the test app does. I guess it's not GPG related anymore.

  8. #288
    Clicker Fusion 2.5 DeveloperAndroid Export ModuleiOS Export Module

    Join Date
    Jun 2015
    Posts
    105
    Mentioned
    2 Post(s)
    Tagged
    0 Thread(s)
    RESOLVED - It was old unused Chartboost scatter throughout my older apps.

  9. #289
    Clickteam Clickteam
    Fernando's Avatar
    Join Date
    Dec 2006
    Posts
    7,299
    Mentioned
    298 Post(s)
    Tagged
    4 Thread(s)
    This issue is being solved for next beta.

    with next version of chartboost object you can have chartboost and GPG in the same project.
    Regards,


    Fernando Vivolo

    ... new things are coming ...

  10. #290
    Clicker

    Fusion 2.5 MacFusion 2.5 DeveloperFusion 2.5+ DLCAndroid Export ModuleHTML5 Export ModuleiOS Export ModuleUniversal Windows Platform Export ModuleSWF Export ModuleFirefly 3D ModuleInstall Creator Pro
    Fusion 2.5 (Steam)Fusion 2.5 Developer (Steam)Fusion 2.5+ DLC (Steam)Android Export Module (Steam)HTML5 Export Module (Steam)iOS Export Module (Steam)Universal Windows Platform Export Module (Steam)Firefly 3D Module (Steam)
    pradeep's Avatar
    Join Date
    Dec 2013
    Location
    India
    Posts
    383
    Mentioned
    11 Post(s)
    Tagged
    0 Thread(s)
    When using WebView2 object found error log
    Picked up _JAVA_OPTIONS: -Xmx8192M
    > Task :app:preBuild UP-TO-DATE
    > Task :app:preDebugBuild UP-TO-DATE
    > Task :app:compileDebugAidl NO-SOURCE
    > Task :app:compileDebugRenderscript NO-SOURCE
    > Task :app:generateDebugBuildConfig
    > Task :app:javaPreCompileDebug
    > Task :app:generateDebugResValues
    > Task :app:generateDebugResources
    > Task :app:checkDebugAarMetadata
    > Task :app:createDebugCompatibleScreenManifests
    > Task :app:extractDeepLinksDebug
    > Task :app:processDebugMainManifest
    > Task :app:processDebugManifest
    > Task :app:processDebugManifestForPackage
    > Task :app:mergeDebugNativeDebugMetadata NO-SOURCE
    > Task :app:mergeDebugShaders
    > Task :app:compileDebugShaders NO-SOURCE
    > Task :app:generateDebugAssets UP-TO-DATE
    > Task :app:mergeDebugAssets
    > Task :app:compressDebugAssets
    > Task :app:processDebugJavaRes NO-SOURCE
    > Task :app:checkDebugDuplicateClasses
    > Task :app:desugarDebugFileDependencies
    > Task :app:mergeDebugJniLibFolders
    > Task :app:mergeDebugResources
    > Task :app:mergeDebugJavaResource
    > Task :app:validateSigningDebug
    > Task :app:writeDebugAppMetadata
    > Task :app:writeDebugSigningConfigVersions
    > Task :app:mergeExtDexDebug
    > Task :app:mergeDebugNativeLibs
    aapt2.exe W 02-04 22:33:41 10188 11060 LoadedArsc.cpp:682] Unknown chunk type '200'.

    > Task :app:processDebugResources

    > Task :app:stripDebugDebugSymbols
    Unable to strip the following libraries, packaging them as they are: libES1Renderer.so, libES2Renderer.so, libES3Renderer.so, libRuntimeNative.so, libgdx.so.

    > Task :app:compileDebugJavaWithJavac
    C:\Users\Praveen\AppData\Local\Temp\And707B.tmp\ap p\src\main\java\Extensions\CRunWebView2.java:39: error: package androidx.webkit does not exist
    import androidx.webkit.WebViewClientCompat;
    ^
    C:\Users\Praveen\AppData\Local\Temp\And707B.tmp\ap p\src\main\java\Extensions\CRunWebView2.java:603: error: cannot find symbol
    myWebView.setWebViewClient(new WebViewClientCompat() {
    ^
    symbol: class WebViewClientCompat
    location: class CRunWebView2
    C:\Users\Praveen\AppData\Local\Temp\And707B.tmp\ap p\src\main\java\Extensions\CRunWebView2.java:605: error: method does not override or implement a method from a supertype
    @Override
    ^
    C:\Users\Praveen\AppData\Local\Temp\And707B.tmp\ap p\src\main\java\Extensions\CRunWebView2.java:668: error: method does not override or implement a method from a supertype
    @Override
    ^
    C:\Users\Praveen\AppData\Local\Temp\And707B.tmp\ap p\src\main\java\Extensions\CRunWebView2.java:670: error: cannot find symbol
    super.onScaleChanged(view, oldScale, newScale);
    ^
    symbol: method onScaleChanged(WebView,float,float)
    C:\Users\Praveen\AppData\Local\Temp\And707B.tmp\ap p\src\main\java\Extensions\CRunWebView2.java:674: error: method does not override or implement a method from a supertype
    @Override
    ^
    C:\Users\Praveen\AppData\Local\Temp\And707B.tmp\ap p\src\main\java\Extensions\CRunWebView2.java:727: error: method does not override or implement a method from a supertype
    @Override
    ^
    C:\Users\Praveen\AppData\Local\Temp\And707B.tmp\ap p\src\main\java\Extensions\CRunWebView2.java:748: error: method does not override or implement a method from a supertype
    @Override
    ^
    C:\Users\Praveen\AppData\Local\Temp\And707B.tmp\ap p\src\main\java\Extensions\CRunWebView2.java:762: error: method does not override or implement a method from a supertype
    @Override
    ^
    C:\Users\Praveen\AppData\Local\Temp\And707B.tmp\ap p\src\main\java\Extensions\CRunWebView2.java:765: error: cannot find symbol
    super.onReceivedSslError(view, handler, error);
    ^
    symbol: method onReceivedSslError(WebView,SslErrorHandler,SslErro r)
    C:\Users\Praveen\AppData\Local\Temp\And707B.tmp\ap p\src\main\java\Extensions\CRunWebView2.java:769: error: method does not override or implement a method from a supertype
    @Override
    ^
    C:\Users\Praveen\AppData\Local\Temp\And707B.tmp\ap p\src\main\java\Extensions\CRunWebView2.java:772: error: cannot find symbol
    super.onReceivedHttpError(view, request, errorResponse);
    ^
    symbol: method onReceivedHttpError(WebView,WebResourceRequest,Web ResourceResponse)
    Note: Some input files use or override a deprecated API.
    Note: Recompile with -Xlint:deprecation for details.
    Note: Some input files use unchecked or unsafe operations.
    Note: Recompile with -Xlint:unchecked for details.
    12 errors

    > Task :app:compileDebugJavaWithJavac FAILED

    FAILURE: Build failed with an exception.

    * What went wrong:
    Execution failed for task ':app:compileDebugJavaWithJavac'.
    > Compilation failed; see the compiler error output for details.

    * Try:
    Run with --stacktrace option to get the stack trace. Run with --info or --debug option to get more log output. Run with --scan to get full insights.

    * Get more help at https://help.gradle.org

    BUILD FAILED in 10s
    25 actionable tasks: 25 executed

Page 29 of 32 FirstFirst ... 19 27 28 29 30 31 ... LastLast

Similar Threads

  1. Users that cannot build with Android Studio (ant\build.xml error)
    By Perry in forum Android Export Module 2.5
    Replies: 102
    Last Post: 28th November 2019, 07:02 PM
  2. Replies: 56
    Last Post: 26th December 2017, 08:53 PM
  3. Cannot build my Android app (ant/build.xml error)
    By oaklan5 in forum Fusion 2.5
    Replies: 1
    Last Post: 27th July 2017, 06:59 PM
  4. Replies: 15
    Last Post: 27th November 2014, 10:08 AM

Posting Permissions

  • You may not post new threads
  • You may not post replies
  • You may not post attachments
  • You may not edit your posts
  •