User Tag List

Results 1 to 3 of 3

Thread: Very problem Android Exporter!!

  1. #1
    Clicker Fusion 2.5Android Export ModuleHTML5 Export ModuleSWF Export Module
    matte's Avatar
    Join Date
    Mar 2010
    Location
    Italy
    Posts
    101
    Mentioned
    0 Post(s)
    Tagged
    0 Thread(s)

    Exclamation Very problem Android Exporter!!

    Hello everyone! I updated fusion and installed android studio and even the api 27 but I keep making this mistake because ??? thank you..

    > Task :app:preBuild UP-TO-DATE
    > Task :app:preDebugBuild
    > Task :app:compileDebugAidl NO-SOURCE
    > Task :app:compileDebugRenderscript
    > Task :app:checkDebugManifest
    > Task :app:generateDebugBuildConfig
    > Task :app:prepareLintJar
    > Task :app:generateDebugSources
    > Task :app:javaPreCompileDebug
    > Task :app:mainApkListPersistenceDebug
    > Task :app:generateDebugResValues
    > Task :app:generateDebugResources
    > Task :app:mergeDebugResources
    > Task :app:createDebugCompatibleScreenManifests
    > Task :app:processDebugManifest
    W/ResourceType( 2932): For resource 0x0101053d, entry index(1341) is beyond type entryCount(1053)
    W/ResourceType( 2932): For resource 0x0101053e, entry index(1342) is beyond type entryCount(1053)
    W/ResourceType( 2932): For resource 0x0101053b, entry index(1339) is beyond type entryCount(1053)
    W/ResourceType( 2932): For resource 0x0101053c, entry index(1340) is beyond type entryCount(1053)

    > Task :app:processDebugResources

    > Task :app:compileDebugJavaWithJavac
    C:\Users\Matthew Xeros\AppData\Local\Temp\And5F82.tmp\app\src\main\ java\Application\CSoundPlayer.java:32: error: cannot find symbol
    import android.media.AudioAttributes;
    ^
    symbol: class AudioAttributes
    location: package android.media
    C:\Users\Matthew Xeros\AppData\Local\Temp\And5F82.tmp\app\src\main\ java\Application\CSoundPlayer.java:55: error: cannot find symbol
    public AudioAttributes attributes;
    ^
    symbol: class AudioAttributes
    location: class CSoundPlayer
    C:\Users\Matthew Xeros\AppData\Local\Temp\And5F82.tmp\app\src\main\ java\Extensions\CRunWebView2.java:47: error: cannot find symbol
    import android.webkit.JavascriptInterface;
    ^
    symbol: class JavascriptInterface
    location: package android.webkit
    C:\Users\Matthew Xeros\AppData\Local\Temp\And5F82.tmp\app\src\main\ java\OpenGL\ES3Renderer.java:37: error: cannot find symbol
    import android.opengl.GLES30;
    ^
    symbol: class GLES30
    location: package android.opengl
    C:\Users\Matthew Xeros\AppData\Local\Temp\And5F82.tmp\app\src\main\ java\Extensions\CRunWebView2.java:301: error: cannot find symbol
    @JavascriptInterface
    ^
    symbol: class JavascriptInterface
    location: class CRunWebView2<JavaScriptInterface>.MyJavaScriptInte rface
    where JavaScriptInterface is a type-variable:
    JavaScriptInterface extends Object declared in class CRunWebView2
    C:\Users\Matthew Xeros\AppData\Local\Temp\And5F82.tmp\app\src\main\ java\Extensions\CRunWebView2.java:306: error: cannot find symbol
    @JavascriptInterface
    ^
    symbol: class JavascriptInterface
    location: class CRunWebView2<JavaScriptInterface>.MyJavaScriptInte rface
    where JavaScriptInterface is a type-variable:
    JavaScriptInterface extends Object declared in class CRunWebView2
    C:\Users\Matthew Xeros\AppData\Local\Temp\And5F82.tmp\app\src\main\ java\Extensions\CRunWebView2.java:311: error: cannot find symbol
    @JavascriptInterface
    ^
    symbol: class JavascriptInterface
    location: class CRunWebView2<JavaScriptInterface>.MyJavaScriptInte rface
    where JavaScriptInterface is a type-variable:
    JavaScriptInterface extends Object declared in class CRunWebView2
    C:\Users\Matthew Xeros\AppData\Local\Temp\And5F82.tmp\app\src\main\ java\Extensions\CRunWebView2.java:316: error: cannot find symbol
    @JavascriptInterface
    ^
    symbol: class JavascriptInterface
    location: class CRunWebView2<JavaScriptInterface>.MyJavaScriptInte rface
    where JavaScriptInterface is a type-variable:
    JavaScriptInterface extends Object declared in class CRunWebView2
    C:\Users\Matthew Xeros\AppData\Local\Temp\And5F82.tmp\app\src\main\ java\Extensions\CRunWebView2.java:321: error: cannot find symbol
    @JavascriptInterface
    ^
    symbol: class JavascriptInterface
    location: class CRunWebView2<JavaScriptInterface>.MyJavaScriptInte rface
    where JavaScriptInterface is a type-variable:
    JavaScriptInterface extends Object declared in class CRunWebView2
    C:\Users\Matthew Xeros\AppData\Local\Temp\And5F82.tmp\app\src\main\ java\Extensions\CRunWebView2.java:326: error: cannot find symbol
    @JavascriptInterface
    ^
    symbol: class JavascriptInterface
    location: class CRunWebView2<JavaScriptInterface>.MyJavaScriptInte rface
    where JavaScriptInterface is a type-variable:
    JavaScriptInterface extends Object declared in class CRunWebView2
    C:\Users\Matthew Xeros\AppData\Local\Temp\And5F82.tmp\app\src\main\ java\Extensions\CRunWebView2.java:331: error: cannot find symbol
    @JavascriptInterface
    ^
    symbol: class JavascriptInterface
    location: class CRunWebView2<JavaScriptInterface>.MyJavaScriptInte rface
    where JavaScriptInterface is a type-variable:
    JavaScriptInterface extends Object declared in class CRunWebView2
    C:\Users\Matthew Xeros\AppData\Local\Temp\And5F82.tmp\app\src\main\ java\Extensions\CRunWebView2.java:337: error: cannot find symbol
    @JavascriptInterface
    ^
    symbol: class JavascriptInterface
    location: class CRunWebView2<JavaScriptInterface>.MyJavaScriptInte rface
    where JavaScriptInterface is a type-variable:
    JavaScriptInterface extends Object declared in class CRunWebView2
    C:\Users\Matthew Xeros\AppData\Local\Temp\And5F82.tmp\app\src\main\ java\Application\CSoundPlayer.java:107: error: cannot find symbol
    .setContentType(AudioAttributes.CONTENT_TYPE_SONIF ICATION)
    ^
    symbol: variable AudioAttributes
    location: class CSoundPlayer
    C:\Users\Matthew Xeros\AppData\Local\Temp\And5F82.tmp\app\src\main\ java\Application\CSoundPlayer.java:106: error: cannot find symbol
    .setUsage(AudioAttributes.USAGE_GAME)
    ^
    symbol: variable AudioAttributes
    location: class CSoundPlayer
    C:\Users\Matthew Xeros\AppData\Local\Temp\And5F82.tmp\app\src\main\ java\Application\CSoundPlayer.java:105: error: package AudioAttributes does not exist
    attributes = new AudioAttributes.Builder()
    ^
    C:\Users\Matthew Xeros\AppData\Local\Temp\And5F82.tmp\app\src\main\ java\Application\CSoundPlayer.java:110: error: cannot find symbol
    soundPool = new SoundPool.Builder().setAudioAttributes(attributes) .setMaxStreams(10).build();
    ^
    symbol: class Builder
    location: class SoundPool
    C:\Users\Matthew Xeros\AppData\Local\Temp\And5F82.tmp\app\src\main\ java\Application\CSoundPlayer.java:130: error: cannot find symbol
    Log.Log("Sample rate for device: "+audioMgr.getProperty("android.media.property.OUT PUT_SAMPLE_RATE"));
    ^
    symbol: method getProperty(String)
    location: variable audioMgr of type AudioManager
    C:\Users\Matthew Xeros\AppData\Local\Temp\And5F82.tmp\app\src\main\ java\Banks\MediaSound.java:75: error: cannot find symbol
    mp[0].setNextMediaPlayer(mp[1]);
    ^
    symbol: method setNextMediaPlayer(MediaPlayer)
    location: class MediaPlayer
    C:\Users\Matthew Xeros\AppData\Local\Temp\And5F82.tmp\app\src\main\ java\Banks\MediaSound.java:76: error: cannot find symbol
    mp[1].setNextMediaPlayer(mp[2]);
    ^
    symbol: method setNextMediaPlayer(MediaPlayer)
    location: class MediaPlayer
    C:\Users\Matthew Xeros\AppData\Local\Temp\And5F82.tmp\app\src\main\ java\Banks\MediaSound.java:100: error: cannot find symbol
    mp[0].setNextMediaPlayer(mp[1]);
    ^
    symbol: method setNextMediaPlayer(MediaPlayer)
    location: class MediaPlayer
    C:\Users\Matthew Xeros\AppData\Local\Temp\And5F82.tmp\app\src\main\ java\Banks\MediaSound.java:101: error: cannot find symbol
    mp[1].setNextMediaPlayer(mp[2]);
    ^
    symbol: method setNextMediaPlayer(MediaPlayer)
    location: class MediaPlayer
    C:\Users\Matthew Xeros\AppData\Local\Temp\And5F82.tmp\app\src\main\ java\Banks\MediaSound.java:129: error: cannot find symbol
    mp[0].setNextMediaPlayer(mp[1]);
    ^
    symbol: method setNextMediaPlayer(MediaPlayer)
    location: class MediaPlayer
    C:\Users\Matthew Xeros\AppData\Local\Temp\And5F82.tmp\app\src\main\ java\Banks\MediaSound.java:130: error: cannot find symbol
    mp[1].setNextMediaPlayer(mp[2]);
    ^
    symbol: method setNextMediaPlayer(MediaPlayer)
    location: class MediaPlayer
    C:\Users\Matthew Xeros\AppData\Local\Temp\And5F82.tmp\app\src\main\ java\Banks\MediaSound.java:329: error: cannot find symbol
    mp[mpPlaying].setNextMediaPlayer(mp[mpNext]);
    ^
    symbol: method setNextMediaPlayer(MediaPlayer)
    location: class MediaPlayer
    C:\Users\Matthew Xeros\AppData\Local\Temp\And5F82.tmp\app\src\main\ java\Banks\MediaSound.java:357: error: cannot find symbol
    case MediaPlayer.MEDIA_ERROR_IO:
    ^
    symbol: variable MEDIA_ERROR_IO
    location: class MediaPlayer
    C:\Users\Matthew Xeros\AppData\Local\Temp\And5F82.tmp\app\src\main\ java\Banks\MediaSound.java:360: error: cannot find symbol
    case MediaPlayer.MEDIA_ERROR_MALFORMED:
    ^
    symbol: variable MEDIA_ERROR_MALFORMED
    location: class MediaPlayer
    C:\Users\Matthew Xeros\AppData\Local\Temp\And5F82.tmp\app\src\main\ java\Banks\MediaSound.java:363: error: cannot find symbol
    case MediaPlayer.MEDIA_ERROR_UNSUPPORTED:
    ^
    symbol: variable MEDIA_ERROR_UNSUPPORTED
    location: class MediaPlayer
    C:\Users\Matthew Xeros\AppData\Local\Temp\And5F82.tmp\app\src\main\ java\Banks\MediaSound.java:366: error: cannot find symbol
    case MediaPlayer.MEDIA_ERROR_TIMED_OUT:
    ^
    symbol: variable MEDIA_ERROR_TIMED_OUT
    location: class MediaPlayer
    C:\Users\Matthew Xeros\AppData\Local\Temp\And5F82.tmp\app\src\main\ java\Runtime\MMFRuntime.java:1355: error: cannot find symbol
    return (View.SYSTEM_UI_FLAG_FULLSCREEN
    ^
    symbol: variable SYSTEM_UI_FLAG_FULLSCREEN
    location: class View
    C:\Users\Matthew Xeros\AppData\Local\Temp\And5F82.tmp\app\src\main\ java\Runtime\MMFRuntime.java:1357: error: cannot find symbol
    | View.SYSTEM_UI_FLAG_IMMERSIVE_STICKY
    ^
    symbol: variable SYSTEM_UI_FLAG_IMMERSIVE_STICKY
    location: class View
    C:\Users\Matthew Xeros\AppData\Local\Temp\And5F82.tmp\app\src\main\ java\Runtime\MMFRuntime.java:1358: error: cannot find symbol
    | View.SYSTEM_UI_FLAG_LAYOUT_FULLSCREEN
    ^
    symbol: variable SYSTEM_UI_FLAG_LAYOUT_FULLSCREEN
    location: class View
    C:\Users\Matthew Xeros\AppData\Local\Temp\And5F82.tmp\app\src\main\ java\Runtime\MMFRuntime.java:1359: error: cannot find symbol
    | View.SYSTEM_UI_FLAG_LAYOUT_HIDE_NAVIGATION
    ^
    symbol: variable SYSTEM_UI_FLAG_LAYOUT_HIDE_NAVIGATION
    location: class View
    C:\Users\Matthew Xeros\AppData\Local\Temp\And5F82.tmp\app\src\main\ java\Runtime\MMFRuntime.java:1360: error: cannot find symbol
    | View.SYSTEM_UI_FLAG_LAYOUT_STABLE);
    ^
    symbol: variable SYSTEM_UI_FLAG_LAYOUT_STABLE
    location: class View
    C:\Users\Matthew Xeros\AppData\Local\Temp\And5F82.tmp\app\src\main\ java\Runtime\MMFRuntime.java:1371: error: cannot find symbol
    && api23Util.checkSelfPermissionApi23(Manifest.permis sion.READ_EXTERNAL_STORAGE) == PackageManager.PERMISSION_GRANTED ))
    ^
    symbol: variable READ_EXTERNAL_STORAGE
    location: class permission
    C:\Users\Matthew Xeros\AppData\Local\Temp\And5F82.tmp\app\src\main\ java\Runtime\MMFRuntime.java:2079: error: cannot find symbol
    permissionsApi23.put(Manifest.permission.READ_EXTE RNAL_STORAGE, "Read Storage");
    ^
    symbol: variable READ_EXTERNAL_STORAGE
    location: class permission
    C:\Users\Matthew Xeros\AppData\Local\Temp\And5F82.tmp\app\src\main\ java\Runtime\MMFRuntime.java:2545: error: cannot find symbol
    | View.SYSTEM_UI_FLAG_LAYOUT_HIDE_NAVIGATION
    ^
    symbol: variable SYSTEM_UI_FLAG_LAYOUT_HIDE_NAVIGATION
    location: class View
    C:\Users\Matthew Xeros\AppData\Local\Temp\And5F82.tmp\app\src\main\ java\Runtime\MMFRuntime.java:2546: error: cannot find symbol
    | View.SYSTEM_UI_FLAG_LAYOUT_FULLSCREEN
    ^
    symbol: variable SYSTEM_UI_FLAG_LAYOUT_FULLSCREEN
    location: class View
    C:\Users\Matthew Xeros\AppData\Local\Temp\And5F82.tmp\app\src\main\ java\Runtime\MMFRuntime.java:2547: error: cannot find symbol
    | View.SYSTEM_UI_FLAG_FULLSCREEN
    ^
    symbol: variable SYSTEM_UI_FLAG_FULLSCREEN
    location: class View
    C:\Users\Matthew Xeros\AppData\Local\Temp\And5F82.tmp\app\src\main\ java\Runtime\MMFRuntime.java:2559: error: cannot find symbol
    | View.SYSTEM_UI_FLAG_LAYOUT_HIDE_NAVIGATION
    ^
    symbol: variable SYSTEM_UI_FLAG_LAYOUT_HIDE_NAVIGATION
    location: class View
    C:\Users\Matthew Xeros\AppData\Local\Temp\And5F82.tmp\app\src\main\ java\Runtime\MMFRuntime.java:2560: error: cannot find symbol
    | View.SYSTEM_UI_FLAG_LAYOUT_FULLSCREEN
    ^
    symbol: variable SYSTEM_UI_FLAG_LAYOUT_FULLSCREEN
    location: class View
    C:\Users\Matthew Xeros\AppData\Local\Temp\And5F82.tmp\app\src\main\ java\Runtime\MMFRuntime.java:2561: error: cannot find symbol
    | View.SYSTEM_UI_FLAG_FULLSCREEN;
    ^
    symbol: variable SYSTEM_UI_FLAG_FULLSCREEN
    location: class View
    C:\Users\Matthew Xeros\AppData\Local\Temp\And5F82.tmp\app\src\main\ java\Extensions\CRunkcedit.java:542: error: cannot find symbol
    permissionsApi23.put(Manifest.permission.READ_EXTE RNAL_STORAGE, "Read Storage");
    ^
    symbol: variable READ_EXTERNAL_STORAGE
    location: class permission
    C:\Users\Matthew Xeros\AppData\Local\Temp\And5F82.tmp\app\src\main\ java\Extensions\CRunWebView2.java:478: error: cannot find symbol
    public boolean onShowFileChooser(WebView webView, ValueCallback<Uri[]> uploadMsg, WebChromeClient.FileChooserParams fileChooserParams) {
    ^
    symbol: class FileChooserParams
    location: class WebChromeClient
    C:\Users\Matthew Xeros\AppData\Local\Temp\And5F82.tmp\app\src\main\ java\Extensions\CRunWebView2.java:488: error: cannot find symbol
    public void showFileChooser(ValueCallback<String[]> uploadMsg, WebChromeClient.FileChooserParams fileChooserParams) {
    ^
    symbol: class FileChooserParams
    location: class WebChromeClient
    C:\Users\Matthew Xeros\AppData\Local\Temp\And5F82.tmp\app\src\main\ java\Extensions\CRunWebView2.java:476: error: method does not override or implement a method from a supertype
    @Override
    ^
    C:\Users\Matthew Xeros\AppData\Local\Temp\And5F82.tmp\app\src\main\ java\OpenGL\CTextSurface.java:357: error: cannot find symbol
    view.setTextAlignment(View.TEXT_ALIGNMENT_GRAVITY) ;
    ^
    symbol: variable TEXT_ALIGNMENT_GRAVITY
    location: class View
    C:\Users\Matthew Xeros\AppData\Local\Temp\And5F82.tmp\app\src\main\ java\OpenGL\ES3Renderer.java:156: error: cannot find symbol
    gpu = GLES30.glGetString(GLES30.GL_RENDERER);
    ^
    symbol: variable GLES30
    location: class ES3Renderer
    C:\Users\Matthew Xeros\AppData\Local\Temp\And5F82.tmp\app\src\main\ java\OpenGL\ES3Renderer.java:156: error: cannot find symbol
    gpu = GLES30.glGetString(GLES30.GL_RENDERER);
    ^
    symbol: variable GLES30
    location: class ES3Renderer
    C:\Users\Matthew Xeros\AppData\Local\Temp\And5F82.tmp\app\src\main\ java\OpenGL\ES3Renderer.java:157: error: cannot find symbol
    gpuVendor = GLES30.glGetString(GLES30.GL_VENDOR);
    ^
    symbol: variable GLES30
    location: class ES3Renderer
    C:\Users\Matthew Xeros\AppData\Local\Temp\And5F82.tmp\app\src\main\ java\OpenGL\ES3Renderer.java:157: error: cannot find symbol
    gpuVendor = GLES30.glGetString(GLES30.GL_VENDOR);
    ^
    symbol: variable GLES30
    location: class ES3Renderer
    C:\Users\Matthew Xeros\AppData\Local\Temp\And5F82.tmp\app\src\main\ java\OpenGL\ES3Renderer.java:158: error: cannot find symbol
    glVersion = GLES30.glGetString(GLES30.GL_VERSION);
    ^
    symbol: variable GLES30
    location: class ES3Renderer
    C:\Users\Matthew Xeros\AppData\Local\Temp\And5F82.tmp\app\src\main\ java\OpenGL\ES3Renderer.java:158: error: cannot find symbol
    glVersion = GLES30.glGetString(GLES30.GL_VERSION);
    ^
    symbol: variable GLES30
    location: class ES3Renderer
    C:\Users\Matthew Xeros\AppData\Local\Temp\And5F82.tmp\app\src\main\ java\OpenGL\ES3Renderer.java:160: error: cannot find symbol
    Log.Log ("GL version: " + GLES30.glGetString(GLES30.GL_VERSION));
    ^
    symbol: variable GLES30
    location: class ES3Renderer
    C:\Users\Matthew Xeros\AppData\Local\Temp\And5F82.tmp\app\src\main\ java\OpenGL\ES3Renderer.java:160: error: cannot find symbol
    Log.Log ("GL version: " + GLES30.glGetString(GLES30.GL_VERSION));
    ^
    symbol: variable GLES30
    location: class ES3Renderer
    Note: Some input files use or override a deprecated API.
    Note: Recompile with -Xlint:deprecation for details.
    Note: Some input files use unchecked or unsafe operations.
    Note: Recompile with -Xlint:unchecked for details.
    54 errors

    > Task :app:compileDebugJavaWithJavac FAILED

    FAILURE: Build failed with an exception.

    * What went wrong:
    Execution failed for task ':app:compileDebugJavaWithJavac'.
    > Compilation failed; see the compiler error output for details.

    * Try:
    Run with --stacktrace option to get the stack trace. Run with --info or --debug option to get more log output. Run with --scan to get full insights.

    * Get more help at https://help.gradle.org

    BUILD FAILED in 10s
    13 actionable tasks: 13 executed

  2. #2
    Clickteam Clickteam

    Join Date
    Jun 2006
    Location
    France
    Posts
    12,692
    Mentioned
    47 Post(s)
    Tagged
    2 Thread(s)
    Things to check:

    - verify the build API in the Android properties of your application, it should be 26 or above, better use 28.

    - verifiy the pathname of the Android SDK in the preferences of Fusion is the same as the one mentioned in the Android Studio configuration screen.

    - verify you use a recent version of the JDK 8 (latest one is 201).

  3. #3
    Clickteam Clickteam
    Fernando's Avatar
    Join Date
    Dec 2006
    Posts
    5,745
    Mentioned
    98 Post(s)
    Tagged
    2 Thread(s)
    Please also check that your min is set to 4.0.1.
    Regards,


    Fernando Vivolo

    ... new things are coming ...

Similar Threads

  1. Replies: 56
    Last Post: 26th December 2017, 08:53 PM
  2. Problem while exporting to the Android exporter!
    By Keli in forum Android Export Module 2.5
    Replies: 4
    Last Post: 15th April 2017, 09:05 PM
  3. Replies: 14
    Last Post: 28th September 2015, 03:12 PM
  4. Keyboard problem android exporter
    By Dave78 in forum Android Export Module Version 2.0
    Replies: 6
    Last Post: 29th May 2014, 01:25 AM
  5. Problem with Android Exporter, Java JDK ...
    By thomasfrenberg in forum Android Export Module 2.5
    Replies: 11
    Last Post: 8th February 2014, 04:27 PM

Posting Permissions

  • You may not post new threads
  • You may not post replies
  • You may not post attachments
  • You may not edit your posts
  •