User Tag List

Results 1 to 4 of 4

Thread: 16 error 3seconds in bulid time-android exporter

  1. #1
    Clicker Fusion 2.5Android Export ModuleHTML5 Export Module

    Join Date
    May 2019
    Location
    hackensack,nj
    Posts
    3
    Mentioned
    0 Post(s)
    Tagged
    0 Thread(s)

    Angry 16 error 3seconds in bulid time-android exporter

    I need help with the android exporter I have jdk 8 and SDK manager APIs 27,28,and 29 on my CPU but I get 16 errors in build time.

    Details

    API newest 28
    Minimum 8.0
    Target 9.0
    Landscape
    Com.yourcompany.application

    I even tried exporting it on a blank application I keep getting following.


    Buildfile: C:\Users\CRIMSO~1\AppData\Local\Temp\AndDB23.tmp\b uild.xml

    -set-mode-check:

    -set-debug-files:

    -check-env:
    [checkenv] Android SDK Tools Revision 25.2.5
    [checkenv] Installed at C:\Users\Crimson head\AppData\Local\Android\android-sdk

    -setup:
    [echo] Project Name: RuntimeAndroid
    [gettype] Project Type: Application

    -set-debug-mode:

    -debug-obfuscation-check:

    -pre-build:

    -build-setup:
    [getbuildtools] Using latest Build Tools: 29.0.0 rc3
    [echo] Resolving Build Target for RuntimeAndroid...
    [gettarget] Project Target: Android 9
    [gettarget] API level: 28
    [echo] ----------
    [echo] Creating output directories if needed...
    [mkdir] Created dir: C:\Users\CRIMSO~1\AppData\Local\Temp\AndDB23.tmp\b in
    [mkdir] Created dir: C:\Users\CRIMSO~1\AppData\Local\Temp\AndDB23.tmp\b in\res
    [mkdir] Created dir: C:\Users\CRIMSO~1\AppData\Local\Temp\AndDB23.tmp\b in\rsObj
    [mkdir] Created dir: C:\Users\CRIMSO~1\AppData\Local\Temp\AndDB23.tmp\b in\rsLibs
    [mkdir] Created dir: C:\Users\CRIMSO~1\AppData\Local\Temp\AndDB23.tmp\g en
    [mkdir] Created dir: C:\Users\CRIMSO~1\AppData\Local\Temp\AndDB23.tmp\b in\classes
    [mkdir] Created dir: C:\Users\CRIMSO~1\AppData\Local\Temp\AndDB23.tmp\b in\dexedLibs
    [echo] ----------
    [echo] Resolving Dependencies for RuntimeAndroid...
    [dependency] Library dependencies:
    [dependency] No Libraries
    [dependency]
    [dependency] ------------------
    [echo] ----------
    [echo] Building Libraries with 'debug'...
    [subant] No sub-builds to iterate on

    -code-gen:
    [mergemanifest] Merging AndroidManifest files into one.
    [mergemanifest] Manifest merger disabled. Using project manifest only.
    [echo] Handling aidl files...
    [aidl] No AIDL files to compile.
    [echo] ----------
    [echo] Handling RenderScript files...
    [echo] ----------
    [echo] Handling Resources...
    [aapt] Generating resource IDs...
    [echo] ----------
    [echo] Handling BuildConfig class...
    [buildconfig] Generating BuildConfig class.

    -pre-compile:

    -compile:
    [javac] Compiling 379 source files to C:\Users\CRIMSO~1\AppData\Local\Temp\AndDB23.tmp\b in\classes
    [javac] warning: [options] source value 1.5 is obsolete and will be removed in a future release
    [javac] warning: [options] target value 1.5 is obsolete and will be removed in a future release
    [javac] warning: [options] To suppress warnings about obsolete options, use -Xlint:-options.
    [javac] C:\Users\CRIMSO~1\AppData\Local\Temp\AndDB23.tmp\s rc\Runtime\CrashReporter.java:24: error: package org.apache.http does not exist
    [javac] import org.apache.http.HttpResponse;
    [javac] ^
    [javac] C:\Users\CRIMSO~1\AppData\Local\Temp\AndDB23.tmp\s rc\Runtime\CrashReporter.java:25: error: package org.apache.http does not exist
    [javac] import org.apache.http.NameValuePair;
    [javac] ^
    [javac] C:\Users\CRIMSO~1\AppData\Local\Temp\AndDB23.tmp\s rc\Runtime\CrashReporter.java:26: error: package org.apache.http.client.entity does not exist
    [javac] import org.apache.http.client.entity.UrlEncodedFormEntity ;
    [javac] ^
    [javac] C:\Users\CRIMSO~1\AppData\Local\Temp\AndDB23.tmp\s rc\Runtime\CrashReporter.java:27: error: package org.apache.http.client.methods does not exist
    [javac] import org.apache.http.client.methods.HttpPost;
    [javac] ^
    [javac] C:\Users\CRIMSO~1\AppData\Local\Temp\AndDB23.tmp\s rc\Runtime\CrashReporter.java:28: error: package org.apache.http.impl.client does not exist
    [javac] import org.apache.http.impl.client.DefaultHttpClient;
    [javac] ^
    [javac] C:\Users\CRIMSO~1\AppData\Local\Temp\AndDB23.tmp\s rc\Runtime\CrashReporter.java:30: error: cannot find symbol
    [javac] import org.apache.http.params.HttpProtocolParams;
    [javac] ^
    [javac] symbol: class HttpProtocolParams
    [javac] location: package org.apache.http.params
    [javac] C:\Users\CRIMSO~1\AppData\Local\Temp\AndDB23.tmp\s rc\Runtime\CrashReporter.java:63: error: cannot find symbol
    [javac] ArrayList <NameValuePair> postData = new ArrayList <NameValuePair> ();
    [javac] ^
    [javac] symbol: class NameValuePair
    [javac] location: class CrashReporter
    [javac] C:\Users\CRIMSO~1\AppData\Local\Temp\AndDB23.tmp\s rc\Runtime\CrashReporter.java:63: error: cannot find symbol
    [javac] ArrayList <NameValuePair> postData = new ArrayList <NameValuePair> ();
    [javac] ^
    [javac] symbol: class NameValuePair
    [javac] location: class CrashReporter
    [javac] C:\Users\CRIMSO~1\AppData\Local\Temp\AndDB23.tmp\s rc\Runtime\CrashReporter.java:65: error: cannot find symbol
    [javac] postData.add(new NameValuePair()
    [javac] ^
    [javac] symbol: class NameValuePair
    [javac] location: class CrashReporter
    [javac] C:\Users\CRIMSO~1\AppData\Local\Temp\AndDB23.tmp\s rc\Runtime\CrashReporter.java:95: error: cannot find symbol
    [javac] HttpPost post = new HttpPost ("http://bugs.clickteam.com/report.php");
    [javac] ^
    [javac] symbol: class HttpPost
    [javac] location: class CrashReporter
    [javac] C:\Users\CRIMSO~1\AppData\Local\Temp\AndDB23.tmp\s rc\Runtime\CrashReporter.java:95: error: cannot find symbol
    [javac] HttpPost post = new HttpPost ("http://bugs.clickteam.com/report.php");
    [javac] ^
    [javac] symbol: class HttpPost
    [javac] location: class CrashReporter
    [javac] C:\Users\CRIMSO~1\AppData\Local\Temp\AndDB23.tmp\s rc\Runtime\CrashReporter.java:99: error: cannot find symbol
    [javac] { post.setEntity (new UrlEncodedFormEntity (postData));
    [javac] ^
    [javac] symbol: class UrlEncodedFormEntity
    [javac] location: class CrashReporter
    [javac] C:\Users\CRIMSO~1\AppData\Local\Temp\AndDB23.tmp\s rc\Runtime\CrashReporter.java:105: error: cannot find symbol
    [javac] DefaultHttpClient client = new DefaultHttpClient();
    [javac] ^
    [javac] symbol: class DefaultHttpClient
    [javac] location: class CrashReporter
    [javac] C:\Users\CRIMSO~1\AppData\Local\Temp\AndDB23.tmp\s rc\Runtime\CrashReporter.java:105: error: cannot find symbol
    [javac] DefaultHttpClient client = new DefaultHttpClient();
    [javac] ^
    [javac] symbol: class DefaultHttpClient
    [javac] location: class CrashReporter
    [javac] C:\Users\CRIMSO~1\AppData\Local\Temp\AndDB23.tmp\s rc\Runtime\CrashReporter.java:108: error: cannot find symbol
    [javac] HttpProtocolParams.setUseExpectContinue (params, false);
    [javac] ^
    [javac] symbol: variable HttpProtocolParams
    [javac] location: class CrashReporter
    [javac] C:\Users\CRIMSO~1\AppData\Local\Temp\AndDB23.tmp\s rc\Runtime\CrashReporter.java:111: error: cannot find symbol
    [javac] HttpResponse response;
    [javac] ^
    [javac] symbol: class HttpResponse
    [javac] location: class CrashReporter
    [javac] Note: Some input files use or override a deprecated API.
    [javac] Note: Recompile with -Xlint:deprecation for details.
    [javac] Note: Some input files use unchecked or unsafe operations.
    [javac] Note: Recompile with -Xlint:unchecked for details.
    [javac] 16 errors
    [javac] 3 warnings

    BUILD FAILED
    C:\Users\Crimson head\AppData\Local\Android\android-sdk\tools\ant\build.xml:716: The following error occurred while executing this line:
    C:\Users\Crimson head\AppData\Local\Android\android-sdk\tools\ant\build.xml:730: Compile failed; see the compiler error output for details.

    Total time: 3 seconds

  2. #2
    Clickteam Clickteam

    Join Date
    Jun 2006
    Location
    France
    Posts
    12,917
    Mentioned
    94 Post(s)
    Tagged
    2 Thread(s)
    What build of Fusion do you use? It seems that you don't use the latest build. (I could be wrong)

  3. #3
    Clicker Fusion 2.5Android Export ModuleHTML5 Export Module

    Join Date
    May 2019
    Location
    hackensack,nj
    Posts
    3
    Mentioned
    0 Post(s)
    Tagged
    0 Thread(s)
    The exporter is out of date give me a .... ok, it worked! Thanks for help.

  4. #4
    Clickteam Clickteam
    Fernando's Avatar
    Join Date
    Dec 2006
    Posts
    6,041
    Mentioned
    130 Post(s)
    Tagged
    3 Thread(s)
    To All

    When you get this error

    CrashReporter.java:24: error: package org.apache.http does not exist
    [javac] import org.apache.http.HttpResponse;

    means that you are using an old build version and you need to update.

    these error are due that android (google) removed these imports from building process.
    Regards,


    Fernando Vivolo

    ... new things are coming ...

Similar Threads

  1. Android Exporter Error Targeting API 26
    By Travis in forum Android Export Module 2.5
    Replies: 1
    Last Post: 11th July 2018, 09:59 PM
  2. Replies: 56
    Last Post: 26th December 2017, 08:53 PM
  3. Error compiling in android exporter
    By Esa in forum Android Export Module 2.5
    Replies: 11
    Last Post: 22nd October 2017, 05:40 PM
  4. Error buildinf with android exporter pls help!!!!
    By AGX in forum Android Export Module 2.5
    Replies: 1
    Last Post: 8th January 2016, 04:30 PM

Posting Permissions

  • You may not post new threads
  • You may not post replies
  • You may not post attachments
  • You may not edit your posts
  •