User Tag List

Page 1 of 2 1 2 LastLast
Results 1 to 10 of 12

Thread: Odd compile error Gradle / Admob with latest built.

  1. #1
    Forum Moderator

    Fusion 2.5 MacFusion 2.5 DeveloperFusion 2.5+ DLCAndroid Export ModuleHTML5 Export ModuleiOS Export ModuleUniversal Windows Platform Export ModuleSWF Export ModuleMac Export ModuleInstall Creator Pro
    Fusion 2.5 (Steam)Fusion 2.5 Developer (Steam)Android Export Module (Steam)HTML5 Export Module (Steam)iOS Export Module (Steam)
    Perry's Avatar
    Join Date
    Dec 2013
    Location
    Watertown, WI
    Posts
    4,323
    Mentioned
    44 Post(s)
    Tagged
    0 Thread(s)

    Odd compile error Gradle / Admob with latest built.

    I've compiled several programs, with existing Admob and no problem.
    Now with the latest built, I add Admob and get all these errors.

    Any suggestions?


    > Task :app:preBuild UP-TO-DATE
    > Task :app:preReleaseBuild
    > Task :app:compileReleaseAidl
    > Task :app:compileReleaseRenderscript NO-SOURCE
    > Task :app:checkReleaseManifest
    > Task :app:generateReleaseBuildConfig
    > Task :app:prepareLintJar
    > Task :app:generateReleaseSources
    > Task :app:javaPreCompileRelease
    > Task :app:mainApkListPersistenceRelease
    > Task :app:generateReleaseResValues
    > Task :app:generateReleaseResources
    > Task :app:mergeReleaseResources
    > Task :app:createReleaseCompatibleScreenManifests
    > Task :app:processReleaseManifest
    > Task :app:processReleaseResources

    > Task :app:compileReleaseJavaWithJavac FAILED
    C:\Users\Perry\AppData\Local\Temp\AndF23B.tmp\app\ src\main\java\Extensions\CRunAdMob.java:44: error: package com.google.android.gms.ads does not exist
    import com.google.android.gms.ads.AdListener;
    ^
    C:\Users\Perry\AppData\Local\Temp\AndF23B.tmp\app\ src\main\java\Extensions\CRunAdMob.java:45: error: package com.google.android.gms.ads.mediation does not exist
    import com.google.android.gms.ads.mediation.MediationAdap ter;
    ^
    C:\Users\Perry\AppData\Local\Temp\AndF23B.tmp\app\ src\main\java\Extensions\CRunAdMob.java:46: error: package com.google.android.gms.ads.reward does not exist
    import com.google.android.gms.ads.reward.RewardItem;
    ^
    C:\Users\Perry\AppData\Local\Temp\AndF23B.tmp\app\ src\main\java\Extensions\CRunAdMob.java:47: error: package com.google.android.gms.ads.reward does not exist
    import com.google.android.gms.ads.reward.RewardedVideoAdL istener;
    ^
    C:\Users\Perry\AppData\Local\Temp\AndF23B.tmp\app\ src\main\java\Extensions\CRunAdMob.java:48: error: package com.google.android.gms.ads does not exist
    import com.google.android.gms.ads.AdRequest;
    ^
    C:\Users\Perry\AppData\Local\Temp\AndF23B.tmp\app\ src\main\java\Extensions\CRunAdMob.java:49: error: package com.google.android.gms.ads does not exist
    import com.google.android.gms.ads.AdView;
    ^
    C:\Users\Perry\AppData\Local\Temp\AndF23B.tmp\app\ src\main\java\Extensions\CRunAdMob.java:50: error: package com.google.android.gms.ads does not exist
    import com.google.android.gms.ads.InterstitialAd;
    ^
    C:\Users\Perry\AppData\Local\Temp\AndF23B.tmp\app\ src\main\java\Extensions\CRunAdMob.java:51: error: package com.google.android.gms.ads does not exist
    import com.google.android.gms.ads.AdSize;
    ^
    C:\Users\Perry\AppData\Local\Temp\AndF23B.tmp\app\ src\main\java\Extensions\CRunAdMob.java:52: error: package com.google.android.gms.ads does not exist
    import com.google.android.gms.ads.MobileAds;
    ^
    C:\Users\Perry\AppData\Local\Temp\AndF23B.tmp\app\ src\main\java\Extensions\CRunAdMob.java:53: error: package com.google.android.gms.ads.reward does not exist
    import com.google.android.gms.ads.reward.RewardedVideoAd;
    ^
    C:\Users\Perry\AppData\Local\Temp\AndF23B.tmp\app\ src\main\java\Extensions\CRunAdMob.java:174: error: cannot find symbol
    private AdView adView = null;
    ^
    symbol: class AdView
    location: class CRunAdMob
    C:\Users\Perry\AppData\Local\Temp\AndF23B.tmp\app\ src\main\java\Extensions\CRunAdMob.java:175: error: cannot find symbol
    private InterstitialAd interstitial = null;
    ^
    symbol: class InterstitialAd
    location: class CRunAdMob
    C:\Users\Perry\AppData\Local\Temp\AndF23B.tmp\app\ src\main\java\Extensions\CRunAdMob.java:176: error: cannot find symbol
    private RewardedVideoAd videoreward = null;
    ^
    symbol: class RewardedVideoAd
    location: class CRunAdMob
    C:\Users\Perry\AppData\Local\Temp\AndF23B.tmp\app\ src\main\java\Extensions\CRunAdMob.java:114: error: cannot find symbol
    AdSize adSize;
    ^
    symbol: class AdSize
    location: class CRunAdMob.AdMobAds
    C:\Users\Perry\AppData\Local\Temp\AndF23B.tmp\app\ src\main\java\Extensions\CRunAdMob.java:117: error: cannot find symbol
    int gender = AdRequest.GENDER_UNKNOWN;
    ^
    symbol: variable AdRequest
    location: class CRunAdMob.AdMobAds
    C:\Users\Perry\AppData\Local\Temp\AndF23B.tmp\app\ src\main\java\Extensions\CRunAdMob.java:198: error: cannot find symbol
    case AdRequest.ERROR_CODE_INTERNAL_ERROR:
    ^
    symbol: variable AdRequest
    location: class CRunAdMob
    C:\Users\Perry\AppData\Local\Temp\AndF23B.tmp\app\ src\main\java\Extensions\CRunAdMob.java:201: error: cannot find symbol
    case AdRequest.ERROR_CODE_INVALID_REQUEST:
    ^
    symbol: variable AdRequest
    location: class CRunAdMob
    C:\Users\Perry\AppData\Local\Temp\AndF23B.tmp\app\ src\main\java\Extensions\CRunAdMob.java:204: error: cannot find symbol
    case AdRequest.ERROR_CODE_NETWORK_ERROR:
    ^
    symbol: variable AdRequest
    location: class CRunAdMob
    C:\Users\Perry\AppData\Local\Temp\AndF23B.tmp\app\ src\main\java\Extensions\CRunAdMob.java:207: error: cannot find symbol
    case AdRequest.ERROR_CODE_NO_FILL:
    ^
    symbol: variable AdRequest
    location: class CRunAdMob
    C:\Users\Perry\AppData\Local\Temp\AndF23B.tmp\app\ src\main\java\Extensions\CRunAdMob.java:224: error: cannot find symbol
    MobileAds.initialize(MMFRuntime.inst, IntersAds.AppID.replace("/", "~"));
    ^
    symbol: variable MobileAds
    location: class CRunAdMob
    C:\Users\Perry\AppData\Local\Temp\AndF23B.tmp\app\ src\main\java\Extensions\CRunAdMob.java:225: error: cannot find symbol
    interstitial = new InterstitialAd(MMFRuntime.inst);
    ^
    symbol: class InterstitialAd
    location: class CRunAdMob
    C:\Users\Perry\AppData\Local\Temp\AndF23B.tmp\app\ src\main\java\Extensions\CRunAdMob.java:228: error: package AdRequest does not exist
    final AdRequest.Builder builder = new AdRequest.Builder();
    ^
    C:\Users\Perry\AppData\Local\Temp\AndF23B.tmp\app\ src\main\java\Extensions\CRunAdMob.java:228: error: package AdRequest does not exist
    final AdRequest.Builder builder = new AdRequest.Builder();
    ^
    C:\Users\Perry\AppData\Local\Temp\AndF23B.tmp\app\ src\main\java\Extensions\CRunAdMob.java:243: error: cannot find symbol
    builder.addTestDevice(AdRequest.DEVICE_ID_EMULATOR );
    ^
    symbol: variable AdRequest
    location: class CRunAdMob
    C:\Users\Perry\AppData\Local\Temp\AndF23B.tmp\app\ src\main\java\Extensions\CRunAdMob.java:284: error: cannot find symbol
    builder.addNetworkExtrasBundle(MediationAdapter.cl ass, bundle);
    ^
    symbol: class MediationAdapter
    location: class CRunAdMob
    C:\Users\Perry\AppData\Local\Temp\AndF23B.tmp\app\ src\main\java\Extensions\CRunAdMob.java:290: error: cannot find symbol
    interstitial.setAdListener(new AdListener () {
    ^
    symbol: class AdListener
    location: class CRunAdMob
    C:\Users\Perry\AppData\Local\Temp\AndF23B.tmp\app\ src\main\java\Extensions\CRunAdMob.java:337: error: cannot find symbol
    final AdRequest request = builder.build();
    ^
    symbol: class AdRequest
    location: class CRunAdMob
    C:\Users\Perry\AppData\Local\Temp\AndF23B.tmp\app\ src\main\java\Extensions\CRunAdMob.java:375: error: cannot find symbol
    MobileAds.initialize(MMFRuntime.inst, xAds.AppID.replace("/", "~"));
    ^
    symbol: variable MobileAds
    location: class CRunAdMob
    C:\Users\Perry\AppData\Local\Temp\AndF23B.tmp\app\ src\main\java\Extensions\CRunAdMob.java:378: error: cannot find symbol
    adView = new AdView(MMFRuntime.inst);
    ^
    symbol: class AdView
    location: class CRunAdMob
    C:\Users\Perry\AppData\Local\Temp\AndF23B.tmp\app\ src\main\java\Extensions\CRunAdMob.java:418: error: package AdRequest does not exist
    final AdRequest.Builder builder = new AdRequest.Builder();
    ^
    C:\Users\Perry\AppData\Local\Temp\AndF23B.tmp\app\ src\main\java\Extensions\CRunAdMob.java:418: error: package AdRequest does not exist
    final AdRequest.Builder builder = new AdRequest.Builder();
    ^
    C:\Users\Perry\AppData\Local\Temp\AndF23B.tmp\app\ src\main\java\Extensions\CRunAdMob.java:434: error: cannot find symbol
    builder.addTestDevice(AdRequest.DEVICE_ID_EMULATOR );
    ^
    symbol: variable AdRequest
    location: class CRunAdMob
    C:\Users\Perry\AppData\Local\Temp\AndF23B.tmp\app\ src\main\java\Extensions\CRunAdMob.java:477: error: cannot find symbol
    builder.addNetworkExtrasBundle(MediationAdapter.cl ass, bundle);
    ^
    symbol: class MediationAdapter
    location: class CRunAdMob
    C:\Users\Perry\AppData\Local\Temp\AndF23B.tmp\app\ src\main\java\Extensions\CRunAdMob.java:482: error: cannot find symbol
    AdRequest request = builder.build();
    ^
    symbol: class AdRequest
    location: class CRunAdMob
    C:\Users\Perry\AppData\Local\Temp\AndF23B.tmp\app\ src\main\java\Extensions\CRunAdMob.java:484: error: cannot find symbol
    adView.setAdListener(new AdListener () {
    ^
    symbol: class AdListener
    location: class CRunAdMob
    C:\Users\Perry\AppData\Local\Temp\AndF23B.tmp\app\ src\main\java\Extensions\CRunAdMob.java:567: error: cannot find symbol
    MobileAds.initialize(MMFRuntime.inst, VideoAds.AppID.replace("/", "~"));
    ^
    symbol: variable MobileAds
    location: class CRunAdMob
    C:\Users\Perry\AppData\Local\Temp\AndF23B.tmp\app\ src\main\java\Extensions\CRunAdMob.java:569: error: cannot find symbol
    videoreward = MobileAds.getRewardedVideoAdInstance((MMFRuntime.i nst));
    ^
    symbol: variable MobileAds
    location: class CRunAdMob
    C:\Users\Perry\AppData\Local\Temp\AndF23B.tmp\app\ src\main\java\Extensions\CRunAdMob.java:571: error: package AdRequest does not exist
    final AdRequest.Builder builder = new AdRequest.Builder();
    ^
    C:\Users\Perry\AppData\Local\Temp\AndF23B.tmp\app\ src\main\java\Extensions\CRunAdMob.java:571: error: package AdRequest does not exist
    final AdRequest.Builder builder = new AdRequest.Builder();
    ^
    C:\Users\Perry\AppData\Local\Temp\AndF23B.tmp\app\ src\main\java\Extensions\CRunAdMob.java:586: error: cannot find symbol
    builder.addTestDevice(AdRequest.DEVICE_ID_EMULATOR );
    ^
    symbol: variable AdRequest
    location: class CRunAdMob
    C:\Users\Perry\AppData\Local\Temp\AndF23B.tmp\app\ src\main\java\Extensions\CRunAdMob.java:627: error: cannot find symbol
    builder.addNetworkExtrasBundle(MediationAdapter.cl ass, bundle);
    ^
    symbol: class MediationAdapter
    location: class CRunAdMob
    C:\Users\Perry\AppData\Local\Temp\AndF23B.tmp\app\ src\main\java\Extensions\CRunAdMob.java:633: error: cannot find symbol
    videoreward.setRewardedVideoAdListener(new RewardedVideoAdListener () {
    ^
    symbol: class RewardedVideoAdListener
    location: class CRunAdMob
    C:\Users\Perry\AppData\Local\Temp\AndF23B.tmp\app\ src\main\java\Extensions\CRunAdMob.java:702: error: cannot find symbol
    AdRequest request = builder.build();
    ^
    symbol: class AdRequest
    location: class CRunAdMob
    C:\Users\Perry\AppData\Local\Temp\AndF23B.tmp\app\ src\main\java\Extensions\CRunAdMob.java:787: error: cannot find symbol
    mmfAdMob.adSize = AdSize.BANNER;
    ^
    symbol: variable AdSize
    location: class CRunAdMob
    C:\Users\Perry\AppData\Local\Temp\AndF23B.tmp\app\ src\main\java\Extensions\CRunAdMob.java:813: error: cannot find symbol
    mmfAdMob.adSize = AdSize.BANNER;
    ^
    symbol: variable AdSize
    location: class CRunAdMob
    C:\Users\Perry\AppData\Local\Temp\AndF23B.tmp\app\ src\main\java\Extensions\CRunAdMob.java:816: error: cannot find symbol
    mmfAdMob.adSize = AdSize.MEDIUM_RECTANGLE;
    ^
    symbol: variable AdSize
    location: class CRunAdMob
    C:\Users\Perry\AppData\Local\Temp\AndF23B.tmp\app\ src\main\java\Extensions\CRunAdMob.java:819: error: cannot find symbol
    mmfAdMob.adSize = AdSize.FULL_BANNER;
    ^
    symbol: variable AdSize
    location: class CRunAdMob
    C:\Users\Perry\AppData\Local\Temp\AndF23B.tmp\app\ src\main\java\Extensions\CRunAdMob.java:822: error: cannot find symbol
    mmfAdMob.adSize = AdSize.LEADERBOARD;
    ^
    symbol: variable AdSize
    location: class CRunAdMob
    C:\Users\Perry\AppData\Local\Temp\AndF23B.tmp\app\ src\main\java\Extensions\CRunAdMob.java:825: error: cannot find symbol
    mmfAdMob.adSize = AdSize.SMART_BANNER;
    ^
    symbol: variable AdSize
    location: class CRunAdMob
    C:\Users\Perry\AppData\Local\Temp\AndF23B.tmp\app\ src\main\java\Extensions\CRunAdMob.java:1287: error: cannot find symbol
    mmfAdMob.adSize = AdSize.BANNER;
    ^
    symbol: variable AdSize
    location: class CRunAdMob
    C:\Users\Perry\AppData\Local\Temp\AndF23B.tmp\app\ src\main\java\Extensions\CRunAdMob.java:1291: error: cannot find symbol
    mmfAdMob.adSize = AdSize.MEDIUM_RECTANGLE;
    ^
    symbol: variable AdSize
    location: class CRunAdMob
    C:\Users\Perry\AppData\Local\Temp\AndF23B.tmp\app\ src\main\java\Extensions\CRunAdMob.java:1295: error: cannot find symbol
    mmfAdMob.adSize = AdSize.FULL_BANNER;
    ^
    symbol: variable AdSize
    location: class CRunAdMob
    C:\Users\Perry\AppData\Local\Temp\AndF23B.tmp\app\ src\main\java\Extensions\CRunAdMob.java:1299: error: cannot find symbol
    mmfAdMob.adSize = AdSize.LEADERBOARD;
    ^
    symbol: variable AdSize
    location: class CRunAdMob
    C:\Users\Perry\AppData\Local\Temp\AndF23B.tmp\app\ src\main\java\Extensions\CRunAdMob.java:1303: error: cannot find symbol
    mmfAdMob.adSize = AdSize.SMART_BANNER;
    ^
    symbol: variable AdSize
    location: class CRunAdMob
    C:\Users\Perry\AppData\Local\Temp\AndF23B.tmp\app\ src\main\java\Extensions\CRunAdMob.java:1386: error: cannot find symbol
    mmfAdMob.gender = AdRequest.GENDER_UNKNOWN;
    ^
    symbol: variable AdRequest
    location: class CRunAdMob
    C:\Users\Perry\AppData\Local\Temp\AndF23B.tmp\app\ src\main\java\Extensions\CRunAdMob.java:1389: error: cannot find symbol
    mmfAdMob.gender = AdRequest.GENDER_MALE;
    ^
    symbol: variable AdRequest
    location: class CRunAdMob
    C:\Users\Perry\AppData\Local\Temp\AndF23B.tmp\app\ src\main\java\Extensions\CRunAdMob.java:1392: error: cannot find symbol
    mmfAdMob.gender = AdRequest.GENDER_FEMALE;
    ^
    symbol: variable AdRequest
    location: class CRunAdMob
    Note: Some input files use or override a deprecated API.
    Note: Recompile with -Xlint:deprecation for details.
    Note: Some input files use unchecked or unsafe operations.
    Note: Recompile with -Xlint:unchecked for details.
    57 errors

    FAILURE: Build failed with an exception.

    * What went wrong:
    Execution failed for task ':app:compileReleaseJavaWithJavac'.
    > Compilation failed; see the compiler error output for details.

    * Try:
    Run with --stacktrace option to get the stack trace. Run with --info or --debug option to get more log output. Run with --scan to get full insights.

    * Get more help at https://help.gradle.org

    Deprecated Gradle features were used in this build, making it incompatible with Gradle 6.0.
    Use '--warning-mode all' to show the individual deprecation warnings.
    See https://docs.gradle.org/5.1.1/usergu..._line_warnings

    BUILD FAILED in 5s
    13 actionable tasks: 13 executed

  2. #2
    Clickteam Clickteam
    Fernando's Avatar
    Join Date
    Dec 2006
    Posts
    6,051
    Mentioned
    131 Post(s)
    Tagged
    3 Thread(s)
    Do you have internet, Anything change in your preferences, settings?

    test here admob and admob with chartboost and seem to be OK
    Regards,


    Fernando Vivolo

    ... new things are coming ...

  3. #3
    Forum Moderator

    Fusion 2.5 MacFusion 2.5 DeveloperFusion 2.5+ DLCAndroid Export ModuleHTML5 Export ModuleiOS Export ModuleUniversal Windows Platform Export ModuleSWF Export ModuleMac Export ModuleInstall Creator Pro
    Fusion 2.5 (Steam)Fusion 2.5 Developer (Steam)Android Export Module (Steam)HTML5 Export Module (Steam)iOS Export Module (Steam)
    Perry's Avatar
    Join Date
    Dec 2013
    Location
    Watertown, WI
    Posts
    4,323
    Mentioned
    44 Post(s)
    Tagged
    0 Thread(s)
    I have internet, account, network checked.
    it's all the same for all my apps.
    I just updated a few other Apps, and added the Admob in there, and getting the same errors.
    Most of it didn't have any errors, but there are a few.

    Kinda puzzles as of why.

    I will sent you an e-mail with 1 of the mfa.

    1 thing might be relevant... the MFA's we're from 2015/2016 .. Maybe something incompatible?

    Anyways.. e-mail sent

  4. #4
    Forum Moderator

    Fusion 2.5 MacFusion 2.5 DeveloperFusion 2.5+ DLCAndroid Export ModuleHTML5 Export ModuleiOS Export ModuleUniversal Windows Platform Export ModuleSWF Export ModuleMac Export ModuleInstall Creator Pro
    Fusion 2.5 (Steam)Fusion 2.5 Developer (Steam)Android Export Module (Steam)HTML5 Export Module (Steam)iOS Export Module (Steam)
    Perry's Avatar
    Join Date
    Dec 2013
    Location
    Watertown, WI
    Posts
    4,323
    Mentioned
    44 Post(s)
    Tagged
    0 Thread(s)
    I think I found the problem.

    If you use Chartboost and Admob together, then Gradle will crash.

    I removed my old Chartboost, and that made the error go away.
    Need to check my other apps too. to see if there is a leftover behind from chartboost

  5. #5
    Clickteam Clickteam
    Fernando's Avatar
    Join Date
    Dec 2006
    Posts
    6,051
    Mentioned
    131 Post(s)
    Tagged
    3 Thread(s)
    mm but i have here an example with both and it built OK, i will check later

    =============================================

    check this example and let me know if you can build there

    https://drive.google.com/file/d/1deAHAyv3Rlsq6m_zVqzNU5li8ef3eyU0/view?usp=sharing
    Regards,


    Fernando Vivolo

    ... new things are coming ...

  6. #6
    Forum Moderator

    Fusion 2.5 MacFusion 2.5 DeveloperFusion 2.5+ DLCAndroid Export ModuleHTML5 Export ModuleiOS Export ModuleUniversal Windows Platform Export ModuleSWF Export ModuleMac Export ModuleInstall Creator Pro
    Fusion 2.5 (Steam)Fusion 2.5 Developer (Steam)Android Export Module (Steam)HTML5 Export Module (Steam)iOS Export Module (Steam)
    Perry's Avatar
    Join Date
    Dec 2013
    Location
    Watertown, WI
    Posts
    4,323
    Mentioned
    44 Post(s)
    Tagged
    0 Thread(s)
    interesting.
    Your example works fine.

    if you check the file i have sent you on 2 frames there is a Chartboost object.
    once you delete those it works.

    I checked all my other old apps, and they all had the same problem.. once removed it worked.
    idk if it was a mix of MFA incompatible? (some of them we're compile with API 14 / 17 lol)

  7. #7
    Clickteam Clickteam
    Fernando's Avatar
    Join Date
    Dec 2006
    Posts
    6,051
    Mentioned
    131 Post(s)
    Tagged
    3 Thread(s)
    mm not sure why it works with some mfa and others not, i will make a check here
    Regards,


    Fernando Vivolo

    ... new things are coming ...

  8. #8
    Forum Moderator

    Fusion 2.5 MacFusion 2.5 DeveloperFusion 2.5+ DLCAndroid Export ModuleHTML5 Export ModuleiOS Export ModuleUniversal Windows Platform Export ModuleSWF Export ModuleMac Export ModuleInstall Creator Pro
    Fusion 2.5 (Steam)Fusion 2.5 Developer (Steam)Android Export Module (Steam)HTML5 Export Module (Steam)iOS Export Module (Steam)
    Perry's Avatar
    Join Date
    Dec 2013
    Location
    Watertown, WI
    Posts
    4,323
    Mentioned
    44 Post(s)
    Tagged
    0 Thread(s)
    No idea.. but you will see it once you check the mfa.

  9. #9
    Clickteam Clickteam
    Fernando's Avatar
    Join Date
    Dec 2006
    Posts
    6,051
    Mentioned
    131 Post(s)
    Tagged
    3 Thread(s)
    @Perry i found why, if chartboost is created before any admob object can cause this problem, I always check both or chartboost after, never before , I will make the changes here and send you a new editor extension for you to try there
    Regards,


    Fernando Vivolo

    ... new things are coming ...

  10. #10
    Forum Moderator

    Fusion 2.5 MacFusion 2.5 DeveloperFusion 2.5+ DLCAndroid Export ModuleHTML5 Export ModuleiOS Export ModuleUniversal Windows Platform Export ModuleSWF Export ModuleMac Export ModuleInstall Creator Pro
    Fusion 2.5 (Steam)Fusion 2.5 Developer (Steam)Android Export Module (Steam)HTML5 Export Module (Steam)iOS Export Module (Steam)
    Perry's Avatar
    Join Date
    Dec 2013
    Location
    Watertown, WI
    Posts
    4,323
    Mentioned
    44 Post(s)
    Tagged
    0 Thread(s)
    Ah. glad you found the issue.

Page 1 of 2 1 2 LastLast

Similar Threads

  1. Admob with new Google Ad compile error
    By Perry in forum iOS Export Module 2.5
    Replies: 12
    Last Post: 6th February 2017, 10:30 AM
  2. Latest Google Ad Framework won't compile?
    By Perry in forum iOS Export Module 2.5
    Replies: 11
    Last Post: 14th January 2017, 10:12 PM
  3. Has anyone tried to compile in XCODE with the latest build
    By aenever in forum iOS Export Module 2.5
    Replies: 6
    Last Post: 15th June 2015, 08:13 PM
  4. Cannot Compile (Latest APIs and SDK Installed)
    By Danny in forum Android Export Module Version 2.0
    Replies: 5
    Last Post: 26th March 2012, 07:49 PM
  5. Cannot compile FLASH after installing latest beta
    By Tuna in forum SWF/Flash Export Module Version 2.0
    Replies: 4
    Last Post: 15th December 2011, 09:31 AM

Posting Permissions

  • You may not post new threads
  • You may not post replies
  • You may not post attachments
  • You may not edit your posts
  •