User Tag List

Page 2 of 3 FirstFirst 1 2 3 LastLast
Results 11 to 20 of 22

Thread: Build failing with version 292.10 but working with version 292.7- Daemon startup fail

  1. #11
    Clicker Fusion 2.5 (Steam)Fusion 2.5 Developer (Steam)Android Export Module (Steam)iOS Export Module (Steam)

    Join Date
    May 2014
    Posts
    190
    Mentioned
    6 Post(s)
    Tagged
    0 Thread(s)
    The thing is that I can't find a runtime and gradle lib in the link you sent me in private message. Only a CalcRect.zip file.

    I just tried clearing the cache (by deleting the cache folder from .gradle like it says in that link), and then I relaunched the build with version 3.4.1 in the runtime file, but it still gave me the same error. The only difference was that it took longer, and that it recreated the cache folder. After that I switched it back to 3.3.2 and it worked again. Without doing any other modifications to the runtime or the gradlelib file. Just switched the version number from inside the build.gradle file.

    It's strange that the link redirects you automatically towards the index.html, because it redirects me to a different site, which is the one that gives me the 404 error. This is the site that it redirects me to: https://dl.google.com/dl/android/maven2/android/

    Maybe it's somehow this faulty redirection on my end that is causing the problem? Does Clickteam try to download something from that link when it's doing the build?

  2. #12
    Clickteam Clickteam
    Fernando's Avatar
    Join Date
    Dec 2006
    Posts
    6,039
    Mentioned
    130 Post(s)
    Tagged
    3 Thread(s)
    No Clickteam directly, android runtime use the Gradle builder, who looks in maven https://dl.google.com/dl/android/maven2/index.html for missing files

    let me sent you a new PM with the link , weird should be there




    Regards,


    Fernando Vivolo

    ... new things are coming ...

  3. #13
    Clicker Fusion 2.5 (Steam)Fusion 2.5 Developer (Steam)Android Export Module (Steam)iOS Export Module (Steam)

    Join Date
    May 2014
    Posts
    190
    Mentioned
    6 Post(s)
    Tagged
    0 Thread(s)
    I tried clearing the cache and then launching the build again with the files from the PM but I still got the same error, unfortunately. I'm probably going to have to try out building the mfa on Windows 10 to see if it's indeed my Windows 7 system that has a problem.

    I have a Windows 10 operating system installed, but I'll have to install gradle, Clickteam and everything else on it. I'm a little busy these days, so I'll try doing that sometime next week.

  4. #14
    Clickteam Clickteam
    Fernando's Avatar
    Join Date
    Dec 2006
    Posts
    6,039
    Mentioned
    130 Post(s)
    Tagged
    3 Thread(s)
    mm i will check on teh net to see if someone have post anything related this.
    Regards,


    Fernando Vivolo

    ... new things are coming ...

  5. #15
    Clicker Fusion 2.5 DeveloperAndroid Export ModuleiOS Export Module

    Join Date
    Jun 2006
    Posts
    168
    Mentioned
    1 Post(s)
    Tagged
    0 Thread(s)
    I also cannot build Android applications.

    Please find below the error log:

    Code:
    > Configure project :app
    Exception while marshalling C:\Program Files (x86)\Android\android-sdk\add-ons\addon-google_apis-google-22\package.xml. Probably the SDK is read-only
    Exception while marshalling C:\Program Files (x86)\Android\android-sdk\build-tools\22.0.1\package.xml. Probably the SDK is read-only
    Exception while marshalling C:\Program Files (x86)\Android\android-sdk\build-tools\28.0.3\package.xml. Probably the SDK is read-only
    Exception while marshalling C:\Program Files (x86)\Android\android-sdk\build-tools\29.0.1\package.xml. Probably the SDK is read-only
    Exception while marshalling C:\Program Files (x86)\Android\android-sdk\extras\android\m2repository\package.xml. Probably the SDK is read-only
    Exception while marshalling C:\Program Files (x86)\Android\android-sdk\extras\google\auto\package.xml. Probably the SDK is read-only
    Exception while marshalling C:\Program Files (x86)\Android\android-sdk\extras\google\google_play_services\package.xml. Probably the SDK is read-only
    Exception while marshalling C:\Program Files (x86)\Android\android-sdk\extras\google\instantapps\package.xml. Probably the SDK is read-only
    Exception while marshalling C:\Program Files (x86)\Android\android-sdk\extras\google\m2repository\package.xml. Probably the SDK is read-only
    Exception while marshalling C:\Program Files (x86)\Android\android-sdk\extras\google\market_apk_expansion\package.xml. Probably the SDK is read-only
    Exception while marshalling C:\Program Files (x86)\Android\android-sdk\extras\google\market_licensing\package.xml. Probably the SDK is read-only
    Exception while marshalling C:\Program Files (x86)\Android\android-sdk\extras\google\simulators\package.xml. Probably the SDK is read-only
    Exception while marshalling C:\Program Files (x86)\Android\android-sdk\extras\google\usb_driver\package.xml. Probably the SDK is read-only
    Exception while marshalling C:\Program Files (x86)\Android\android-sdk\extras\google\webdriver\package.xml. Probably the SDK is read-only
    Exception while marshalling C:\Program Files (x86)\Android\android-sdk\platform-tools\package.xml. Probably the SDK is read-only
    Exception while marshalling C:\Program Files (x86)\Android\android-sdk\platforms\android-14\package.xml. Probably the SDK is read-only
    Exception while marshalling C:\Program Files (x86)\Android\android-sdk\platforms\android-22\package.xml. Probably the SDK is read-only
    Exception while marshalling C:\Program Files (x86)\Android\android-sdk\platforms\android-28\package.xml. Probably the SDK is read-only
    Exception while marshalling C:\Program Files (x86)\Android\android-sdk\platforms\android-29\package.xml. Probably the SDK is read-only
    Exception while marshalling C:\Program Files (x86)\Android\android-sdk\sources\android-22\package.xml. Probably the SDK is read-only
    Exception while marshalling C:\Program Files (x86)\Android\android-sdk\sources\android-28\package.xml. Probably the SDK is read-only
    Exception while marshalling C:\Program Files (x86)\Android\android-sdk\system-images\android-14\default\armeabi-v7a\package.xml. Probably the SDK is read-only
    Exception while marshalling C:\Program Files (x86)\Android\android-sdk\system-images\android-22\android-tv\x86\package.xml. Probably the SDK is read-only
    Exception while marshalling C:\Program Files (x86)\Android\android-sdk\system-images\android-22\default\armeabi-v7a\package.xml. Probably the SDK is read-only
    Exception while marshalling C:\Program Files (x86)\Android\android-sdk\system-images\android-22\default\x86\package.xml. Probably the SDK is read-only
    Exception while marshalling C:\Program Files (x86)\Android\android-sdk\system-images\android-22\default\x86_64\package.xml. Probably the SDK is read-only
    Exception while marshalling C:\Program Files (x86)\Android\android-sdk\system-images\android-22\google_apis\armeabi-v7a\package.xml. Probably the SDK is read-only
    Exception while marshalling C:\Program Files (x86)\Android\android-sdk\system-images\android-22\google_apis\x86\package.xml. Probably the SDK is read-only
    Exception while marshalling C:\Program Files (x86)\Android\android-sdk\system-images\android-22\google_apis\x86_64\package.xml. Probably the SDK is read-only
    Exception while marshalling C:\Program Files (x86)\Android\android-sdk\system-images\android-28\android-wear\x86\package.xml. Probably the SDK is read-only
    Exception while marshalling C:\Program Files (x86)\Android\android-sdk\system-images\android-28\default\x86\package.xml. Probably the SDK is read-only
    Exception while marshalling C:\Program Files (x86)\Android\android-sdk\system-images\android-28\default\x86_64\package.xml. Probably the SDK is read-only
    Exception while marshalling C:\Program Files (x86)\Android\android-sdk\system-images\android-28\google_apis\x86\package.xml. Probably the SDK is read-only
    Exception while marshalling C:\Program Files (x86)\Android\android-sdk\system-images\android-28\google_apis\x86_64\package.xml. Probably the SDK is read-only
    Exception while marshalling C:\Program Files (x86)\Android\android-sdk\system-images\android-28\google_apis_playstore\x86\package.xml. Probably the SDK is read-only
    Exception while marshalling C:\Program Files (x86)\Android\android-sdk\system-images\android-28\google_apis_playstore\x86_64\package.xml. Probably the SDK is read-only
    Exception while marshalling C:\Program Files (x86)\Android\android-sdk\tools\package.xml. Probably the SDK is read-only
    
    > Task :app:preBuild UP-TO-DATE
    > Task :app:preReleaseBuild
    > Task :app:compileReleaseAidl
    > Task :app:compileReleaseRenderscript NO-SOURCE
    > Task :app:checkReleaseManifest
    > Task :app:generateReleaseBuildConfig
    > Task :app:prepareLintJar
    > Task :app:generateReleaseSources
    > Task :app:javaPreCompileRelease
    > Task :app:mainApkListPersistenceRelease
    > Task :app:generateReleaseResValues
    > Task :app:generateReleaseResources
    > Task :app:mergeReleaseResources FAILED
    
    FAILURE: Build failed with an exception.
    
    * What went wrong:
    Execution failed for task ':app:mergeReleaseResources'.
    > 8 exceptions were raised by workers:
      com.android.builder.internal.aapt.v2.Aapt2InternalException: AAPT2 aapt2-3.4.1-5326820-windows Daemon #0: Daemon startup failed
      This should not happen under normal circumstances, please file an issue if it does.
      com.android.builder.internal.aapt.v2.Aapt2InternalException: AAPT2 aapt2-3.4.1-5326820-windows Daemon #1: Daemon startup failed
      This should not happen under normal circumstances, please file an issue if it does.
      com.android.builder.internal.aapt.v2.Aapt2InternalException: AAPT2 aapt2-3.4.1-5326820-windows Daemon #2: Daemon startup failed
      This should not happen under normal circumstances, please file an issue if it does.
      com.android.builder.internal.aapt.v2.Aapt2InternalException: AAPT2 aapt2-3.4.1-5326820-windows Daemon #3: Daemon startup failed
      This should not happen under normal circumstances, please file an issue if it does.
      com.android.builder.internal.aapt.v2.Aapt2InternalException: AAPT2 aapt2-3.4.1-5326820-windows Daemon #4: Daemon startup failed
      This should not happen under normal circumstances, please file an issue if it does.
      com.android.builder.internal.aapt.v2.Aapt2InternalException: AAPT2 aapt2-3.4.1-5326820-windows Daemon #5: Daemon startup failed
      This should not happen under normal circumstances, please file an issue if it does.
      com.android.builder.internal.aapt.v2.Aapt2InternalException: AAPT2 aapt2-3.4.1-5326820-windows Daemon #6: Daemon startup failed
      This should not happen under normal circumstances, please file an issue if it does.
      com.android.builder.internal.aapt.v2.Aapt2InternalException: AAPT2 aapt2-3.4.1-5326820-windows Daemon #7: Daemon startup failed
      This should not happen under normal circumstances, please file an issue if it does.
    
    
    * Try:
    Run with --stacktrace option to get the stack trace. Run with --info or --debug option to get more log output. Run with --scan to get full insights.
    
    * Get more help at https://help.gradle.org
    
    BUILD FAILED in 3s
    9 actionable tasks: 9 executed

  6. #16
    Clicker Fusion 2.5 DeveloperAndroid Export ModuleiOS Export Module

    Join Date
    Jun 2006
    Posts
    168
    Mentioned
    1 Post(s)
    Tagged
    0 Thread(s)
    I tried to use the following fix:

    Quote Originally Posted by Yves View Post
    Not sure why this happens to you and not others, but apparently there is a temporary workaround that should fix the issue until Google release a fixed version, it's described here:

    https://stackoverflow.com/questions/...15423#54615423

    Make a backup copy of RuntimeAndroid.zip (just in case), open RuntimeAndroid.zip, extract build.gradle, edit it and add this:

    Code:
    allprojects {
        // Workaround for https://issuetracker.google.com/117900475
        // Remove when upgrading to AGP 3.4 or higher.
        configurations.matching { it.name == '_internal_aapt2_binary' }.all { config ->
            config.resolutionStrategy.eachDependency { details ->
                details.useVersion("3.5.0-alpha03-5252756")
            }
        }
    }
    And then replace it in RuntimeAndroid.zip. Hopefully it works...
    But still, the error log is:

    Code:
     
    > Configure project :app
    Exception while marshalling C:\Program Files (x86)\Android\android-sdk\add-ons\addon-google_apis-google-22\package.xml. Probably the SDK is read-only
    Exception while marshalling C:\Program Files (x86)\Android\android-sdk\build-tools\22.0.1\package.xml. Probably the SDK is read-only
    Exception while marshalling C:\Program Files (x86)\Android\android-sdk\build-tools\28.0.3\package.xml. Probably the SDK is read-only
    Exception while marshalling C:\Program Files (x86)\Android\android-sdk\build-tools\29.0.1\package.xml. Probably the SDK is read-only
    Exception while marshalling C:\Program Files (x86)\Android\android-sdk\extras\android\m2repository\package.xml. Probably the SDK is read-only
    Exception while marshalling C:\Program Files (x86)\Android\android-sdk\extras\google\auto\package.xml. Probably the SDK is read-only
    Exception while marshalling C:\Program Files (x86)\Android\android-sdk\extras\google\google_play_services\package.xml. Probably the SDK is read-only
    Exception while marshalling C:\Program Files (x86)\Android\android-sdk\extras\google\instantapps\package.xml. Probably the SDK is read-only
    Exception while marshalling C:\Program Files (x86)\Android\android-sdk\extras\google\m2repository\package.xml. Probably the SDK is read-only
    Exception while marshalling C:\Program Files (x86)\Android\android-sdk\extras\google\market_apk_expansion\package.xml. Probably the SDK is read-only
    Exception while marshalling C:\Program Files (x86)\Android\android-sdk\extras\google\market_licensing\package.xml. Probably the SDK is read-only
    Exception while marshalling C:\Program Files (x86)\Android\android-sdk\extras\google\simulators\package.xml. Probably the SDK is read-only
    Exception while marshalling C:\Program Files (x86)\Android\android-sdk\extras\google\usb_driver\package.xml. Probably the SDK is read-only
    Exception while marshalling C:\Program Files (x86)\Android\android-sdk\extras\google\webdriver\package.xml. Probably the SDK is read-only
    Exception while marshalling C:\Program Files (x86)\Android\android-sdk\platform-tools\package.xml. Probably the SDK is read-only
    Exception while marshalling C:\Program Files (x86)\Android\android-sdk\platforms\android-14\package.xml. Probably the SDK is read-only
    Exception while marshalling C:\Program Files (x86)\Android\android-sdk\platforms\android-22\package.xml. Probably the SDK is read-only
    Exception while marshalling C:\Program Files (x86)\Android\android-sdk\platforms\android-28\package.xml. Probably the SDK is read-only
    Exception while marshalling C:\Program Files (x86)\Android\android-sdk\platforms\android-29\package.xml. Probably the SDK is read-only
    Exception while marshalling C:\Program Files (x86)\Android\android-sdk\sources\android-22\package.xml. Probably the SDK is read-only
    Exception while marshalling C:\Program Files (x86)\Android\android-sdk\sources\android-28\package.xml. Probably the SDK is read-only
    Exception while marshalling C:\Program Files (x86)\Android\android-sdk\system-images\android-14\default\armeabi-v7a\package.xml. Probably the SDK is read-only
    Exception while marshalling C:\Program Files (x86)\Android\android-sdk\system-images\android-22\android-tv\x86\package.xml. Probably the SDK is read-only
    Exception while marshalling C:\Program Files (x86)\Android\android-sdk\system-images\android-22\default\armeabi-v7a\package.xml. Probably the SDK is read-only
    Exception while marshalling C:\Program Files (x86)\Android\android-sdk\system-images\android-22\default\x86\package.xml. Probably the SDK is read-only
    Exception while marshalling C:\Program Files (x86)\Android\android-sdk\system-images\android-22\default\x86_64\package.xml. Probably the SDK is read-only
    Exception while marshalling C:\Program Files (x86)\Android\android-sdk\system-images\android-22\google_apis\armeabi-v7a\package.xml. Probably the SDK is read-only
    Exception while marshalling C:\Program Files (x86)\Android\android-sdk\system-images\android-22\google_apis\x86\package.xml. Probably the SDK is read-only
    Exception while marshalling C:\Program Files (x86)\Android\android-sdk\system-images\android-22\google_apis\x86_64\package.xml. Probably the SDK is read-only
    Exception while marshalling C:\Program Files (x86)\Android\android-sdk\system-images\android-28\android-wear\x86\package.xml. Probably the SDK is read-only
    Exception while marshalling C:\Program Files (x86)\Android\android-sdk\system-images\android-28\default\x86\package.xml. Probably the SDK is read-only
    Exception while marshalling C:\Program Files (x86)\Android\android-sdk\system-images\android-28\default\x86_64\package.xml. Probably the SDK is read-only
    Exception while marshalling C:\Program Files (x86)\Android\android-sdk\system-images\android-28\google_apis\x86\package.xml. Probably the SDK is read-only
    Exception while marshalling C:\Program Files (x86)\Android\android-sdk\system-images\android-28\google_apis\x86_64\package.xml. Probably the SDK is read-only
    Exception while marshalling C:\Program Files (x86)\Android\android-sdk\system-images\android-28\google_apis_playstore\x86\package.xml. Probably the SDK is read-only
    Exception while marshalling C:\Program Files (x86)\Android\android-sdk\system-images\android-28\google_apis_playstore\x86_64\package.xml. Probably the SDK is read-only
    Exception while marshalling C:\Program Files (x86)\Android\android-sdk\tools\package.xml. Probably the SDK is read-only
    
    > Task :app:preBuild UP-TO-DATE
    > Task :app:preReleaseBuild
    > Task :app:compileReleaseAidl
    > Task :app:compileReleaseRenderscript NO-SOURCE
    > Task :app:checkReleaseManifest
    > Task :app:generateReleaseBuildConfig
    > Task :app:prepareLintJar
    > Task :app:generateReleaseSources
    > Task :app:javaPreCompileRelease
    > Task :app:mainApkListPersistenceRelease
    > Task :app:generateReleaseResValues
    > Task :app:generateReleaseResources
    > Task :app:mergeReleaseResources FAILED
    
    FAILURE: Build failed with an exception.
    
    * What went wrong:
    Execution failed for task ':app:mergeReleaseResources'.
    > 8 exceptions were raised by workers:
      com.android.builder.internal.aapt.v2.Aapt2InternalException: AAPT2 aapt2-3.5.0-alpha03-5252756-windows Daemon #0: Daemon startup failed
      This should not happen under normal circumstances, please file an issue if it does.
      com.android.builder.internal.aapt.v2.Aapt2InternalException: AAPT2 aapt2-3.5.0-alpha03-5252756-windows Daemon #1: Daemon startup failed
      This should not happen under normal circumstances, please file an issue if it does.
      com.android.builder.internal.aapt.v2.Aapt2InternalException: AAPT2 aapt2-3.5.0-alpha03-5252756-windows Daemon #2: Daemon startup failed
      This should not happen under normal circumstances, please file an issue if it does.
      com.android.builder.internal.aapt.v2.Aapt2InternalException: AAPT2 aapt2-3.5.0-alpha03-5252756-windows Daemon #3: Daemon startup failed
      This should not happen under normal circumstances, please file an issue if it does.
      com.android.builder.internal.aapt.v2.Aapt2InternalException: AAPT2 aapt2-3.5.0-alpha03-5252756-windows Daemon #4: Daemon startup failed
      This should not happen under normal circumstances, please file an issue if it does.
      com.android.builder.internal.aapt.v2.Aapt2InternalException: AAPT2 aapt2-3.5.0-alpha03-5252756-windows Daemon #5: Daemon startup failed
      This should not happen under normal circumstances, please file an issue if it does.
      com.android.builder.internal.aapt.v2.Aapt2InternalException: AAPT2 aapt2-3.5.0-alpha03-5252756-windows Daemon #6: Daemon startup failed
      This should not happen under normal circumstances, please file an issue if it does.
      com.android.builder.internal.aapt.v2.Aapt2InternalException: AAPT2 aapt2-3.5.0-alpha03-5252756-windows Daemon #7: Daemon startup failed
      This should not happen under normal circumstances, please file an issue if it does.
    
    
    * Try:
    Run with --stacktrace option to get the stack trace. Run with --info or --debug option to get more log output. Run with --scan to get full insights.
    
    * Get more help at https://help.gradle.org
    
    BUILD FAILED in 4s
    9 actionable tasks: 9 executed

  7. #17
    Clickteam Clickteam
    Fernando's Avatar
    Join Date
    Dec 2006
    Posts
    6,039
    Mentioned
    130 Post(s)
    Tagged
    3 Thread(s)
    mm thing to check

    Exception while marshalling C:\Program Files (x86)\Android\android-sdk\add-ons\addon-google_apis-google-22\package.xml. Probably the SDK is read-only
    Exception while marshalling C:\Program Files (x86)\Android\android-sdk\build-tools\22.0.1\package.xml. Probably the SDK is read-only
    Exception while marshalling C:\Program Files (x86)\Android\android-sdk\build-tools\28.0.3\package.xml. Probably the SDK is read-only
    Exception while marshalling C:\Program Files (x86)\Android\android-sdk\build-tools\29.0.1\package.xml. Probably the SDK is read-only
    Exception while marshalling C:\Program Files (x86)\Android\android-sdk\extras\android\m2repository\package.xml. Probably the SDK is read-only

    can you check if you have privileges are like this




    are you building with api 28?


    may I suggest remove the 29.0.1 builds tools
    Regards,


    Fernando Vivolo

    ... new things are coming ...

  8. #18
    Clicker Fusion 2.5 (Steam)Fusion 2.5 Developer (Steam)Android Export Module (Steam)iOS Export Module (Steam)

    Join Date
    May 2014
    Posts
    190
    Mentioned
    6 Post(s)
    Tagged
    0 Thread(s)
    @Snakesoft Unfortunately, your error with the daemon startup failed seems very similar to mine. It's almost certainly tied to the operating system and not to your project or configurations, because I just installed a new Windows on a new PC, did the exact same things and now it works. (This is a Google bug, and it looks like Google are in no hurry to fix it)

    If you want to keep using the same operating system, you can go inside the RuntimeAndroid.zip file, open the build.gradle file and modify the 3.4.2 value of the gradle version to 3.3.2. Then try building again and normally it should work.
    @Yves On the new PC, I took the CalcRect object from the extension manager and it works properly now. No more need for me to copy it from an older version of Clickteam.

  9. #19
    Clicker Fusion 2.5 DeveloperAndroid Export ModuleiOS Export Module

    Join Date
    Jun 2006
    Posts
    168
    Mentioned
    1 Post(s)
    Tagged
    0 Thread(s)
    Quote Originally Posted by Nemeean_lion View Post
    @Snakesoft Unfortunately, your error with the daemon startup failed seems very similar to mine. It's almost certainly tied to the operating system and not to your project or configurations
    Yup, same here!

  10. #20
    Clicker Fusion 2.5 DeveloperAndroid Export ModuleiOS Export Module

    Join Date
    Jun 2006
    Posts
    168
    Mentioned
    1 Post(s)
    Tagged
    0 Thread(s)
    Quote Originally Posted by Fernando View Post
    mm thing to check

    Exception while marshalling C:\Program Files (x86)\Android\android-sdk\add-ons\addon-google_apis-google-22\package.xml. Probably the SDK is read-only
    Exception while marshalling C:\Program Files (x86)\Android\android-sdk\build-tools\22.0.1\package.xml. Probably the SDK is read-only
    Exception while marshalling C:\Program Files (x86)\Android\android-sdk\build-tools\28.0.3\package.xml. Probably the SDK is read-only
    Exception while marshalling C:\Program Files (x86)\Android\android-sdk\build-tools\29.0.1\package.xml. Probably the SDK is read-only
    Exception while marshalling C:\Program Files (x86)\Android\android-sdk\extras\android\m2repository\package.xml. Probably the SDK is read-only

    can you check if you have privileges are like this




    are you building with api 28?


    may I suggest remove the 29.0.1 builds tools
    Yes, I'm building with api 28.

    And there were indeed some privileges problems, due to Windows 7, which I solved changing the SDK folder - as described here:
    https://stackoverflow.com/questions/...n7-is-readonly

Page 2 of 3 FirstFirst 1 2 3 LastLast

Similar Threads

  1. HTML5 (Limited version), and paid version differences?
    By N64Mario in forum HTML5 Export Module 2.5
    Replies: 1
    Last Post: 19th July 2018, 08:00 AM
  2. Html5 in free version, but not developer full version?
    By AshraldRails in forum HTML5 Export Module 2.5
    Replies: 6
    Last Post: 15th May 2015, 07:35 AM
  3. Build API, Minimum Android Version, Target Android Version?
    By KLiK-iT in forum Android Export Module 2.5
    Replies: 4
    Last Post: 9th July 2014, 12:50 PM
  4. Crazy MotorBike ( Version Lite + Version Intégrale )
    By nuagedan100 in forum Android Released Games & Apps
    Replies: 0
    Last Post: 4th February 2014, 02:04 PM
  5. beta version mmf2fev for mmf2dev download version.
    By Duncki in forum Multimedia Fusion 2 - Technical Support
    Replies: 3
    Last Post: 9th December 2010, 12:40 PM

Posting Permissions

  • You may not post new threads
  • You may not post replies
  • You may not post attachments
  • You may not edit your posts
  •