User Tag List

Results 1 to 4 of 4

Thread: Location object build error

  1. #1
    Clicker Fusion 2.5Android Export ModuleiOS Export Module

    Join Date
    Jun 2015
    Posts
    71
    Mentioned
    1 Post(s)
    Tagged
    0 Thread(s)

    Location object build error

    Hi all. I was attempting to make a minor update to one of my apps but received an error on compile. I've traced the problem to the Location Object, which was working perfectly for me before. I tried running updates and reinserting the object but no difference. I do not get the same error on the Apple version, only on the Android version.

    > Task :app:preBuild UP-TO-DATE
    > Task :app:preReleaseBuild
    > Task :app:compileReleaseAidl
    > Task :app:compileReleaseRenderscript NO-SOURCE
    > Task :app:checkReleaseManifest
    > Task :app:generateReleaseBuildConfig
    > Task :app:prepareLintJar
    > Task :app:generateReleaseSources
    > Task :app:javaPreCompileRelease
    > Task :app:mainApkListPersistenceRelease
    > Task :app:generateReleaseResValues
    > Task :app:generateReleaseResources
    > Task :app:mergeReleaseResources
    > Task :app:createReleaseCompatibleScreenManifests
    > Task :app:processReleaseManifest
    > Task :app:processReleaseResources

    > Task :app:compileReleaseJavaWithJavac
    C:\Users\Home\AppData\Local\Temp\AndD046.tmp\app\s rc\main\java\Extensions\CRunLocation.java:266: error: incompatible types: missing return value
    if(providers == null) return;
    ^
    Note: Some input files use or override a deprecated API.
    Note: Recompile with -Xlint:deprecation for details.
    Note: Some input files use unchecked or unsafe operations.
    Note: Recompile with -Xlint:unchecked for details.
    1 error

    > Task :app:compileReleaseJavaWithJavac FAILED

    FAILURE: Build failed with an exception.

    * What went wrong:
    Execution failed for task ':app:compileReleaseJavaWithJavac'.
    > Compilation failed; see the compiler error output for details.

    * Try:
    Run with --stacktrace option to get the stack trace. Run with --info or --debug option to get more log output. Run with --scan to get full insights.

    * Get more help at https://help.gradle.org

    Deprecated Gradle features were used in this build, making it incompatible with Gradle 6.0.
    Use '--warning-mode all' to show the individual deprecation warnings.
    See https://docs.gradle.org/5.1.1/usergu..._line_warnings

    BUILD FAILED in 15s
    13 actionable tasks: 13 executed

  2. #2
    Clicker Fusion 2.5 (Steam)Fusion 2.5 Developer (Steam)Fusion 2.5+ DLC (Steam)Android Export Module (Steam)HTML5 Export Module (Steam)iOS Export Module (Steam)Universal Windows Platform Export Module (Steam)

    Join Date
    May 2017
    Location
    France
    Posts
    60
    Mentioned
    1 Post(s)
    Tagged
    0 Thread(s)
    Hi,

    I had the same problem, Fernando fixed the extension. I don't know when the fix will be pushed.

  3. #3
    Clicker Fusion 2.5Android Export ModuleiOS Export Module

    Join Date
    Jun 2015
    Posts
    71
    Mentioned
    1 Post(s)
    Tagged
    0 Thread(s)
    Quote Originally Posted by haoujey View Post
    Hi,

    I had the same problem, Fernando fixed the extension. I don't know when the fix will be pushed.
    Thanks for the info. Hope they can get it out soon, my app has a feature that relies on the function.

  4. #4
    Clickteam Clickteam
    Fernando's Avatar
    Join Date
    Dec 2006
    Posts
    6,037
    Mentioned
    130 Post(s)
    Tagged
    3 Thread(s)
    mm? did you receive my PM with latest object, sent yesterday?
    Regards,


    Fernando Vivolo

    ... new things are coming ...

Similar Threads

  1. Android App Requests Location even when I dont use any location function.
    By AlanRuno in forum Android Export Module 2.5
    Replies: 2
    Last Post: 5th April 2019, 02:34 AM
  2. Android/iOS InputType object build error!!
    By Bipolar_Games in forum Android Export Module Version 2.0
    Replies: 2
    Last Post: 25th September 2013, 02:16 AM
  3. Location Object Error on start
    By Dave78 in forum Multimedia Fusion 2 - Technical Support
    Replies: 0
    Last Post: 24th September 2013, 11:06 AM
  4. Cannot build application, ForEach Object error please help!
    By edman3d in forum Multimedia Fusion 2 - Technical Support
    Replies: 1
    Last Post: 21st August 2013, 12:25 AM
  5. [Build Error] Problems with Android Dialogs Object
    By Arnax in forum Android Export Module Version 2.0
    Replies: 3
    Last Post: 21st December 2011, 04:43 AM

Posting Permissions

  • You may not post new threads
  • You may not post replies
  • You may not post attachments
  • You may not edit your posts
  •