User Tag List

Results 1 to 5 of 5

Thread: APK build process fails (processDebugResources?)

  1. #1
    Clicker Fusion 2.5 (Steam)Fusion 2.5 Developer (Steam)Android Export Module (Steam)

    Join Date
    Jun 2015
    Posts
    6
    Mentioned
    0 Post(s)
    Tagged
    0 Thread(s)

    APK build process fails (processDebugResources?)

    Hello,
    ever since the most recent Clickteam Fusion 2.5 update, my Android project won't build any more.
    I get the following error log:


    > Configure project :
    it is windows 10

    > Configure project :app
    WARNING: The option setting 'android.overridePathCheck=true' is experimental and unsupported.
    The current default is 'false'.


    > Task :app:preBuild UP-TO-DATE
    > Task :app:preDebugBuild
    > Task :app:compileDebugAidl NO-SOURCE
    > Task :app:compileDebugRenderscript NO-SOURCE
    > Task :app:checkDebugManifest
    > Task :app:generateDebugBuildConfig
    > Task :app:prepareLintJar
    > Task :app:generateDebugSources
    > Task :app:javaPreCompileDebug
    > Task :app:mainApkListPersistenceDebug
    > Task :app:generateDebugResValues
    > Task :app:generateDebugResources
    > Task :app:mergeDebugResources
    > Task :app:createDebugCompatibleScreenManifests
    > Task :app:processDebugManifest
    > Task :app:processDebugResources FAILED

    FAILURE: Build failed with an exception.

    * What went wrong:
    Execution failed for task ':app:processDebugResources'.
    > Android resource linking failed
    error: resource android:style/TextAppearance.Material.Widget.Button.Borderless.C olored not found.
    error: resource android:style/TextAppearance.Material.Widget.Button.Colored not found.
    C:\Users\lindn\.gradle\caches\transforms-2\files-2.1\8ddae6bf8d8785b7cf4718bec2db2411\res\values-v26\values-v26.xml:9:5-12:13: AAPT: error: resource android:attr/colorError not found.

    C:\Users\lindn\.gradle\caches\transforms-2\files-2.1\8ddae6bf8d8785b7cf4718bec2db2411\res\values-v26\values-v26.xml:13:5-16:13: AAPT: error: resource android:attr/colorError not found.

    C:\Users\lindn\.gradle\caches\transforms-2\files-2.1\8ddae6bf8d8785b7cf4718bec2db2411\res\values-v26\values-v26.xml:17:5-93: AAPT: error: style attribute 'android:attr/keyboardNavigationCluster' not found.

    C:\Users\lindn\.gradle\caches\transforms-2\files-2.1\8ddae6bf8d8785b7cf4718bec2db2411\res\values\va lues.xml:147:5-152:84: AAPT: error: resource android:attr/fontStyle not found.

    C:\Users\lindn\.gradle\caches\transforms-2\files-2.1\8ddae6bf8d8785b7cf4718bec2db2411\res\values\va lues.xml:147:5-152:84: AAPT: error: resource android:attr/font not found.

    C:\Users\lindn\.gradle\caches\transforms-2\files-2.1\8ddae6bf8d8785b7cf4718bec2db2411\res\values\va lues.xml:147:5-152:84: AAPT: error: resource android:attr/fontWeight not found.

    error: failed linking references.



    It worked fine when I last built it a week ago.
    The only extension I'm running is the String Parser, which also used to work well before.

    I hope you can help.

    Regards,

    Andreas

  2. #2
    Clickteam Clickteam
    Fernando's Avatar
    Join Date
    Dec 2006
    Posts
    6,147
    Mentioned
    158 Post(s)
    Tagged
    3 Thread(s)
    what api are you using in this test

    please post Min, target and build api
    Regards,


    Fernando Vivolo

    ... new things are coming ...

  3. #3
    Clicker Fusion 2.5 (Steam)Fusion 2.5 Developer (Steam)Android Export Module (Steam)

    Join Date
    Jun 2015
    Posts
    6
    Mentioned
    0 Post(s)
    Tagged
    0 Thread(s)
    Hi Fernando,

    thank you for the fast reply!

    My Build API is 23,

    Minimum Android Version is 6.0,

    Target Android Version is 9.0.

  4. #4
    Clickteam Clickteam
    Fernando's Avatar
    Join Date
    Dec 2006
    Posts
    6,147
    Mentioned
    158 Post(s)
    Tagged
    3 Thread(s)
    your build api is way too low min accepted is 26 recommended is 28
    Regards,


    Fernando Vivolo

    ... new things are coming ...

  5. #5
    Clicker Fusion 2.5 (Steam)Fusion 2.5 Developer (Steam)Android Export Module (Steam)

    Join Date
    Jun 2015
    Posts
    6
    Mentioned
    0 Post(s)
    Tagged
    0 Thread(s)
    That did it.

    Thank you so much!!

Similar Threads

  1. Installed everything for the exporter, build still fails.
    By JoshMakesGames in forum Android Export Module 2.5
    Replies: 10
    Last Post: 20th February 2019, 08:31 PM
  2. Build fails no matter what.
    By MasochisticGamer in forum Android Export Module 2.5
    Replies: 2
    Last Post: 20th June 2017, 07:17 PM
  3. Build process fails with error message 'cannot build blah.mfa
    By Jusfury in forum Android Export Module 2.5
    Replies: 7
    Last Post: 22nd May 2015, 08:16 PM
  4. Build process fails with error message 'Invalid keystore format'
    By Anton in forum Android Export Module 2.5
    Replies: 7
    Last Post: 4th February 2015, 11:58 PM
  5. [BUG] Fails to build if...
    By happygreenfrog in forum Android Export Module Version 2.0
    Replies: 4
    Last Post: 9th February 2012, 10:18 PM

Posting Permissions

  • You may not post new threads
  • You may not post replies
  • You may not post attachments
  • You may not edit your posts
  •