User Tag List

Results 1 to 3 of 3

Thread: Build failed with an exception.

  1. #1
    Clicker Fusion 2.5 (Steam)Fusion 2.5+ DLC (Steam)Android Export Module (Steam)HTML5 Export Module (Steam)Universal Windows Platform Export Module (Steam)
    VoyVivika's Avatar
    Join Date
    Jul 2015
    Posts
    13
    Mentioned
    1 Post(s)
    Tagged
    0 Thread(s)

    Build failed with an exception.

    I don't quite understand what's going on with the exporter, I've tried switching the version and the API but nothing seems to have worked.
    I used API 23 with Android 6.0 as both the targeted and minimum and used Android Studio 3.5.1 (I had APIs 29, 23 and 19 installed)

    This is the log

    Edit: Switched over to JDK 8 and I have an entirely different log



    The Log:


    Starting a Gradle Daemon, 1 incompatible Daemon could not be reused, use --status for details

    > Configure project :
    it is windows 10

    > Configure project :app
    WARNING: The option setting 'android.overridePathCheck=true' is experimental and unsupported.
    The current default is 'false'.

    File C:\Users\odonl\.android\repositories.cfg could not be loaded.
    Checking the license for package Android SDK Build-Tools 28.0.3 in C:\Users\odonl\AppData\Local\Android\Sdk\licenses
    License for package Android SDK Build-Tools 28.0.3 accepted.
    Preparing "Install Android SDK Build-Tools 28.0.3 (revision: 28.0.3)".
    "Install Android SDK Build-Tools 28.0.3 (revision: 28.0.3)" ready.
    Installing Android SDK Build-Tools 28.0.3 in C:\Users\odonl\AppData\Local\Android\Sdk\build-tools\28.0.3
    "Install Android SDK Build-Tools 28.0.3 (revision: 28.0.3)" complete.
    "Install Android SDK Build-Tools 28.0.3 (revision: 28.0.3)" finished.

    > Task :app:preBuild UP-TO-DATE
    > Task :app:preDebugBuild
    > Task :app:compileDebugAidl NO-SOURCE
    > Task :app:compileDebugRenderscript NO-SOURCE
    > Task :app:checkDebugManifest
    > Task :app:generateDebugBuildConfig
    > Task :app:prepareLintJar
    > Task :app:generateDebugSources
    > Task :app:javaPreCompileDebug
    > Task :app:mainApkListPersistenceDebug
    > Task :app:generateDebugResValues
    > Task :app:generateDebugResources
    > Task :app:mergeDebugResources
    > Task :app:createDebugCompatibleScreenManifests
    > Task :app:processDebugManifest
    > Task :app:processDebugResources FAILED

    FAILURE: Build failed with an exception.

    * What went wrong:
    Execution failed for task ':app:processDebugResources'.
    > Android resource linking failed
    error: resource android:style/TextAppearance.Material.Widget.Button.Borderless.C olored not found.
    error: resource android:style/TextAppearance.Material.Widget.Button.Colored not found.
    C:\Users\odonl\.gradle\caches\transforms-2\files-2.1\0c8bd42ee3e9351ba4affb9f398f81a2\res\values-v26\values-v26.xml:9:5-12:13: AAPT: error: resource android:attr/colorError not found.

    C:\Users\odonl\.gradle\caches\transforms-2\files-2.1\0c8bd42ee3e9351ba4affb9f398f81a2\res\values-v26\values-v26.xml:13:5-16:13: AAPT: error: resource android:attr/colorError not found.

    C:\Users\odonl\.gradle\caches\transforms-2\files-2.1\0c8bd42ee3e9351ba4affb9f398f81a2\res\values-v26\values-v26.xml:17:5-93: AAPT: error: style attribute 'android:attr/keyboardNavigationCluster' not found.

    C:\Users\odonl\.gradle\caches\transforms-2\files-2.1\0c8bd42ee3e9351ba4affb9f398f81a2\res\values\va lues.xml:147:5-152:84: AAPT: error: resource android:attr/fontStyle not found.

    C:\Users\odonl\.gradle\caches\transforms-2\files-2.1\0c8bd42ee3e9351ba4affb9f398f81a2\res\values\va lues.xml:147:5-152:84: AAPT: error: resource android:attr/font not found.

    C:\Users\odonl\.gradle\caches\transforms-2\files-2.1\0c8bd42ee3e9351ba4affb9f398f81a2\res\values\va lues.xml:147:5-152:84: AAPT: error: resource android:attr/fontWeight not found.

    error: failed linking references.

    * Try:
    Run with --stacktrace option to get the stack trace. Run with --info or --debug option to get more log output. Run with --scan to get full insights.

    * Get more help at https://help.gradle.org

    Deprecated Gradle features were used in this build, making it incompatible with Gradle 6.0.
    Use '--warning-mode all' to show the individual deprecation warnings.
    See https://docs.gradle.org/5.1.1/usergu..._line_warnings

    BUILD FAILED in 1m 2s
    11 actionable tasks: 11 executed

  2. #2
    Clickteam Clickteam

    Join Date
    Jun 2006
    Location
    France
    Posts
    13,073
    Mentioned
    119 Post(s)
    Tagged
    2 Thread(s)
    What's the Build API in your Android properties? It should be at least 26 with the newest Android SDK's.

  3. #3
    Clicker Fusion 2.5 DeveloperAndroid Export Module
    Janette5's Avatar
    Join Date
    Dec 2014
    Location
    Western Cape, SA
    Posts
    479
    Mentioned
    18 Post(s)
    Tagged
    0 Thread(s)
    The build api should be at least 28. Google will accept 27 until 1 November when they'll only accept 28.

    Minimum version for Fusion is 4.0 and Target Android Version 8.1 or 9.0 (We can't go higher, because Fusion won't allow us.)

Similar Threads

  1. Audio analysis extension - paid request
    By Fanotherpg in forum Paid Design & Development Requests
    Replies: 0
    Last Post: 17th February 2015, 02:35 AM
  2. error: statically allocated instance of Objective-C class 'BoidType" at build
    By MTCMusic in forum iOS Export Module Version 2.0
    Replies: 7
    Last Post: 27th February 2013, 12:03 PM
  3. DOM Website Analysis
    By Psy in forum Multimedia Fusion 2 - Technical Support
    Replies: 0
    Last Post: 28th May 2010, 08:24 AM

Posting Permissions

  • You may not post new threads
  • You may not post replies
  • You may not post attachments
  • You may not edit your posts
  •