User Tag List

Results 1 to 10 of 10

Thread: I can't compil my app to apk file for google play "mode publication"

  1. #1
    Clicker Fusion 2.5 DeveloperAndroid Export ModuleSWF Export Module

    Join Date
    Mar 2007
    Location
    Carthage - TUNISIE
    Posts
    258
    Mentioned
    0 Post(s)
    Tagged
    0 Thread(s)

    Question I can't compil my app to apk file for google play "mode publication"

    With mode publication I can't compil my application to apk file, and i recieve this text with other long txts
    --------------
    > Configure project :
    it is windows 10

    > Configure project :app
    WARNING: The option setting 'android.overridePathCheck=true' is experimental and unsupported.
    The current default is 'false'.

    -----
    kow can i correct the warning

    Thank you

  2. #2
    Clickteam Clickteam

    Join Date
    Jun 2006
    Location
    France
    Posts
    13,199
    Mentioned
    141 Post(s)
    Tagged
    2 Thread(s)
    This warning is a ... warning, it's not a fatal error, the error is in the "other long texts". Could you post the entire log?

  3. #3
    Clicker Fusion 2.5 DeveloperAndroid Export ModuleSWF Export Module

    Join Date
    Mar 2007
    Location
    Carthage - TUNISIE
    Posts
    258
    Mentioned
    0 Post(s)
    Tagged
    0 Thread(s)
    Thank you Yves... This is the all txt repport
    --------
    > Configure project :
    it is windows 10

    > Configure project :app
    WARNING: The option setting 'android.overridePathCheck=true' is experimental and unsupported.
    The current default is 'false'.

    Exception while marshalling C:\Program Files (x86)\Clickteam Fusion Developer 2.5\build-tools\19.1.0\package.xml. Probably the SDK is read-only
    Exception while marshalling C:\Program Files (x86)\Clickteam Fusion Developer 2.5\build-tools\20.0.0\package.xml. Probably the SDK is read-only
    Exception while marshalling C:\Program Files (x86)\Clickteam Fusion Developer 2.5\build-tools\21.1.2\package.xml. Probably the SDK is read-only
    Exception while marshalling C:\Program Files (x86)\Clickteam Fusion Developer 2.5\build-tools\22.0.1\package.xml. Probably the SDK is read-only
    Exception while marshalling C:\Program Files (x86)\Clickteam Fusion Developer 2.5\build-tools\23.0.1\package.xml. Probably the SDK is read-only
    Exception while marshalling C:\Program Files (x86)\Clickteam Fusion Developer 2.5\build-tools\23.0.2\package.xml. Probably the SDK is read-only
    Exception while marshalling C:\Program Files (x86)\Clickteam Fusion Developer 2.5\build-tools\23.0.3\package.xml. Probably the SDK is read-only
    Exception while marshalling C:\Program Files (x86)\Clickteam Fusion Developer 2.5\build-tools\24.0.0\package.xml. Probably the SDK is read-only
    Exception while marshalling C:\Program Files (x86)\Clickteam Fusion Developer 2.5\build-tools\24.0.1\package.xml. Probably the SDK is read-only
    Exception while marshalling C:\Program Files (x86)\Clickteam Fusion Developer 2.5\build-tools\24.0.2\package.xml. Probably the SDK is read-only
    Exception while marshalling C:\Program Files (x86)\Clickteam Fusion Developer 2.5\build-tools\24.0.3\package.xml. Probably the SDK is read-only
    Exception while marshalling C:\Program Files (x86)\Clickteam Fusion Developer 2.5\build-tools\25.0.0\package.xml. Probably the SDK is read-only
    Exception while marshalling C:\Program Files (x86)\Clickteam Fusion Developer 2.5\build-tools\25.0.1\package.xml. Probably the SDK is read-only
    Exception while marshalling C:\Program Files (x86)\Clickteam Fusion Developer 2.5\build-tools\25.0.2\package.xml. Probably the SDK is read-only
    Exception while marshalling C:\Program Files (x86)\Clickteam Fusion Developer 2.5\build-tools\25.0.3\package.xml. Probably the SDK is read-only
    Exception while marshalling C:\Program Files (x86)\Clickteam Fusion Developer 2.5\build-tools\26.0.0\package.xml. Probably the SDK is read-only
    Exception while marshalling C:\Program Files (x86)\Clickteam Fusion Developer 2.5\build-tools\26.0.1\package.xml. Probably the SDK is read-only
    Exception while marshalling C:\Program Files (x86)\Clickteam Fusion Developer 2.5\build-tools\26.0.2\package.xml. Probably the SDK is read-only
    Exception while marshalling C:\Program Files (x86)\Clickteam Fusion Developer 2.5\build-tools\26.0.3\package.xml. Probably the SDK is read-only
    Exception while marshalling C:\Program Files (x86)\Clickteam Fusion Developer 2.5\build-tools\27.0.0\package.xml. Probably the SDK is read-only
    Exception while marshalling C:\Program Files (x86)\Clickteam Fusion Developer 2.5\build-tools\27.0.1\package.xml. Probably the SDK is read-only
    Exception while marshalling C:\Program Files (x86)\Clickteam Fusion Developer 2.5\build-tools\27.0.2\package.xml. Probably the SDK is read-only
    Exception while marshalling C:\Program Files (x86)\Clickteam Fusion Developer 2.5\build-tools\27.0.3\package.xml. Probably the SDK is read-only
    Exception while marshalling C:\Program Files (x86)\Clickteam Fusion Developer 2.5\build-tools\28.0.0\package.xml. Probably the SDK is read-only
    Exception while marshalling C:\Program Files (x86)\Clickteam Fusion Developer 2.5\build-tools\28.0.1\package.xml. Probably the SDK is read-only
    Exception while marshalling C:\Program Files (x86)\Clickteam Fusion Developer 2.5\build-tools\28.0.2\package.xml. Probably the SDK is read-only
    Exception while marshalling C:\Program Files (x86)\Clickteam Fusion Developer 2.5\build-tools\28.0.3\package.xml. Probably the SDK is read-only
    Exception while marshalling C:\Program Files (x86)\Clickteam Fusion Developer 2.5\build-tools\29.0.0\package.xml. Probably the SDK is read-only
    Exception while marshalling C:\Program Files (x86)\Clickteam Fusion Developer 2.5\build-tools\29.0.1\package.xml. Probably the SDK is read-only
    Exception while marshalling C:\Program Files (x86)\Clickteam Fusion Developer 2.5\build-tools\29.0.2\package.xml. Probably the SDK is read-only
    Exception while marshalling C:\Program Files (x86)\Clickteam Fusion Developer 2.5\docs\package.xml. Probably the SDK is read-only
    Exception while marshalling C:\Program Files (x86)\Clickteam Fusion Developer 2.5\extras\android\m2repository\package.xml. Probably the SDK is read-only
    Exception while marshalling C:\Program Files (x86)\Clickteam Fusion Developer 2.5\extras\google\auto\package.xml. Probably the SDK is read-only
    Exception while marshalling C:\Program Files (x86)\Clickteam Fusion Developer 2.5\extras\google\google_play_services\package.xml . Probably the SDK is read-only
    Exception while marshalling C:\Program Files (x86)\Clickteam Fusion Developer 2.5\extras\google\instantapps\package.xml. Probably the SDK is read-only
    Exception while marshalling C:\Program Files (x86)\Clickteam Fusion Developer 2.5\extras\google\m2repository\package.xml. Probably the SDK is read-only
    Exception while marshalling C:\Program Files (x86)\Clickteam Fusion Developer 2.5\extras\google\market_apk_expansion\package.xml . Probably the SDK is read-only
    Exception while marshalling C:\Program Files (x86)\Clickteam Fusion Developer 2.5\extras\google\market_licensing\package.xml. Probably the SDK is read-only
    Exception while marshalling C:\Program Files (x86)\Clickteam Fusion Developer 2.5\extras\google\simulators\package.xml. Probably the SDK is read-only
    Exception while marshalling C:\Program Files (x86)\Clickteam Fusion Developer 2.5\extras\google\usb_driver\package.xml. Probably the SDK is read-only
    Exception while marshalling C:\Program Files (x86)\Clickteam Fusion Developer 2.5\extras\google\webdriver\package.xml. Probably the SDK is read-only
    Exception while marshalling C:\Program Files (x86)\Clickteam Fusion Developer 2.5\platform-tools\package.xml. Probably the SDK is read-only
    Exception while marshalling C:\Program Files (x86)\Clickteam Fusion Developer 2.5\platforms\android-10\package.xml. Probably the SDK is read-only
    Exception while marshalling C:\Program Files (x86)\Clickteam Fusion Developer 2.5\platforms\android-11\package.xml. Probably the SDK is read-only
    Exception while marshalling C:\Program Files (x86)\Clickteam Fusion Developer 2.5\platforms\android-12\package.xml. Probably the SDK is read-only
    Exception while marshalling C:\Program Files (x86)\Clickteam Fusion Developer 2.5\platforms\android-13\package.xml. Probably the SDK is read-only
    Exception while marshalling C:\Program Files (x86)\Clickteam Fusion Developer 2.5\platforms\android-14\package.xml. Probably the SDK is read-only
    Exception while marshalling C:\Program Files (x86)\Clickteam Fusion Developer 2.5\platforms\android-15\package.xml. Probably the SDK is read-only
    Exception while marshalling C:\Program Files (x86)\Clickteam Fusion Developer 2.5\platforms\android-16\package.xml. Probably the SDK is read-only
    Exception while marshalling C:\Program Files (x86)\Clickteam Fusion Developer 2.5\platforms\android-17\package.xml. Probably the SDK is read-only
    Exception while marshalling C:\Program Files (x86)\Clickteam Fusion Developer 2.5\platforms\android-18\package.xml. Probably the SDK is read-only
    Exception while marshalling C:\Program Files (x86)\Clickteam Fusion Developer 2.5\platforms\android-19\package.xml. Probably the SDK is read-only
    Exception while marshalling C:\Program Files (x86)\Clickteam Fusion Developer 2.5\platforms\android-20\package.xml. Probably the SDK is read-only
    Exception while marshalling C:\Program Files (x86)\Clickteam Fusion Developer 2.5\platforms\android-21\package.xml. Probably the SDK is read-only
    Exception while marshalling C:\Program Files (x86)\Clickteam Fusion Developer 2.5\platforms\android-22\package.xml. Probably the SDK is read-only
    Exception while marshalling C:\Program Files (x86)\Clickteam Fusion Developer 2.5\platforms\android-23\package.xml. Probably the SDK is read-only
    Exception while marshalling C:\Program Files (x86)\Clickteam Fusion Developer 2.5\platforms\android-24\package.xml. Probably the SDK is read-only
    Exception while marshalling C:\Program Files (x86)\Clickteam Fusion Developer 2.5\platforms\android-25\package.xml. Probably the SDK is read-only
    Exception while marshalling C:\Program Files (x86)\Clickteam Fusion Developer 2.5\platforms\android-26\package.xml. Probably the SDK is read-only
    Exception while marshalling C:\Program Files (x86)\Clickteam Fusion Developer 2.5\platforms\android-27\package.xml. Probably the SDK is read-only
    Exception while marshalling C:\Program Files (x86)\Clickteam Fusion Developer 2.5\platforms\android-28\package.xml. Probably the SDK is read-only
    Exception while marshalling C:\Program Files (x86)\Clickteam Fusion Developer 2.5\platforms\android-29\package.xml. Probably the SDK is read-only
    Exception while marshalling C:\Program Files (x86)\Clickteam Fusion Developer 2.5\platforms\android-7\package.xml. Probably the SDK is read-only
    Exception while marshalling C:\Program Files (x86)\Clickteam Fusion Developer 2.5\platforms\android-8\package.xml. Probably the SDK is read-only
    Exception while marshalling C:\Program Files (x86)\Clickteam Fusion Developer 2.5\platforms\android-9\package.xml. Probably the SDK is read-only
    Exception while marshalling C:\Program Files (x86)\Clickteam Fusion Developer 2.5\sources\android-15\package.xml. Probably the SDK is read-only
    Exception while marshalling C:\Program Files (x86)\Clickteam Fusion Developer 2.5\sources\android-16\package.xml. Probably the SDK is read-only
    Exception while marshalling C:\Program Files (x86)\Clickteam Fusion Developer 2.5\sources\android-17\package.xml. Probably the SDK is read-only
    Exception while marshalling C:\Program Files (x86)\Clickteam Fusion Developer 2.5\sources\android-18\package.xml. Probably the SDK is read-only
    Exception while marshalling C:\Program Files (x86)\Clickteam Fusion Developer 2.5\sources\android-19\package.xml. Probably the SDK is read-only
    Exception while marshalling C:\Program Files (x86)\Clickteam Fusion Developer 2.5\sources\android-20\package.xml. Probably the SDK is read-only
    Exception while marshalling C:\Program Files (x86)\Clickteam Fusion Developer 2.5\sources\android-21\package.xml. Probably the SDK is read-only
    Exception while marshalling C:\Program Files (x86)\Clickteam Fusion Developer 2.5\sources\android-22\package.xml. Probably the SDK is read-only
    Exception while marshalling C:\Program Files (x86)\Clickteam Fusion Developer 2.5\sources\android-23\package.xml. Probably the SDK is read-only
    Exception while marshalling C:\Program Files (x86)\Clickteam Fusion Developer 2.5\sources\android-24\package.xml. Probably the SDK is read-only
    Exception while marshalling C:\Program Files (x86)\Clickteam Fusion Developer 2.5\sources\android-25\package.xml. Probably the SDK is read-only
    Exception while marshalling C:\Program Files (x86)\Clickteam Fusion Developer 2.5\sources\android-26\package.xml. Probably the SDK is read-only
    Exception while marshalling C:\Program Files (x86)\Clickteam Fusion Developer 2.5\sources\android-27\package.xml. Probably the SDK is read-only
    Exception while marshalling C:\Program Files (x86)\Clickteam Fusion Developer 2.5\sources\android-28\package.xml. Probably the SDK is read-only
    Exception while marshalling C:\Program Files (x86)\Clickteam Fusion Developer 2.5\sources\android-29\package.xml. Probably the SDK is read-only
    Exception while marshalling C:\Program Files (x86)\Clickteam Fusion Developer 2.5\system-images\android-22\android-tv\x86\package.xml. Probably the SDK is read-only
    Exception while marshalling C:\Program Files (x86)\Clickteam Fusion Developer 2.5\system-images\android-22\default\armeabi-v7a\package.xml. Probably the SDK is read-only
    Exception while marshalling C:\Program Files (x86)\Clickteam Fusion Developer 2.5\system-images\android-22\default\x86\package.xml. Probably the SDK is read-only
    Exception while marshalling C:\Program Files (x86)\Clickteam Fusion Developer 2.5\system-images\android-22\default\x86_64\package.xml. Probably the SDK is read-only
    Exception while marshalling C:\Program Files (x86)\Clickteam Fusion Developer 2.5\system-images\android-22\google_apis\armeabi-v7a\package.xml. Probably the SDK is read-only
    Exception while marshalling C:\Program Files (x86)\Clickteam Fusion Developer 2.5\system-images\android-23\android-tv\armeabi-v7a\package.xml. Probably the SDK is read-only
    Exception while marshalling C:\Program Files (x86)\Clickteam Fusion Developer 2.5\system-images\android-23\android-tv\x86\package.xml. Probably the SDK is read-only
    Exception while marshalling C:\Program Files (x86)\Clickteam Fusion Developer 2.5\system-images\android-23\android-wear\armeabi-v7a\package.xml. Probably the SDK is read-only
    Exception while marshalling C:\Program Files (x86)\Clickteam Fusion Developer 2.5\system-images\android-23\android-wear\x86\package.xml. Probably the SDK is read-only
    Exception while marshalling C:\Program Files (x86)\Clickteam Fusion Developer 2.5\system-images\android-23\default\armeabi-v7a\package.xml. Probably the SDK is read-only
    Exception while marshalling C:\Program Files (x86)\Clickteam Fusion Developer 2.5\system-images\android-23\default\x86\package.xml. Probably the SDK is read-only
    Exception while marshalling C:\Program Files (x86)\Clickteam Fusion Developer 2.5\system-images\android-23\default\x86_64\package.xml. Probably the SDK is read-only
    Exception while marshalling C:\Program Files (x86)\Clickteam Fusion Developer 2.5\system-images\android-23\google_apis\armeabi-v7a\package.xml. Probably the SDK is read-only
    Exception while marshalling C:\Program Files (x86)\Clickteam Fusion Developer 2.5\system-images\android-23\google_apis\x86\package.xml. Probably the SDK is read-only
    Exception while marshalling C:\Program Files (x86)\Clickteam Fusion Developer 2.5\system-images\android-23\google_apis\x86_64\package.xml. Probably the SDK is read-only
    Exception while marshalling C:\Program Files (x86)\Clickteam Fusion Developer 2.5\system-images\android-24\android-tv\x86\package.xml. Probably the SDK is read-only
    Exception while marshalling C:\Program Files (x86)\Clickteam Fusion Developer 2.5\system-images\android-24\default\arm64-v8a\package.xml. Probably the SDK is read-only
    Exception while marshalling C:\Program Files (x86)\Clickteam Fusion Developer 2.5\system-images\android-24\default\armeabi-v7a\package.xml. Probably the SDK is read-only
    Exception while marshalling C:\Program Files (x86)\Clickteam Fusion Developer 2.5\system-images\android-24\default\x86\package.xml. Probably the SDK is read-only
    Exception while marshalling C:\Program Files (x86)\Clickteam Fusion Developer 2.5\system-images\android-24\default\x86_64\package.xml. Probably the SDK is read-only
    Exception while marshalling C:\Program Files (x86)\Clickteam Fusion Developer 2.5\system-images\android-24\google_apis\arm64-v8a\package.xml. Probably the SDK is read-only
    Exception while marshalling C:\Program Files (x86)\Clickteam Fusion Developer 2.5\system-images\android-24\google_apis\armeabi-v7a\package.xml. Probably the SDK is read-only
    Exception while marshalling C:\Program Files (x86)\Clickteam Fusion Developer 2.5\system-images\android-24\google_apis\x86\package.xml. Probably the SDK is read-only
    Exception while marshalling C:\Program Files (x86)\Clickteam Fusion Developer 2.5\system-images\android-24\google_apis\x86_64\package.xml. Probably the SDK is read-only
    Exception while marshalling C:\Program Files (x86)\Clickteam Fusion Developer 2.5\system-images\android-24\google_apis_playstore\x86\package.xml. Probably the SDK is read-only
    Exception while marshalling C:\Program Files (x86)\Clickteam Fusion Developer 2.5\system-images\android-25\android-tv\x86\package.xml. Probably the SDK is read-only
    Exception while marshalling C:\Program Files (x86)\Clickteam Fusion Developer 2.5\system-images\android-25\android-wear\armeabi-v7a\package.xml. Probably the SDK is read-only
    Exception while marshalling C:\Program Files (x86)\Clickteam Fusion Developer 2.5\system-images\android-25\android-wear\x86\package.xml. Probably the SDK is read-only
    Exception while marshalling C:\Program Files (x86)\Clickteam Fusion Developer 2.5\system-images\android-25\default\x86\package.xml. Probably the SDK is read-only
    Exception while marshalling C:\Program Files (x86)\Clickteam Fusion Developer 2.5\system-images\android-25\default\x86_64\package.xml. Probably the SDK is read-only
    Exception while marshalling C:\Program Files (x86)\Clickteam Fusion Developer 2.5\system-images\android-25\google_apis\arm64-v8a\package.xml. Probably the SDK is read-only
    Exception while marshalling C:\Program Files (x86)\Clickteam Fusion Developer 2.5\system-images\android-25\google_apis\armeabi-v7a\package.xml. Probably the SDK is read-only
    Exception while marshalling C:\Program Files (x86)\Clickteam Fusion Developer 2.5\system-images\android-25\google_apis\x86\package.xml. Probably the SDK is read-only
    Exception while marshalling C:\Program Files (x86)\Clickteam Fusion Developer 2.5\system-images\android-25\google_apis\x86_64\package.xml. Probably the SDK is read-only
    Exception while marshalling C:\Program Files (x86)\Clickteam Fusion Developer 2.5\system-images\android-25\google_apis_playstore\x86\package.xml. Probably the SDK is read-only
    Exception while marshalling C:\Program Files (x86)\Clickteam Fusion Developer 2.5\system-images\android-26\android-wear\x86\package.xml. Probably the SDK is read-only
    Exception while marshalling C:\Program Files (x86)\Clickteam Fusion Developer 2.5\system-images\android-26\default\x86\package.xml. Probably the SDK is read-only
    Exception while marshalling C:\Program Files (x86)\Clickteam Fusion Developer 2.5\system-images\android-26\default\x86_64\package.xml. Probably the SDK is read-only
    Exception while marshalling C:\Program Files (x86)\Clickteam Fusion Developer 2.5\system-images\android-26\google_apis\x86\package.xml. Probably the SDK is read-only
    Exception while marshalling C:\Program Files (x86)\Clickteam Fusion Developer 2.5\system-images\android-26\google_apis\x86_64\package.xml. Probably the SDK is read-only
    Exception while marshalling C:\Program Files (x86)\Clickteam Fusion Developer 2.5\system-images\android-27\default\x86\package.xml. Probably the SDK is read-only
    Exception while marshalling C:\Program Files (x86)\Clickteam Fusion Developer 2.5\system-images\android-27\default\x86_64\package.xml. Probably the SDK is read-only
    Exception while marshalling C:\Program Files (x86)\Clickteam Fusion Developer 2.5\system-images\android-27\google_apis\x86\package.xml. Probably the SDK is read-only
    Exception while marshalling C:\Program Files (x86)\Clickteam Fusion Developer 2.5\system-images\android-27\google_apis_playstore\x86\package.xml. Probably the SDK is read-only
    Exception while marshalling C:\Program Files (x86)\Clickteam Fusion Developer 2.5\system-images\android-28\android-wear\x86\package.xml. Probably the SDK is read-only
    Exception while marshalling C:\Program Files (x86)\Clickteam Fusion Developer 2.5\system-images\android-28\google_apis\x86\package.xml. Probably the SDK is read-only
    Exception while marshalling C:\Program Files (x86)\Clickteam Fusion Developer 2.5\system-images\android-28\google_apis\x86_64\package.xml. Probably the SDK is read-only
    Exception while marshalling C:\Program Files (x86)\Clickteam Fusion Developer 2.5\system-images\android-28\google_apis_playstore\x86\package.xml. Probably the SDK is read-only
    Exception while marshalling C:\Program Files (x86)\Clickteam Fusion Developer 2.5\system-images\android-28\google_apis_playstore\x86_64\package.xml. Probably the SDK is read-only
    Exception while marshalling C:\Program Files (x86)\Clickteam Fusion Developer 2.5\system-images\android-29\default\x86\package.xml. Probably the SDK is read-only
    Exception while marshalling C:\Program Files (x86)\Clickteam Fusion Developer 2.5\system-images\android-29\default\x86_64\package.xml. Probably the SDK is read-only
    Exception while marshalling C:\Program Files (x86)\Clickteam Fusion Developer 2.5\system-images\android-29\google_apis\x86\package.xml. Probably the SDK is read-only
    Exception while marshalling C:\Program Files (x86)\Clickteam Fusion Developer 2.5\system-images\android-29\google_apis\x86_64\package.xml. Probably the SDK is read-only
    Exception while marshalling C:\Program Files (x86)\Clickteam Fusion Developer 2.5\system-images\android-29\google_apis_playstore\x86\package.xml. Probably the SDK is read-only
    Exception while marshalling C:\Program Files (x86)\Clickteam Fusion Developer 2.5\system-images\android-29\google_apis_playstore\x86_64\package.xml. Probably the SDK is read-only
    Exception while marshalling C:\Program Files (x86)\Clickteam Fusion Developer 2.5\tools\package.xml. Probably the SDK is read-only

    > Task :app:preBuild UP-TO-DATE
    > Task :app:preReleaseBuild
    > Task :app:compileReleaseAidl NO-SOURCE
    > Task :app:compileReleaseRenderscript NO-SOURCE
    > Task :app:checkReleaseManifest
    > Task :app:generateReleaseBuildConfig
    > Task :app:prepareLintJar
    > Task :app:generateReleaseSources
    > Task :app:javaPreCompileRelease
    > Task :app:mainApkListPersistenceRelease
    > Task :app:generateReleaseResValues
    > Task :app:generateReleaseResources
    > Task :app:mergeReleaseResources
    > Task :app:createReleaseCompatibleScreenManifests
    > Task :app:processReleaseManifest
    > Task :app:processReleaseResources

    > Task :app:compileReleaseJavaWithJavac
    Note: Some input files use or override a deprecated API.
    Note: Recompile with -Xlint:deprecation for details.
    Note: Some input files use unchecked or unsafe operations.
    Note: Recompile with -Xlint:unchecked for details.

    > Task :app:compileReleaseSources
    > Task :app:checkReleaseDuplicateClasses
    > Task :app:mergeExtDexRelease
    > Task :app:transformClassesWithDexBuilderForRelease
    > Task :app:mergeDexRelease
    > Task :app:mergeReleaseShaders
    > Task :app:compileReleaseShaders
    > Task :app:generateReleaseAssets
    > Task :app:mergeReleaseAssets
    > Task :app:validateSigningRelease
    > Task :app:signingConfigWriterRelease
    > Task :app:mergeReleaseJniLibFolders
    > Task :app:transformNativeLibsWithMergeJniLibsForRelease
    > Task :app:processReleaseJavaRes NO-SOURCE
    > Task :app:transformResourcesWithMergeJavaResForRelease
    > Task :app:packageRelease FAILED

    FAILURE: Build failed with an exception.

    * What went wrong:
    Execution failed for task ':app:packageRelease'.
    > 1 exception was raised by workers:
    java.lang.RuntimeException: java.lang.RuntimeException: com.android.ide.common.signing.KeytoolException: Failed to read key teamyakine from store "C:\bee1000.keystore": Keystore was tampered with, or password was incorrect


    * Try:
    Run with --stacktrace option to get the stack trace. Run with --info or --debug option to get more log output. Run with --scan to get full insights.

    * Get more help at https://help.gradle.org

    Deprecated Gradle features were used in this build, making it incompatible with Gradle 6.0.
    Use '--warning-mode all' to show the individual deprecation warnings.
    See https://docs.gradle.org/5.1.1/usergu..._line_warnings

    BUILD FAILED in 43s
    25 actionable tasks: 25 executed

  4. #4
    Clickteam Clickteam
    Fernando's Avatar
    Join Date
    Dec 2006
    Posts
    6,196
    Mentioned
    167 Post(s)
    Tagged
    3 Thread(s)
    sorry did you check this line in your report

    Failed to read key teamyakine from store "C:\bee1000.keystore": Keystore was tampered with, or password was incorrect
    Regards,


    Fernando Vivolo

    ... new things are coming ...

  5. #5
    Clicker Fusion 2.5 DeveloperAndroid Export ModuleSWF Export Module

    Join Date
    Mar 2007
    Location
    Carthage - TUNISIE
    Posts
    258
    Mentioned
    0 Post(s)
    Tagged
    0 Thread(s)
    Ok Fernando, je vais revoir il y a certainement une erreur...

  6. #6
    Clickteam Clickteam

    Join Date
    Jun 2006
    Location
    France
    Posts
    13,199
    Mentioned
    141 Post(s)
    Tagged
    2 Thread(s)
    C:\Program Files (x86)\Clickteam Fusion Developer 2.5\build-tools\19.1.0\package.xml Probably the SDK is read-only
    Did you really install the Android SDK in your Fusion 2.5 folder? O_o

    If so, IMHO you should uninstall the Android SDK, uninstall Fusion, delete the Fusion folder, reinstall Fusion, reinstall the Android exporter, reinstall the Fusion update patch (build 292.14) (in this order), and then install Android Studio, in its default directory, NOT the Fusion directory. See this post.

  7. #7
    Clicker Fusion 2.5 DeveloperAndroid Export ModuleSWF Export Module

    Join Date
    Mar 2007
    Location
    Carthage - TUNISIE
    Posts
    258
    Mentioned
    0 Post(s)
    Tagged
    0 Thread(s)
    Quote Originally Posted by Yves View Post
    Did you really install the Android SDK in your Fusion 2.5 folder? O_o

    If so, IMHO you should uninstall the Android SDK, uninstall Fusion, delete the Fusion folder, reinstall Fusion, reinstall the Android exporter, reinstall the Fusion update patch (build 292.14) (in this order), and then install Android Studio, in its default directory, NOT the Fusion directory. See this post.
    Thank you so much...
    I will do all what you asked...Hope it will work then!

  8. #8
    Clicker Fusion 2.5 DeveloperAndroid Export ModuleSWF Export Module

    Join Date
    Mar 2007
    Location
    Carthage - TUNISIE
    Posts
    258
    Mentioned
    0 Post(s)
    Tagged
    0 Thread(s)
    Yves... Fernando...
    Merci beaucoup ... mon problème est résolu après désinstallation complète des fichiers SDK et Java puis tout re-installation
    RÉSOLU!

  9. #9
    Clicker Fusion 2.5 DeveloperAndroid Export ModuleSWF Export Module

    Join Date
    Mar 2007
    Location
    Carthage - TUNISIE
    Posts
    258
    Mentioned
    0 Post(s)
    Tagged
    0 Thread(s)
    Quote Originally Posted by Yves View Post
    Did you really install the Android SDK in your Fusion 2.5 folder? O_o

    If so, IMHO you should uninstall the Android SDK, uninstall Fusion, delete the Fusion folder, reinstall Fusion, reinstall the Android exporter, reinstall the Fusion update patch (build 292.14) (in this order), and then install Android Studio, in its default directory, NOT the Fusion directory. See this post.
    J'ai eune panne de mon DD, je l'ai formaté, puis j'ai réinstallé CF2.5 DEV + Android exporté+ SDK JDK Mais quand j'ai voulu compilé mon application, j'ai eu ce message
    ---------------
    Buildfile: C:\Users\Admin\AppData\Local\Temp\AndD26A.tmp\buil d.xml

    BUILD FAILED
    C:\Users\Admin\AppData\Local\Temp\AndD26A.tmp\buil d.xml:83: Cannot find C:\Users\Admin\AppData\Local\Android\Sdk\tools\ant \build.xml imported from C:\Users\Admin\AppData\Local\Temp\AndD26A.tmp\buil d.xml
    ---------------------------
    Pouvez-vous résoudre mon problème
    Merci

  10. #10
    Clickteam Clickteam

    Join Date
    Jun 2006
    Location
    France
    Posts
    13,199
    Mentioned
    141 Post(s)
    Tagged
    2 Thread(s)
    Il faut toujours installer la dernière mise à jour de Fusion après avoir installé un module d'exportation.

Similar Threads

  1. "Ninja vs Gun" Released on Google Play Store
    By amiman99 in forum WIP & Released Games & Apps
    Replies: 5
    Last Post: 9th June 2018, 10:47 AM
  2. "Sandy Chew" available on Google Play
    By osk in forum Android Released Games & Apps
    Replies: 2
    Last Post: 19th April 2015, 09:32 AM
  3. UPnUP - Android game "made with fusion" on Google Play
    By qenio in forum Android Export Module Version 2.0
    Replies: 7
    Last Post: 4th April 2013, 11:23 AM
  4. ""Play sample file~" is effective.
    By kusa in forum Android Export Module Version 2.0
    Replies: 0
    Last Post: 26th September 2012, 05:46 PM
  5. "Play sample File on a Specific Channel" bugs.
    By ASD in forum Multimedia Fusion 2 - Technical Support
    Replies: 1
    Last Post: 2nd December 2008, 03:32 PM

Posting Permissions

  • You may not post new threads
  • You may not post replies
  • You may not post attachments
  • You may not edit your posts
  •