User Tag List

Page 1 of 4 1 2 3 ... LastLast
Results 1 to 10 of 40

Thread: Compile error latest version

  1. #1
    Forum Moderator

    Fusion 2.5 MacFusion 2.5 DeveloperFusion 2.5+ DLCAndroid Export ModuleHTML5 Export ModuleiOS Export ModuleMac Export ModuleUniversal Windows Platform Export ModuleSWF Export ModuleInstall Creator Pro
    Fusion 2.5 (Steam)Fusion 2.5 Developer (Steam)Android Export Module (Steam)HTML5 Export Module (Steam)iOS Export Module (Steam)
    Perry's Avatar
    Join Date
    Dec 2013
    Location
    Watertown, WI
    Posts
    4,406
    Mentioned
    59 Post(s)
    Tagged
    0 Thread(s)

    Compile error latest version

    I've re-compiled 20+ games with no issues, but I have 1 at least with this error
    Any suggestions ?
    Using API 29, with min 4.3 and max 10.0




    > Configure project :app
    WARNING: The option 'android.useDeprecatedNdk' is deprecated.
    The current default is 'false'.
    It has been removed from the current version of the Android Gradle plugin.
    NdkCompile is no longer supported

    > Task :app:preBuild UP-TO-DATE
    > Task :app:preReleaseBuild UP-TO-DATE
    > Task :app:compileReleaseAidl
    > Task :app:compileReleaseRenderscript NO-SOURCE
    > Task :app:generateReleaseBuildConfig
    > Task :app:generateReleaseResValues
    > Task :app:generateReleaseResources
    > Task :app:createReleaseCompatibleScreenManifests
    > Task :app:extractDeepLinksRelease
    > Task :app:processReleaseManifest
    > Task :app:checkReleaseDuplicateClasses
    > Task :app:javaPreCompileRelease
    > Task :app:mergeReleaseShaders
    > Task :app:compileReleaseShaders NO-SOURCE
    > Task :app:generateReleaseAssets UP-TO-DATE
    > Task :app:mergeReleaseAssets
    > Task :app:processReleaseJavaRes NO-SOURCE
    > Task :app:collectReleaseDependencies
    > Task :app:sdkReleaseDependencyData
    > Task :app:mergeReleaseJniLibFolders
    > Task :app:validateSigningRelease
    > Task :app:mergeReleaseResources
    > Task :app:processReleaseResources

    > Task :app:compileReleaseJavaWithJavac FAILED
    C:\Users\Perry\AppData\Local\Temp\AndD9B4.tmp\app\ src\main\java\Runtime\MMFRuntime.java:1470: error: cannot find symbol
    return api23Util.getPermissionStatus(permission);
    ^
    symbol: method getPermissionStatus(String)
    location: variable api23Util of type PermissionsApi23Util
    Note: Some input files use or override a deprecated API.
    Note: Recompile with -Xlint:deprecation for details.
    Note: Some input files use unchecked or unsafe operations.
    Note: Recompile with -Xlint:unchecked for details.
    1 error

    > Task :app:mergeReleaseNativeLibs
    > Task :app:mergeExtDexRelease
    > Task :app:mergeReleaseJavaResource

    FAILURE: Build failed with an exception.

    * What went wrong:
    Execution failed for task ':app:compileReleaseJavaWithJavac'.
    > Compilation failed; see the compiler error output for details.

    * Try:
    Run with --stacktrace option to get the stack trace. Run with --info or --debug option to get more log output. Run with --scan to get full insights.

    * Get more help at https://help.gradle.org

    BUILD FAILED in 4s
    20 actionable tasks: 20 executed

  2. #2
    Forum Moderator

    Fusion 2.5 MacFusion 2.5 DeveloperFusion 2.5+ DLCAndroid Export ModuleHTML5 Export ModuleiOS Export ModuleMac Export ModuleUniversal Windows Platform Export ModuleSWF Export ModuleInstall Creator Pro
    Fusion 2.5 (Steam)Fusion 2.5 Developer (Steam)Android Export Module (Steam)HTML5 Export Module (Steam)iOS Export Module (Steam)
    Perry's Avatar
    Join Date
    Dec 2013
    Location
    Watertown, WI
    Posts
    4,406
    Mentioned
    59 Post(s)
    Tagged
    0 Thread(s)
    Looks like those are the games with Google Play in it..
    This happens after I updated the new GPG package yesterday

  3. #3
    Clicker Fusion 2.5 DeveloperFusion 2.5+ DLCAndroid Export ModuleHTML5 Export ModuleiOS Export ModuleUniversal Windows Platform Export ModuleXNA Export Module
    Dobermann's Avatar
    Join Date
    Feb 2009
    Location
    France
    Posts
    806
    Mentioned
    37 Post(s)
    Tagged
    0 Thread(s)
    I've just tested what you said and got the same error, didn't got any error before i update the GPG object... I was also unable to find a log about the GPG changes from this new version...
    Code:
    Starting a Gradle Daemon, 1 incompatible and 1 stopped Daemons could not be reused, use --status for details
    
    > Configure project :app
    WARNING: The option 'android.useDeprecatedNdk' is deprecated.
    The current default is 'false'.
    It has been removed from the current version of the Android Gradle plugin.
    NdkCompile is no longer supported
    
    > Task :app:preBuild UP-TO-DATE
    > Task :app:preReleaseBuild UP-TO-DATE
    > Task :app:compileReleaseAidl
    > Task :app:compileReleaseRenderscript NO-SOURCE
    > Task :app:generateReleaseBuildConfig
    > Task :app:generateReleaseResValues
    > Task :app:generateReleaseResources
    > Task :app:createReleaseCompatibleScreenManifests
    > Task :app:extractDeepLinksRelease
    > Task :app:processReleaseManifest
    > Task :app:checkReleaseDuplicateClasses
    > Task :app:mergeReleaseShaders
    > Task :app:compileReleaseShaders NO-SOURCE
    > Task :app:generateReleaseAssets UP-TO-DATE
    > Task :app:mergeReleaseAssets
    > Task :app:processReleaseJavaRes NO-SOURCE
    > Task :app:javaPreCompileRelease
    > Task :app:collectReleaseDependencies
    > Task :app:sdkReleaseDependencyData
    > Task :app:mergeReleaseJniLibFolders
    > Task :app:mergeReleaseResources
    > Task :app:processReleaseResources
    
    > Task :app:compileReleaseJavaWithJavac
    C:\Users\willb\AppData\Local\Temp\And88B8.tmp\app\src\main\java\Runtime\MMFRuntime.java:1470: error: cannot find symbol
    		return api23Util.getPermissionStatus(permission);
    		                ^
      symbol:   method getPermissionStatus(String)
      location: variable api23Util of type PermissionsApi23Util
    Note: Some input files use or override a deprecated API.
    Note: Recompile with -Xlint:deprecation for details.
    Note: Some input files use unchecked or unsafe operations.
    Note: Recompile with -Xlint:unchecked for details.
    1 error
    
    > Task :app:compileReleaseJavaWithJavac FAILED
    > Task :app:mergeReleaseJavaResource
    > Task :app:mergeExtDexRelease
    > Task :app:mergeReleaseNativeLibs
    
    FAILURE: Build failed with an exception.
    
    * What went wrong:
    Execution failed for task ':app:compileReleaseJavaWithJavac'.
    > Compilation failed; see the compiler error output for details.
    
    * Try:
    Run with --stacktrace option to get the stack trace. Run with --info or --debug option to get more log output. Run with --scan to get full insights.
    
    * Get more help at https://help.gradle.org
    
    BUILD FAILED in 27s
    19 actionable tasks: 19 executed

  4. #4
    Clickteam Clickteam
    Fernando's Avatar
    Join Date
    Dec 2006
    Posts
    6,700
    Mentioned
    292 Post(s)
    Tagged
    4 Thread(s)
    what version you are using from clickstore? 292.26?

    ======================================

    mm latest version have these lines commented for next version, so not sure how this is enabled, can you send by PM GPGConnect.zip
    Regards,


    Fernando Vivolo

    ... new things are coming ...

  5. #5
    Clicker Fusion 2.5 DeveloperFusion 2.5+ DLCAndroid Export ModuleHTML5 Export ModuleiOS Export ModuleUniversal Windows Platform Export ModuleXNA Export Module
    Dobermann's Avatar
    Join Date
    Feb 2009
    Location
    France
    Posts
    806
    Mentioned
    37 Post(s)
    Tagged
    0 Thread(s)
    I'm using Fusion 2.5+ Dev 292.26
    And i've received an email about the new GPG objects version : GPGObjects_V200_ForFusionBuild292_26Gradle_Support Libs.zip

  6. #6
    Clickteam Clickteam
    Fernando's Avatar
    Join Date
    Dec 2006
    Posts
    6,700
    Mentioned
    292 Post(s)
    Tagged
    4 Thread(s)
    Thanks for the info a new version will be posted soon.
    Regards,


    Fernando Vivolo

    ... new things are coming ...

  7. #7
    Forum Moderator

    Fusion 2.5 MacFusion 2.5 DeveloperFusion 2.5+ DLCAndroid Export ModuleHTML5 Export ModuleiOS Export ModuleMac Export ModuleUniversal Windows Platform Export ModuleSWF Export ModuleInstall Creator Pro
    Fusion 2.5 (Steam)Fusion 2.5 Developer (Steam)Android Export Module (Steam)HTML5 Export Module (Steam)iOS Export Module (Steam)
    Perry's Avatar
    Join Date
    Dec 2013
    Location
    Watertown, WI
    Posts
    4,406
    Mentioned
    59 Post(s)
    Tagged
    0 Thread(s)
    using also the latest version.. I see an update was ready for download again.
    Thank you

  8. #8
    Forum Moderator

    Fusion 2.5 MacFusion 2.5 DeveloperFusion 2.5+ DLCAndroid Export ModuleHTML5 Export ModuleiOS Export ModuleMac Export ModuleUniversal Windows Platform Export ModuleSWF Export ModuleInstall Creator Pro
    Fusion 2.5 (Steam)Fusion 2.5 Developer (Steam)Android Export Module (Steam)HTML5 Export Module (Steam)iOS Export Module (Steam)
    Perry's Avatar
    Join Date
    Dec 2013
    Location
    Watertown, WI
    Posts
    4,406
    Mentioned
    59 Post(s)
    Tagged
    0 Thread(s)
    still getting the error?
    Looks like the new download contains the same EXE file from 8/20 ?


    > Configure project :app
    WARNING: The option 'android.useDeprecatedNdk' is deprecated.
    The current default is 'false'.
    It has been removed from the current version of the Android Gradle plugin.
    NdkCompile is no longer supported

    > Task :app:preBuild UP-TO-DATE
    > Task :app:preReleaseBuild UP-TO-DATE
    > Task :app:compileReleaseAidl
    > Task :app:compileReleaseRenderscript NO-SOURCE
    > Task :app:generateReleaseBuildConfig
    > Task :app:generateReleaseResValues
    > Task :app:generateReleaseResources
    > Task :app:createReleaseCompatibleScreenManifests
    > Task :app:extractDeepLinksRelease
    > Task :app:processReleaseManifest
    > Task :app:checkReleaseDuplicateClasses
    > Task :app:mergeReleaseShaders
    > Task :app:compileReleaseShaders NO-SOURCE
    > Task :app:generateReleaseAssets UP-TO-DATE
    > Task :app:mergeReleaseAssets
    > Task :app:processReleaseJavaRes NO-SOURCE
    > Task :app:collectReleaseDependencies
    > Task :app:sdkReleaseDependencyData
    > Task :app:mergeReleaseJniLibFolders
    > Task :app:validateSigningRelease
    > Task :app:javaPreCompileRelease
    > Task :app:mergeReleaseResources
    > Task :app:processReleaseResources

    > Task :app:compileReleaseJavaWithJavac FAILED
    C:\Users\Perry\AppData\Local\Temp\AndEA02.tmp\app\ src\main\java\Runtime\MMFRuntime.java:1470: error: cannot find symbol
    return api23Util.getPermissionStatus(permission);
    ^
    symbol: method getPermissionStatus(String)
    location: variable api23Util of type PermissionsApi23Util
    Note: Some input files use or override a deprecated API.
    Note: Recompile with -Xlint:deprecation for details.
    Note: Some input files use unchecked or unsafe operations.
    Note: Recompile with -Xlint:unchecked for details.
    1 error

    > Task :app:mergeReleaseNativeLibs
    > Task :app:mergeReleaseJavaResource
    > Task :app:mergeExtDexRelease

    FAILURE: Build failed with an exception.

    * What went wrong:
    Execution failed for task ':app:compileReleaseJavaWithJavac'.
    > Compilation failed; see the compiler error output for details.

    * Try:
    Run with --stacktrace option to get the stack trace. Run with --info or --debug option to get more log output. Run with --scan to get full insights.

    * Get more help at https://help.gradle.org

    BUILD FAILED in 5s
    20 actionable tasks: 20 executed

  9. #9
    Clicker Fusion 2.5 DeveloperFusion 2.5+ DLCAndroid Export ModuleHTML5 Export ModuleiOS Export ModuleUniversal Windows Platform Export ModuleXNA Export Module
    Dobermann's Avatar
    Join Date
    Feb 2009
    Location
    France
    Posts
    806
    Mentioned
    37 Post(s)
    Tagged
    0 Thread(s)
    Same issue if i test from the new download link.

  10. #10
    Forum Moderator

    Fusion 2.5 MacFusion 2.5 DeveloperFusion 2.5+ DLCAndroid Export ModuleHTML5 Export ModuleiOS Export ModuleMac Export ModuleUniversal Windows Platform Export ModuleSWF Export ModuleInstall Creator Pro
    Fusion 2.5 (Steam)Fusion 2.5 Developer (Steam)Android Export Module (Steam)HTML5 Export Module (Steam)iOS Export Module (Steam)
    Perry's Avatar
    Join Date
    Dec 2013
    Location
    Watertown, WI
    Posts
    4,406
    Mentioned
    59 Post(s)
    Tagged
    0 Thread(s)
    I wonder if @Fernando zipped the wrong exe since they are both from the same date. and not from yesterday

Page 1 of 4 1 2 3 ... LastLast

Similar Threads

  1. Odd compile error Gradle / Admob with latest built.
    By Perry in forum Android Export Module 2.5
    Replies: 11
    Last Post: 29th May 2019, 12:01 AM
  2. Latest Google Ad Framework won't compile?
    By Perry in forum iOS Export Module 2.5
    Replies: 11
    Last Post: 14th January 2017, 11:12 PM
  3. Has anyone tried to compile in XCODE with the latest build
    By aenever in forum iOS Export Module 2.5
    Replies: 6
    Last Post: 15th June 2015, 09:13 PM
  4. Cannot Compile (Latest APIs and SDK Installed)
    By Danny in forum Android Export Module Version 2.0
    Replies: 5
    Last Post: 26th March 2012, 08:49 PM
  5. Cannot compile FLASH after installing latest beta
    By Tuna in forum SWF/Flash Export Module Version 2.0
    Replies: 4
    Last Post: 15th December 2011, 10:31 AM

Posting Permissions

  • You may not post new threads
  • You may not post replies
  • You may not post attachments
  • You may not edit your posts
  •