User Tag List

Results 1 to 2 of 2

Thread: Issue building Android APK file

  1. #1
    Clicker Fusion 2.5 MacFusion 2.5 DeveloperAndroid Export ModuleHTML5 Export ModuleiOS Export ModuleMac Export ModuleUniversal Windows Platform Export ModuleSWF Export ModuleXNA Export Module
    Fusion 2.5 (Steam)Fusion 2.5 Developer (Steam)Android Export Module (Steam)HTML5 Export Module (Steam)iOS Export Module (Steam)Universal Windows Platform Export Module (Steam)
    Baggins69's Avatar
    Join Date
    Aug 2012
    Location
    Brisbane, Australia
    Posts
    36
    Mentioned
    0 Post(s)
    Tagged
    0 Thread(s)

    Issue building Android APK file

    Hi,

    I'm hoping that there may be a simple answer to the problem I'm receiving when trying to create an Android APK with Clickteam Fusion Developer 2.5. Not sure what I've missed, but would appreciate any help that can be offered.


    macOS: 10.14 (Mojave)
    Fusion: R292.26
    Path Android SDK: Z:\Users\scott\Library\Android\sdk
    Android Studio: latest installed
    Build API: 29
    Min: 4.3
    Max: 10
    Java: version 8, update 261


    Error:

    > Configure project :app
    WARNING: The option 'android.useDeprecatedNdk' is deprecated.
    The current default is 'false'.
    It has been removed from the current version of the Android Gradle plugin.
    NdkCompile is no longer supported

    > Task :app:preBuild UP-TO-DATE
    > Task :app:preDebugBuild UP-TO-DATE
    > Task :app:compileDebugAidl NO-SOURCE
    > Task :app:compileDebugRenderscript NO-SOURCE
    > Task :app:generateDebugBuildConfig
    > Task :app:generateDebugResValues
    > Task :app:generateDebugResources
    > Task :app:createDebugCompatibleScreenManifests
    > Task :app:extractDeepLinksDebug
    > Task :app:processDebugManifest
    > Task :app:mergeDebugShaders
    > Task :app:compileDebugShaders NO-SOURCE
    > Task :app:generateDebugAssets UP-TO-DATE
    > Task :app:mergeDebugAssets
    > Task :app:processDebugJavaRes NO-SOURCE
    > Task :app:checkDebugDuplicateClasses
    > Task :app:mergeDebugResources
    > Task :app:processDebugResources
    > Task :app:mergeDebugJniLibFolders
    > Task :app:validateSigningDebug
    > Task :app:mergeExtDexDebug
    > Task :app:mergeDebugJavaResource
    > Task :app:javaPreCompileDebug

    > Task :app:compileDebugJavaWithJavac
    Note: Some input files use or override a deprecated API.
    Note: Recompile with -Xlint:deprecation for details.
    Note: Some input files use unchecked or unsafe operations.
    Note: Recompile with -Xlint:unchecked for details.

    > Task :app:compileDebugSources
    > Task :app:dexBuilderDebug
    > Task :app:mergeDebugNativeLibs
    > Task :app:stripDebugDebugSymbols FAILED
    > Task :app:mergeDexDebug

    FAILURE: Build failed with an exception.

    * What went wrong:
    Execution failed for task ':app:stripDebugDebugSymbols'.
    > No version of NDK matched the requested version 21.0.6113669. Versions available locally: 21.3.6528147

    * Try:
    Run with --stacktrace option to get the stack trace. Run with --info or --debug option to get more log output. Run with --scan to get full insights.

    * Get more help at https://help.gradle.org

    BUILD FAILED in 11s
    20 actionable tasks: 20 executed

  2. #2
    Clicker Fusion 2.5 MacFusion 2.5 DeveloperAndroid Export ModuleHTML5 Export ModuleiOS Export ModuleMac Export ModuleUniversal Windows Platform Export ModuleSWF Export ModuleXNA Export Module
    Fusion 2.5 (Steam)Fusion 2.5 Developer (Steam)Android Export Module (Steam)HTML5 Export Module (Steam)iOS Export Module (Steam)Universal Windows Platform Export Module (Steam)
    Baggins69's Avatar
    Join Date
    Aug 2012
    Location
    Brisbane, Australia
    Posts
    36
    Mentioned
    0 Post(s)
    Tagged
    0 Thread(s)
    Hello everyone,

    Had a similar problem with my Windows machine and solved it by downgrading to 292.14 with allowed me to compile without error.
    I followed the same steps on my Mac and it also now compiles without error.

Similar Threads

  1. Replies: 2
    Last Post: 5th November 2017, 10:52 PM
  2. Perspective Object Issue when Building
    By koolbrosmk in forum Fusion 2.5
    Replies: 2
    Last Post: 21st June 2015, 01:48 AM
  3. Android Exporter - Trouble Building an Android Application
    By Appsareawesome in forum Android Export Module Version 2.0
    Replies: 1
    Last Post: 19th February 2014, 06:48 PM
  4. Building Issue
    By Iwantmyrpg in forum Extension Development
    Replies: 19
    Last Post: 28th June 2010, 07:59 AM
  5. Building an .exe issue - this one is wierd :s
    By tallguypete in forum Install Creator and Patch Maker
    Replies: 3
    Last Post: 28th December 2006, 05:04 PM

Posting Permissions

  • You may not post new threads
  • You may not post replies
  • You may not post attachments
  • You may not edit your posts
  •