User Tag List

Results 1 to 6 of 6

Thread: Error while compiling .aab

  1. #1
    Clicker Fusion 2.5 (Steam)Fusion 2.5 Developer (Steam)Fusion 2.5+ DLC (Steam)Android Export Module (Steam)

    Join Date
    Jan 2017
    Location
    Russia, Nizhnekamsk
    Posts
    3
    Mentioned
    1 Post(s)
    Tagged
    0 Thread(s)

    Error while compiling .aab

    Hello. I was about to compile my game in .aab format for the first time for publishing on Google Play. However, I got a weird compilation error. I tried a lot of things, but the error never changed.

    Build R292.28
    Build API: 30 (no effect if changed to 29)
    Minimum Android version: 4.3 (no effect if changed to 5.0)
    Target Android version: 10.0
    Release mode activated
    My Keystore and the build file are at C:\
    Extensions.PNG

    I gave my mfa file to a friend to try to compile it on his computer and he didn’t have any compilation errors, the application compiled. After that I thought there was a problem with Android Studio on my computer and the Android SDK in it, but reinstalling it didn't change anything. Reinstalling CTF didn't help either.

    Here is my error log:

    Code:
    > Configure project :app
    WARNING: The option 'android.useDeprecatedNdk' is deprecated.
    The current default is 'false'.
    It has been removed from the current version of the Android Gradle plugin.
    NdkCompile is no longer supported
    
    > Task :app:preBuild UP-TO-DATE
    > Task :app:preReleaseBuild UP-TO-DATE
    > Task :app:compileReleaseRenderscript NO-SOURCE
    > Task :app:generateReleaseResValues
    > Task :app:generateReleaseResources
    > Task :app:createReleaseCompatibleScreenManifests
    > Task :app:extractDeepLinksRelease
    > Task :app:processReleaseManifest
    > Task :app:checkReleaseDuplicateClasses
    > Task :app:compileReleaseAidl NO-SOURCE
    > Task :app:generateReleaseBuildConfig
    > Task :app:javaPreCompileRelease
    > Task :app:mergeReleaseShaders
    > Task :app:compileReleaseShaders NO-SOURCE
    > Task :app:generateReleaseAssets UP-TO-DATE
    > Task :app:mergeReleaseAssets
    > Task :app:processReleaseJavaRes NO-SOURCE
    > Task :app:mergeReleaseJniLibFolders
    > Task :app:collectReleaseDependencies
    > Task :app:configureReleaseDependencies
    > Task :app:validateSigningRelease
    > Task :app:mergeReleaseResources
    > Task :app:processReleaseResources FAILED
    > Task :app:bundleReleaseResources FAILED
    > Task :app:mergeReleaseNativeLibs
    > Task :app:mergeReleaseJavaResource
    > Task :app:mergeExtDexRelease
    > Task :app:parseReleaseIntegrityConfig
    
    FAILURE: Build completed with 2 failures.
    
    1: Task failed with an exception.
    -----------
    * What went wrong:
    Execution failed for task ':app:processReleaseResources'.
    > A failure occurred while executing com.android.build.gradle.internal.tasks.Workers$ActionFacade
       > Android resource linking failed
         C:\Users\Rushan\AppData\Local\Temp\And2FD4.tmp\app\src\main\AndroidManifest.xml:41:3-42:36: AAPT: error: resource string/app_Id (aka ru.rushangames.thisgame:string/app_Id) not found.
             
    
    * Try:
    Run with --stacktrace option to get the stack trace. Run with --info or --debug option to get more log output. Run with --scan to get full insights.
    ==============================================================================
    
    2: Task failed with an exception.
    -----------
    * What went wrong:
    Execution failed for task ':app:bundleReleaseResources'.
    > A failure occurred while executing com.android.build.gradle.internal.tasks.Workers$ActionFacade
       > Android resource linking failed
         C:\Users\Rushan\AppData\Local\Temp\And2FD4.tmp\app\build\intermediates\bundle_manifest\release\bundle-manifest\AndroidManifest.xml:51: AAPT: error: resource string/app_Id (aka ru.rushangames.thisgame:string/app_Id) not found.
             
    
    * Try:
    Run with --stacktrace option to get the stack trace. Run with --info or --debug option to get more log output. Run with --scan to get full insights.
    ==============================================================================
    
    * Get more help at https://help.gradle.org
    
    BUILD FAILED in 3s
    20 actionable tasks: 20 executed

  2. #2
    Clicker Fusion 2.5 (Steam)Fusion 2.5 Developer (Steam)Fusion 2.5+ DLC (Steam)Android Export Module (Steam)HTML5 Export Module (Steam)iOS Export Module (Steam)
    janpier's Avatar
    Join Date
    Dec 2014
    Posts
    218
    Mentioned
    3 Post(s)
    Tagged
    0 Thread(s)
    it came out even unless this error, I don't think it's the first time, it happens when you add the Android Plus extension

  3. #3
    Clickteam Clickteam
    Fernando's Avatar
    Join Date
    Dec 2006
    Posts
    6,701
    Mentioned
    292 Post(s)
    Tagged
    4 Thread(s)
    @Rushan_Games , can you show me the Project Name you are using?
    @janpier why Android Plus is responsible for this error, any information?
    Regards,


    Fernando Vivolo

    ... new things are coming ...

  4. #4
    Clicker Fusion 2.5 (Steam)Fusion 2.5 Developer (Steam)Fusion 2.5+ DLC (Steam)Android Export Module (Steam)

    Join Date
    Jan 2017
    Location
    Russia, Nizhnekamsk
    Posts
    3
    Mentioned
    1 Post(s)
    Tagged
    0 Thread(s)
    Hello again. Excuse me for taking the time, because my problem was solved. I rolled back version 200a of Google Play Games objects to version 101j and there is no more compilation error!

  5. #5
    Clickteam Clickteam
    Fernando's Avatar
    Join Date
    Dec 2006
    Posts
    6,701
    Mentioned
    292 Post(s)
    Tagged
    4 Thread(s)
    and what version of fusion you are using?
    Regards,


    Fernando Vivolo

    ... new things are coming ...

  6. #6
    Clicker Fusion 2.5 (Steam)Fusion 2.5 Developer (Steam)Fusion 2.5+ DLC (Steam)Android Export Module (Steam)HTML5 Export Module (Steam)iOS Export Module (Steam)
    janpier's Avatar
    Join Date
    Dec 2014
    Posts
    218
    Mentioned
    3 Post(s)
    Tagged
    0 Thread(s)
    I just know that inserting the android plus object gives me an error while building the app. I have installed the latest v200 package and the version is 292.27. I don't think it is convenient to use the gpg 101 version, it could have problems

Similar Threads

  1. Error compiling in android exporter
    By Esa in forum Android Export Module 2.5
    Replies: 11
    Last Post: 22nd October 2017, 06:40 PM
  2. Error when compiling the apk
    By Tony_Blair in forum Android Export Module 2.5
    Replies: 2
    Last Post: 22nd July 2016, 03:52 PM
  3. error LLVM 5.1 when compiling
    By Wolkam in forum iOS Export Module 2.5
    Replies: 3
    Last Post: 25th June 2014, 09:19 AM
  4. error compiling...
    By Ahiru in forum iOS Export Module Version 2.0
    Replies: 9
    Last Post: 22nd January 2013, 08:10 PM
  5. Beta 22 - Compiling Error
    By Kisguri in forum Android Export Module Version 2.0
    Replies: 3
    Last Post: 13th March 2012, 05:05 PM

Posting Permissions

  • You may not post new threads
  • You may not post replies
  • You may not post attachments
  • You may not edit your posts
  •