User Tag List

Results 1 to 10 of 10

Thread: Android Exporter Failure (Clicktem Fusion 2.5)

  1. #1
    Clicker Fusion 2.5 (Steam)Fusion 2.5+ DLC (Steam)Android Export Module (Steam)

    Join Date
    Dec 2020
    Posts
    5
    Mentioned
    0 Post(s)
    Tagged
    0 Thread(s)

    Android Exporter Failure (Clicktem Fusion 2.5)

    Hello I am not able to compile the apk file in clickteamfusion 2.5. Help me please.

    Starting a Gradle Daemon, 1 incompatible and 1 stopped Daemons could not be reused, use --status for details

    > Configure project :app
    WARNING: The option 'android.useDeprecatedNdk' is deprecated.
    The current default is 'false'.
    It has been removed from the current version of the Android Gradle plugin.
    NdkCompile is no longer supported

    > Task :app:preBuild UP-TO-DATE
    > Task :app:preDebugBuild UP-TO-DATE
    > Task :app:compileDebugAidl NO-SOURCE
    > Task :app:compileDebugRenderscript NO-SOURCE
    > Task :app:generateDebugBuildConfig
    > Task :app:generateDebugResValues
    > Task :app:generateDebugResources
    > Task :app:javaPreCompileDebug
    > Task :app:createDebugCompatibleScreenManifests
    > Task :app:extractDeepLinksDebug
    > Task :app:processDebugManifest
    > Task :app:mergeDebugShaders
    > Task :app:compileDebugShaders NO-SOURCE
    > Task :app:generateDebugAssets UP-TO-DATE
    > Task :app:mergeDebugAssets
    > Task :app:processDebugJavaRes NO-SOURCE
    > Task :app:checkDebugDuplicateClasses
    > Task :app:mergeDebugJavaResource
    > Task :app:mergeDebugJniLibFolders
    > Task :app:mergeDebugResources
    > Task :app:processDebugResources

    > Task :app:compileDebugJavaWithJavac
    Note: Some input files use or override a deprecated API.
    Note: Recompile with -Xlint:deprecation for details.
    Note: Some input files use unchecked or unsafe operations.
    Note: Recompile with -Xlint:unchecked for details.

    > Task :app:compileDebugSources
    > Task :app:dexBuilderDebug
    > Task :app:validateSigningDebug
    > Task :app:mergeExtDexDebug
    > Task :app:mergeDebugNativeLibs
    > Task :app:stripDebugDebugSymbols FAILED
    > Task :app:mergeLibDexDebug
    > Task :app:mergeProjectDexDebug

    FAILURE: Build failed with an exception.

    * What went wrong:
    Execution failed for task ':app:stripDebugDebugSymbols'.
    > No version of NDK matched the requested version 21.0.6113669. Versions available locally: 22.0.7026061

    * Try:
    Run with --stacktrace option to get the stack trace. Run with --info or --debug option to get more log output. Run with --scan to get full insights.

    * Get more help at https://help.gradle.org

    BUILD FAILED in 19s
    21 actionable tasks: 21 executed

  2. #2
    Clickteam Clickteam

    Join Date
    Jun 2006
    Location
    France
    Posts
    13,997
    Mentioned
    279 Post(s)
    Tagged
    3 Thread(s)
    Did you follow the install instructions explained in this thread? https://community.clickteam.com/threads/105484-Android-Runtime-Build-292

  3. #3
    Clicker Fusion 2.5 (Steam)Fusion 2.5+ DLC (Steam)Android Export Module (Steam)

    Join Date
    Dec 2020
    Posts
    5
    Mentioned
    0 Post(s)
    Tagged
    0 Thread(s)
    Hi! Thanks for trying to help me!
    I just did "sdkmanager --licenses" 11.jpg

  4. #4

  5. #5
    Clicker Fusion 2.5 (Steam)Fusion 2.5+ DLC (Steam)Android Export Module (Steam)

    Join Date
    Dec 2020
    Posts
    5
    Mentioned
    0 Post(s)
    Tagged
    0 Thread(s)
    but the result is negative :

    > Configure project :app
    WARNING: The option 'android.useDeprecatedNdk' is deprecated.
    The current default is 'false'.
    It has been removed from the current version of the Android Gradle plugin.
    NdkCompile is no longer supported

    > Task :app:preBuild UP-TO-DATE
    > Task :app:preDebugBuild UP-TO-DATE
    > Task :app:compileDebugAidl NO-SOURCE
    > Task :app:compileDebugRenderscript NO-SOURCE
    > Task :app:generateDebugBuildConfig
    > Task :app:generateDebugResValues
    > Task :app:generateDebugResources
    > Task :app:createDebugCompatibleScreenManifests
    > Task :app:extractDeepLinksDebug
    > Task :app:processDebugManifest
    > Task :app:mergeDebugShaders
    > Task :app:compileDebugShaders NO-SOURCE
    > Task :app:generateDebugAssets UP-TO-DATE
    > Task :app:mergeDebugAssets
    > Task :app:processDebugJavaRes NO-SOURCE
    > Task :app:checkDebugDuplicateClasses
    > Task :app:mergeDebugResources
    > Task :app:processDebugResources
    > Task :app:mergeDebugJniLibFolders
    > Task :app:mergeExtDexDebug
    > Task :app:validateSigningDebug
    > Task :app:mergeDebugJavaResource
    > Task :app:javaPreCompileDebug

    > Task :app:compileDebugJavaWithJavac
    Note: Some input files use or override a deprecated API.
    Note: Recompile with -Xlint:deprecation for details.
    Note: Some input files use unchecked or unsafe operations.
    Note: Recompile with -Xlint:unchecked for details.

    > Task :app:compileDebugSources
    > Task :app:dexBuilderDebug
    > Task :app:mergeLibDexDebug
    > Task :app:mergeDebugNativeLibs
    > Task :app:stripDebugDebugSymbols FAILED
    > Task :app:mergeProjectDexDebug

    FAILURE: Build failed with an exception.

    * What went wrong:
    Execution failed for task ':app:stripDebugDebugSymbols'.
    > No version of NDK matched the requested version 21.0.6113669. Versions available locally: 22.0.7026061

    * Try:
    Run with --stacktrace option to get the stack trace. Run with --info or --debug option to get more log output. Run with --scan to get full insights.

    * Get more help at https://help.gradle.org

    BUILD FAILED in 18s
    21 actionable tasks: 21 executed

  6. #6
    Clickteam Clickteam
    Fernando's Avatar
    Join Date
    Dec 2006
    Posts
    6,771
    Mentioned
    298 Post(s)
    Tagged
    4 Thread(s)
    Hi,

    can you do me a favor, and uninstall the NDK side by side or any NDK installed and test to build.

    let me know your results
    Regards,


    Fernando Vivolo

    ... new things are coming ...

  7. #7
    Clicker Fusion 2.5 (Steam)Fusion 2.5+ DLC (Steam)Android Export Module (Steam)

    Join Date
    Dec 2020
    Posts
    5
    Mentioned
    0 Post(s)
    Tagged
    0 Thread(s)
    Yes , this is the solution to the problem!
    androidStudio-NDKdisabled.jpg
    The project is compiled to APK. Thank you very much, Fernando!

  8. #8
    Clickteam Clickteam
    Fernando's Avatar
    Join Date
    Dec 2006
    Posts
    6,771
    Mentioned
    298 Post(s)
    Tagged
    4 Thread(s)
    thanks for the info
    Regards,


    Fernando Vivolo

    ... new things are coming ...

  9. #9
    Clicker Android Export Module

    Join Date
    Nov 2020
    Posts
    2
    Mentioned
    0 Post(s)
    Tagged
    0 Thread(s)
    Hallo, I have similiar Problem. When I try to build my App I get this Massage:
    Buildfile: C:\Users\XXX\AppData\Local\Android\Sdk\And4A5E.tmp \build.xml

    BUILD FAILED
    C:\Users\XXX\AppData\Local\Android\Sdk\And4A5E.tmp \build.xml:83: Cannot find C:\Users\XXX\AppData\Local\Android\Sdk\tools\ant\b uild.xml imported from C:\Users\XXX\AppData\Local\Android\Sdk\And4A5E.tmp \build.xml

    Total time: 0 seconds
    I have Android Studio installed and I can on Virtual Device get my App.
    Best Regards

  10. #10
    Clickteam Clickteam
    Fernando's Avatar
    Join Date
    Dec 2006
    Posts
    6,771
    Mentioned
    298 Post(s)
    Tagged
    4 Thread(s)
    BUILD FAILED
    C:\Users\XXX\AppData\Local\Android\Sdk\And4A5E.tmp \build.xml:83: Cannot find C:\Users\XXX\AppData\Local\Android\Sdk\tools\ant\b uild.xml imported from C:\Users\XXX\AppData\Local\Android\Sdk\And4A5E.tmp \build.xml
    What version of fusion are you using, latest one?, try update patch
    Regards,


    Fernando Vivolo

    ... new things are coming ...

Similar Threads

  1. Android Exporter Failure (Clicktem Fusion 2.5)
    By Marcone in forum Android Export Module 2.5
    Replies: 23
    Last Post: 8th January 2021, 05:16 AM
  2. Android Exporter Building application failure.
    By OneOfLegends in forum Android Export Module 2.5
    Replies: 1
    Last Post: 10th April 2017, 04:25 AM
  3. Clickteam fusion android exporter
    By Csnorlax in forum Android Export Module 2.5
    Replies: 0
    Last Post: 11th June 2015, 02:12 PM
  4. New to Fusion 2.5 / Android Exporter
    By Spyhunter in forum Fusion 2.5
    Replies: 2
    Last Post: 23rd January 2014, 08:53 PM

Posting Permissions

  • You may not post new threads
  • You may not post replies
  • You may not post attachments
  • You may not edit your posts
  •