User Tag List

Results 1 to 2 of 2

Thread: Impossible to compile Android APK - Error

  1. #1
    Clicker Fusion 2.5 (Steam)Fusion 2.5 Developer (Steam)Android Export Module (Steam)HTML5 Export Module (Steam)iOS Export Module (Steam)Universal Windows Platform Export Module (Steam)
    Lecherbault's Avatar
    Join Date
    Jul 2016
    Posts
    184
    Mentioned
    9 Post(s)
    Tagged
    0 Thread(s)

    Impossible to compile Android APK - Error

    I cannot compile my program to apk.
    Please help me.
    I have always this error:

    > Configure project :app
    WARNING: The option 'android.useDeprecatedNdk' is deprecated.
    The current default is 'false'.
    It has been removed from the current version of the Android Gradle plugin.
    NdkCompile is no longer supported

    > Task :app:preBuild UP-TO-DATE
    > Task :app:preReleaseBuild UP-TO-DATE
    > Task :app:compileReleaseAidl NO-SOURCE
    > Task :app:compileReleaseRenderscript NO-SOURCE
    > Task :app:generateReleaseBuildConfig
    > Task :app:generateReleaseResValues
    > Task :app:generateReleaseResources
    > Task :app:createReleaseCompatibleScreenManifests
    > Task :app:javaPreCompileRelease
    > Task :app:extractDeepLinksRelease
    > Task :app:processReleaseManifest
    > Task :app:checkReleaseDuplicateClasses
    > Task :app:mergeReleaseShaders
    > Task :app:compileReleaseShaders NO-SOURCE
    > Task :app:generateReleaseAssets UP-TO-DATE
    > Task :app:mergeReleaseAssets
    > Task :app:processReleaseJavaRes NO-SOURCE
    > Task :app:mergeReleaseResources
    > Task :app:processReleaseResources

    > Task :app:compileReleaseJavaWithJavac
    Note: Some input files use or override a deprecated API.
    Note: Recompile with -Xlint:deprecation for details.
    Note: Some input files use unchecked or unsafe operations.
    Note: Recompile with -Xlint:unchecked for details.

    > Task :app:compileReleaseSources
    > Task :app:dexBuilderRelease
    > Task :app:collectReleaseDependencies
    > Task :app:sdkReleaseDependencyData
    > Task :app:mergeReleaseJniLibFolders
    > Task :app:validateSigningRelease
    > Task :app:mergeExtDexRelease
    > Task :app:mergeReleaseJavaResource
    > Task :app:mergeReleaseNativeLibs

    > Task :app:stripReleaseDebugSymbols
    WARNING: Compatible side by side NDK version was not found. Default is 21.0.6113669.
    Compatible side by side NDK version was not found. Default is 21.0.6113669.
    Unable to strip the following libraries, packaging them as they are: libES1Renderer.so, libES2Renderer.so, libES3Renderer.so, libRuntimeNative.so, libc++_shared.so, libgdx.so, libiconv.so, libzbarjni.so.

    > Task :app:mergeDexRelease
    > Task :app:packageRelease FAILED

    FAILURE: Build failed with an exception.

    * What went wrong:
    Execution failed for task ':app:packageRelease'.
    > A failure occurred while executing com.android.build.gradle.internal.tasks.Workers$Ac tionFacade
    > com.android.ide.common.signing.KeytoolException: Failed to read key turf from store "C:\keyturf.keystore": Keystore was tampered with, or password was incorrect

    * Try:
    Run with --stacktrace option to get the stack trace. Run with --info or --debug option to get more log output. Run with --scan to get full insights.

    * Get more help at https://help.gradle.org

    BUILD FAILED in 12s
    23 actionable tasks: 23 executed

  2. #2
    Clicker

    Fusion 2.5 MacFusion 2.5 DeveloperFusion 2.5+ DLCAndroid Export ModuleHTML5 Export ModuleiOS Export ModuleSWF Export ModuleUnicode Add-onInstall Creator Pro
    StingRay's Avatar
    Join Date
    Nov 2006
    Location
    Austria
    Posts
    1,061
    Mentioned
    7 Post(s)
    Tagged
    0 Thread(s)
    Seems there is a problem with your keystore? May wrong password set? (Release Mode)

Similar Threads

  1. Replies: 2
    Last Post: 20th March 2017, 12:22 PM
  2. Error at compile apk
    By tiger19 in forum Android Export Module 2.5
    Replies: 3
    Last Post: 1st October 2015, 07:30 PM
  3. Compile error
    By Perry in forum Android Export Module 2.5
    Replies: 2
    Last Post: 10th July 2014, 02:06 PM
  4. Error Impossible to save the ios Project
    By sinister in forum iOS Export Module Version 2.0
    Replies: 3
    Last Post: 28th August 2011, 10:49 AM

Posting Permissions

  • You may not post new threads
  • You may not post replies
  • You may not post attachments
  • You may not edit your posts
  •