User Tag List

Page 50 of 98 FirstFirst ... 40 48 49 50 51 52 60 ... LastLast
Results 491 to 500 of 972

Thread: Build 293.10 - Release version

  1. #491
    Clicker Fusion 2.5 (Steam)Fusion 2.5 Developer (Steam)Fusion 2.5+ DLC (Steam)Android Export Module (Steam)HTML5 Export Module (Steam)
    GKProduction's Avatar
    Join Date
    Aug 2017
    Location
    Russia, Krasnodar
    Posts
    162
    Mentioned
    8 Post(s)
    Tagged
    0 Thread(s)

    Exclamation

    Quote Originally Posted by haoujey View Post
    Use target 11 and api 30. 12 and 31 are not yet supported.
    Still got an error

    I think the reason is count of extension, because I tried build empty app with little count of extensions (on API 31 and target version 12), and build was succeful

    Code:
    Starting a Gradle Daemon, 2 incompatible and 1 stopped Daemons could not be reused, use --status for details
    Warning: Mapping new ns http://schemas.android.com/repository/android/common/02 to old ns http://schemas.android.com/repository/android/common/01
    Warning: Mapping new ns http://schemas.android.com/repository/android/generic/02 to old ns http://schemas.android.com/repository/android/generic/01
    Warning: Mapping new ns http://schemas.android.com/sdk/android/repo/addon2/02 to old ns http://schemas.android.com/sdk/android/repo/addon2/01
    Warning: Mapping new ns http://schemas.android.com/sdk/android/repo/repository2/02 to old ns http://schemas.android.com/sdk/android/repo/repository2/01
    Warning: Mapping new ns http://schemas.android.com/sdk/android/repo/sys-img2/02 to old ns http://schemas.android.com/sdk/android/repo/sys-img2/01
    > Task :app:preBuild UP-TO-DATE
    > Task :app:preDebugBuild UP-TO-DATE
    > Task :app:compileDebugRenderscript NO-SOURCE
    > Task :app:generateDebugResValues
    > Task :app:generateDebugResources
    > Task :app:createDebugCompatibleScreenManifests
    > Task :app:extractDeepLinksDebug
    > Task :app:mergeDebugResources
    > Task :app:processDebugMainManifest
    > Task :app:processDebugManifest
    > Task :app:processApplicationManifestDebugForBundle
    > Task :app:mergeDebugShaders
    > Task :app:compileDebugShaders NO-SOURCE
    > Task :app:generateDebugAssets UP-TO-DATE
    > Task :app:mergeDebugAssets
    > Task :app:processDebugJavaRes NO-SOURCE
    > Task :app:compileDebugAidl NO-SOURCE
    > Task :app:generateDebugBuildConfig
    > Task :app:javaPreCompileDebug
    > Task :app:checkDebugDuplicateClasses
    > Task :app:checkDebugAarMetadata
    > Task :app:processDebugManifestForPackage
    > Task :app:bundleDebugResources
    > Task :app:mergeDebugJniLibFolders
    > Task :app:mergeDebugJavaResource
    > Task :app:parseDebugIntegrityConfig
    > Task :app:writeDebugAppMetadata
    > Task :app:desugarDebugFileDependencies
    > Task :app:mergeDebugNativeLibs
    > Task :app:processDebugResources
    > Task :app:mergeExtDexDebug
    
    > Task :app:compileDebugJavaWithJavac
    Note: Some input files use or override a deprecated API.
    Note: Recompile with -Xlint:deprecation for details.
    Note: Some input files use unchecked or unsafe operations.
    Note: Recompile with -Xlint:unchecked for details.
    
    > Task :app:dexBuilderDebug
    
    > Task :app:stripDebugDebugSymbols
    Unable to strip the following libraries, packaging them as they are: libES1Renderer.so, libES2Renderer.so, libES3Renderer.so, libRuntimeNative.so, libgdx.so.
    
    > Task :app:mergeDexDebug
    ERROR:: D8: Cannot fit requested classes in a single dex file (# methods: 68171 > 65536)
    com.android.builder.dexing.DexArchiveMergerException: Error while merging dex archives: 
    The number of method references in a .dex file cannot exceed 64K.
    Learn how to resolve this issue at https://developer.android.com/tools/building/multidex.html
    	at com.android.builder.dexing.D8DexArchiveMerger.getExceptionToRethrow(D8DexArchiveMerger.java:128)
    	at com.android.builder.dexing.D8DexArchiveMerger.mergeDexArchives(D8DexArchiveMerger.java:115)
    	at com.android.build.gradle.internal.transforms.DexMergerTransformCallable.call(DexMergerTransformCallable.java:111)
    	at com.android.build.gradle.internal.tasks.DexMergingWorkAction.merge(DexMergingTask.kt:805)
    	at com.android.build.gradle.internal.tasks.DexMergingWorkAction.run(DexMergingTask.kt:760)
    	at com.android.build.gradle.internal.profile.ProfileAwareWorkAction.execute(ProfileAwareWorkAction.kt:74)
    	at org.gradle.workers.internal.DefaultWorkerServer.execute(DefaultWorkerServer.java:63)
    	at org.gradle.workers.internal.NoIsolationWorkerFactory$1$1.create(NoIsolationWorkerFactory.java:66)
    	at org.gradle.workers.internal.NoIsolationWorkerFactory$1$1.create(NoIsolationWorkerFactory.java:62)
    	at org.gradle.internal.classloader.ClassLoaderUtils.executeInClassloader(ClassLoaderUtils.java:97)
    	at org.gradle.workers.internal.NoIsolationWorkerFactory$1.lambda$execute$0(NoIsolationWorkerFactory.java:62)
    	at org.gradle.workers.internal.AbstractWorker$1.call(AbstractWorker.java:44)
    	at org.gradle.workers.internal.AbstractWorker$1.call(AbstractWorker.java:41)
    	at org.gradle.internal.operations.DefaultBuildOperationRunner$CallableBuildOperationWorker.execute(DefaultBuildOperationRunner.java:200)
    	at org.gradle.internal.operations.DefaultBuildOperationRunner$CallableBuildOperationWorker.execute(DefaultBuildOperationRunner.java:195)
    	at org.gradle.internal.operations.DefaultBuildOperationRunner$3.execute(DefaultBuildOperationRunner.java:75)
    	at org.gradle.internal.operations.DefaultBuildOperationRunner$3.execute(DefaultBuildOperationRunner.java:68)
    	at org.gradle.internal.operations.DefaultBuildOperationRunner.execute(DefaultBuildOperationRunner.java:153)
    	at org.gradle.internal.operations.DefaultBuildOperationRunner.execute(DefaultBuildOperationRunner.java:68)
    	at org.gradle.internal.operations.DefaultBuildOperationRunner.call(DefaultBuildOperationRunner.java:62)
    	at org.gradle.internal.operations.DefaultBuildOperationExecutor.lambda$call$2(DefaultBuildOperationExecutor.java:76)
    	at org.gradle.internal.operations.UnmanagedBuildOperationWrapper.callWithUnmanagedSupport(UnmanagedBuildOperationWrapper.java:54)
    	at org.gradle.internal.operations.DefaultBuildOperationExecutor.call(DefaultBuildOperationExecutor.java:76)
    	at org.gradle.workers.internal.AbstractWorker.executeWrappedInBuildOperation(AbstractWorker.java:41)
    	at org.gradle.workers.internal.NoIsolationWorkerFactory$1.execute(NoIsolationWorkerFactory.java:59)
    	at org.gradle.workers.internal.DefaultWorkerExecutor.lambda$submitWork$2(DefaultWorkerExecutor.java:206)
    	at java.base/java.util.concurrent.FutureTask.run(FutureTask.java:264)
    	at org.gradle.internal.work.DefaultConditionalExecutionQueue$ExecutionRunner.runExecution(DefaultConditionalExecutionQueue.java:214)
    	at org.gradle.internal.work.DefaultConditionalExecutionQueue$ExecutionRunner.runBatch(DefaultConditionalExecutionQueue.java:164)
    	at org.gradle.internal.work.DefaultConditionalExecutionQueue$ExecutionRunner.run(DefaultConditionalExecutionQueue.java:131)
    	at java.base/java.util.concurrent.Executors$RunnableAdapter.call(Executors.java:515)
    	at java.base/java.util.concurrent.FutureTask.run(FutureTask.java:264)
    	at org.gradle.internal.concurrent.ExecutorPolicy$CatchAndRecordFailures.onExecute(ExecutorPolicy.java:64)
    	at org.gradle.internal.concurrent.ManagedExecutorImpl$1.run(ManagedExecutorImpl.java:48)
    	at java.base/java.util.concurrent.ThreadPoolExecutor.runWorker(ThreadPoolExecutor.java:1128)
    	at java.base/java.util.concurrent.ThreadPoolExecutor$Worker.run(ThreadPoolExecutor.java:628)
    	at org.gradle.internal.concurrent.ThreadFactoryImpl$ManagedThreadRunnable.run(ThreadFactoryImpl.java:56)
    	at java.base/java.lang.Thread.run(Thread.java:834)
    Caused by: com.android.tools.r8.CompilationFailedException: Compilation failed to complete, position: null
    	at Version.fakeStackEntry(Version_2.2.71.java:0)
    	at com.android.tools.r8.utils.a0.a(SourceFile:89)
    	at com.android.tools.r8.D8.run(D8.java:11)
    	at com.android.builder.dexing.D8DexArchiveMerger.mergeDexArchives(D8DexArchiveMerger.java:113)
    	... 36 more
    Caused by: com.android.tools.r8.utils.b: Cannot fit requested classes in a single dex file (# methods: 68171 > 65536)
    	at com.android.tools.r8.utils.V0.a(SourceFile:22)
    	at com.android.tools.r8.utils.V0.a(SourceFile:25)
    	at com.android.tools.r8.dex.P.a(SourceFile:55)
    	at com.android.tools.r8.dex.P$h.a(SourceFile:7)
    	at com.android.tools.r8.dex.b.a(SourceFile:14)
    	at com.android.tools.r8.dex.b.c(SourceFile:30)
    	at com.android.tools.r8.D8.d(D8.java:163)
    	at com.android.tools.r8.D8.b(D8.java:1)
    	at com.android.tools.r8.utils.a0.a(SourceFile:47)
    	... 38 more
    
    
    > Task :app:mergeDexDebug FAILED
    
    FAILURE: Build failed with an exception.
    
    * What went wrong:
    Execution failed for task ':app:mergeDexDebug'.
    > A failure occurred while executing com.android.build.gradle.internal.tasks.DexMergingTaskDelegate
       > There was a failure while executing work items
          > A failure occurred while executing com.android.build.gradle.internal.tasks.DexMergingWorkAction
             > com.android.builder.dexing.DexArchiveMergerException: Error while merging dex archives: 
               The number of method references in a .dex file cannot exceed 64K.
               Learn how to resolve this issue at https://developer.android.com/tools/building/multidex.html
    
    * Try:
    Run with --stacktrace option to get the stack trace. Run with --info or --debug option to get more log output. Run with --scan to get full insights.
    
    * Get more help at https://help.gradle.org
    
    BUILD FAILED in 2m 43s
    27 actionable tasks: 27 executed

  2. #492
    Clickteam Clickteam
    Fernando's Avatar
    Join Date
    Dec 2006
    Posts
    7,399
    Mentioned
    298 Post(s)
    Tagged
    4 Thread(s)
    if you read the report it clearly mention that the problem is because you have more than 64K methods which is the max allow in a non multidex application, for this you need to add multidex feature, something that is under testing , let me finish this week this for you, so you can try in this project.


    com.android.builder.dexing.DexArchiveMergerExcepti on: Error while merging dex archives: The number of method references in a .dex file cannot exceed 64K. Learn how to resolve this issue at https://developer.android.com/tools/.../multidex.html
    Regards,


    Fernando Vivolo

    ... new things are coming ...

  3. #493
    Clicker

    Fusion 2.5 DeveloperFusion 2.5+ DLCAndroid Export ModuleiOS Export ModuleInstall Creator
    SirEatAlot's Avatar
    Join Date
    Oct 2010
    Location
    Stockholm, Sweden
    Posts
    450
    Mentioned
    5 Post(s)
    Tagged
    0 Thread(s)
    I've got a crashing test application with the latest build.

    Been trying to pin down some problems with mouse presses not registering correctly when running app as exe and started doing a simple test application.

    After copying over some events from my game the test application just crashes. Even after removing the events that caused the crash, the application still crashes on startup every time (At least for me).

    crashing test app.mfa

  4. #494
    Clicker

    Fusion 2.5 DeveloperFusion 2.5+ DLCAndroid Export ModuleiOS Export ModuleInstall Creator
    SirEatAlot's Avatar
    Join Date
    Oct 2010
    Location
    Stockholm, Sweden
    Posts
    450
    Mentioned
    5 Post(s)
    Tagged
    0 Thread(s)
    seem to have found at least one of the crashing actions: "move behind object with qualifier" that was copied from another app, seems some reference is missing maybe..

    crash move behind.mfa

  5. #495
    Clicker Fusion 2.5 (Steam)Fusion 2.5 Developer (Steam)Fusion 2.5+ DLC (Steam)Android Export Module (Steam)HTML5 Export Module (Steam)
    GKProduction's Avatar
    Join Date
    Aug 2017
    Location
    Russia, Krasnodar
    Posts
    162
    Mentioned
    8 Post(s)
    Tagged
    0 Thread(s)

    Exclamation Space is ignored by Direct3D 11

    I have tasks list, where every new line (task) have a few spaces before the task text. Tasks list is one string object.

    If display mode is Direct3D 11, spaces is ignored on some lines.

    Direct3D 9:
    2021-11-01_21-34-56.png

    Direct3D 11:
    2021-11-01_21-36-16.png

  6. #496
    Clickteam Clickteam
    Fernando's Avatar
    Join Date
    Dec 2006
    Posts
    7,399
    Mentioned
    298 Post(s)
    Tagged
    4 Thread(s)
    @GKProduction can you please post here what are the MIN, BUILD and TARGET API you have set there in the 64K error
    Regards,


    Fernando Vivolo

    ... new things are coming ...

  7. #497
    Clicker Fusion 2.5 (Steam)Fusion 2.5 Developer (Steam)Fusion 2.5+ DLC (Steam)Android Export Module (Steam)HTML5 Export Module (Steam)
    GKProduction's Avatar
    Join Date
    Aug 2017
    Location
    Russia, Krasnodar
    Posts
    162
    Mentioned
    8 Post(s)
    Tagged
    0 Thread(s)
    Quote Originally Posted by Fernando View Post
    @GKProduction can you please post here what are the MIN, BUILD and TARGET API you have set there in the 64K error
    Minimum version 4.4, target version 12, API 31

    But also I tried to build app with target version 11 and API 30

  8. #498
    Clickteam Clickteam
    Fernando's Avatar
    Join Date
    Dec 2006
    Posts
    7,399
    Mentioned
    298 Post(s)
    Tagged
    4 Thread(s)
    yes the secret is to set MIN API 21 and then you may use the multidex feature, try and let me know
    Regards,


    Fernando Vivolo

    ... new things are coming ...

  9. #499
    Clicker Fusion 2.5 (Steam)Fusion 2.5 Developer (Steam)Fusion 2.5+ DLC (Steam)Android Export Module (Steam)HTML5 Export Module (Steam)
    GKProduction's Avatar
    Join Date
    Aug 2017
    Location
    Russia, Krasnodar
    Posts
    162
    Mentioned
    8 Post(s)
    Tagged
    0 Thread(s)
    Quote Originally Posted by Fernando View Post
    yes the secret is to set MIN API 21 and then you may use the multidex feature, try and let me know
    Okay, I set minimum version to 5.0, and build was succeful

  10. #500
    Clicker Install Creator Pro
    Fusion 2.5 (Steam)Fusion 2.5 Developer (Steam)Fusion 2.5+ DLC (Steam)Android Export Module (Steam)HTML5 Export Module (Steam)iOS Export Module (Steam)Universal Windows Platform Export Module (Steam)Firefly 3D Module (Steam)
    defisym's Avatar
    Join Date
    Jun 2017
    Location
    Asia
    Posts
    509
    Mentioned
    12 Post(s)
    Tagged
    0 Thread(s)
    Quote Originally Posted by GKProduction View Post
    I have tasks list, where every new line (task) have a few spaces before the task text. Tasks list is one string object.

    If display mode is Direct3D 11, spaces is ignored on some lines.

    Direct3D 9:
    2021-11-01_21-34-56.png

    Direct3D 11:
    2021-11-01_21-36-16.png
    this is an old issue since the first day of the release of DX 11 runtime

    https://community.clickteam.com/threads/108496-Bug-Some-character-in-the-beginning-of-the-string-will-be-ignored-under-DX11?p=768750&viewfull=1#post768750

    Yves fixed part of this issue in several versions before, and he knows this, hopefully this will be fixed in the next update.

    https://community.clickteam.com/threads/108737-Build-293-9-Beta-version?p=769759&viewfull=1#post769759


    I'll check it for a future update. A little boring to do as it's deep inside external code.

Page 50 of 98 FirstFirst ... 40 48 49 50 51 52 60 ... LastLast

Similar Threads

  1. Build 292.11 - Beta version
    By Yves in forum Fusion 2.5
    Replies: 63
    Last Post: 30th August 2019, 04:16 PM
  2. Build 288.0 - Beta version
    By Yves in forum Fusion 2.5
    Replies: 43
    Last Post: 25th February 2017, 06:21 PM
  3. Build 287.1 - beta version
    By Yves in forum Fusion 2.5
    Replies: 21
    Last Post: 23rd July 2016, 02:40 PM
  4. Build 285.1 - Beta version
    By Yves in forum Fusion 2.5
    Replies: 122
    Last Post: 8th April 2016, 08:21 PM
  5. Build 284.2 - beta version
    By Yves in forum Fusion 2.5
    Replies: 89
    Last Post: 17th April 2015, 04:41 PM

Posting Permissions

  • You may not post new threads
  • You may not post replies
  • You may not post attachments
  • You may not edit your posts
  •