User Tag List

Page 66 of 92 FirstFirst ... 16 56 64 65 66 67 68 76 ... LastLast
Results 651 to 660 of 914

Thread: Build 293.10 - Release version

  1. #651
    Clicker Fusion 2.5 DeveloperAndroid Export ModuleiOS Export Module
    VBEinc's Avatar
    Join Date
    Oct 2015
    Posts
    496
    Mentioned
    12 Post(s)
    Tagged
    0 Thread(s)
    Running into an issue now.

    Worked fine before I had to reinstall Fusion on my computer. However, now I get this.

    > Task :app:preBuild UP-TO-DATE> Task :app:preReleaseBuild UP-TO-DATE
    > Task :app:compileReleaseAidl NO-SOURCE
    > Task :app:compileReleaseRenderscript NO-SOURCE
    > Task :app:generateReleaseBuildConfig
    > Task :app:javaPreCompileRelease
    > Task :app:writeReleaseApplicationId
    > Task :app:analyticsRecordingRelease
    > Task :app:generateReleaseResValues
    > Task :app:generateReleaseResources
    > Task :app:checkReleaseAarMetadata
    > Task :app:createReleaseCompatibleScreenManifests
    > Task :app:extractDeepLinksRelease
    > Task :app:processReleaseMainManifest
    > Task :app:processReleaseManifest
    > Task :app:mergeReleaseJniLibFolders
    > Task :app:mergeReleaseShaders
    > Task :app:compileReleaseShaders NO-SOURCE
    > Task :app:generateReleaseAssets UP-TO-DATE
    > Task :app:mergeReleaseResources
    > Task :app:mergeReleaseAssets
    > Task :app:compressReleaseAssets
    > Task :app:processReleaseManifestForPackage
    > Task :app:checkReleaseDuplicateClasses
    > Task :app:processReleaseJavaRes NO-SOURCE
    > Task :app:desugarReleaseFileDependencies
    > Task :app:mergeReleaseNativeLibs
    > Task :app:mergeReleaseJavaResource
    aapt2.exe W 01-20 01:32:13 7532 9540 LoadedArsc.cpp:682] Unknown chunk type '200'.


    > Task :app:processReleaseResources
    > Task :app:mergeExtDexRelease


    > Task :app:compileReleaseJavaWithJavac FAILED
    An exception has occurred in the compiler (1.8.0_221). Please file a bug against the Java compiler via the Java bug reporting page (http://bugreport.java.com) after checking the Bug Database (http://bugs.java.com) for duplicates. Include your program and the following diagnostic in your report. Thank you.
    java.lang.AssertionError: annotationType(): unrecognized Attribute name MODULE (class com.sun.tools.javac.util.UnsharedNameTable$NameImp l)
    at com.sun.tools.javac.util.Assert.error(Assert.java: 133)
    at com.sun.tools.javac.code.TypeAnnotations.annotatio nType(TypeAnnotations.java:231)
    at com.sun.tools.javac.code.TypeAnnotations$TypeAnnot ationPositions.separateAnnotationsKinds(TypeAnnota tions.java:294)
    at com.sun.tools.javac.code.TypeAnnotations$TypeAnnot ationPositions.visitMethodDef(TypeAnnotations.java :1066)
    at com.sun.tools.javac.tree.JCTree$JCMethodDecl.accep t(JCTree.java:778)
    at com.sun.tools.javac.tree.TreeScanner.scan(TreeScan ner.java:49)
    at com.sun.tools.javac.code.TypeAnnotations$TypeAnnot ationPositions.scan(TypeAnnotations.java:275)
    at com.sun.tools.javac.tree.TreeScanner.scan(TreeScan ner.java:57)
    at com.sun.tools.javac.code.TypeAnnotations$TypeAnnot ationPositions.visitClassDef(TypeAnnotations.java: 1042)
    at com.sun.tools.javac.tree.JCTree$JCClassDecl.accept (JCTree.java:693)
    at com.sun.tools.javac.tree.TreeScanner.scan(TreeScan ner.java:49)
    at com.sun.tools.javac.code.TypeAnnotations$TypeAnnot ationPositions.scan(TypeAnnotations.java:275)
    at com.sun.tools.javac.code.TypeAnnotations$1.run(Typ eAnnotations.java:127)
    at com.sun.tools.javac.comp.Annotate.flush(Annotate.j ava:152)
    at com.sun.tools.javac.comp.Annotate.enterDone(Annota te.java:129)
    at com.sun.tools.javac.comp.Enter.complete(Enter.java :512)
    at com.sun.tools.javac.comp.Enter.main(Enter.java:471 )
    at com.sun.tools.javac.main.JavaCompiler.enterTrees(J avaCompiler.java:982)
    at com.sun.tools.javac.main.JavaCompiler.compile(Java Compiler.java:857)
    at com.sun.tools.javac.main.Main.compile(Main.java:52 3)
    at com.sun.tools.javac.api.JavacTaskImpl.doCall(Javac TaskImpl.java:129)
    at com.sun.tools.javac.api.JavacTaskImpl.call(JavacTa skImpl.java:138)
    at org.gradle.internal.compiler.java.IncrementalCompi leTask.call(IncrementalCompileTask.java:77)
    at org.gradle.api.internal.tasks.compile.AnnotationPr ocessingCompileTask.call(AnnotationProcessingCompi leTask.java:94)
    at org.gradle.api.internal.tasks.compile.ResourceClea ningCompilationTask.call(ResourceCleaningCompilati onTask.java:57)
    at org.gradle.api.internal.tasks.compile.JdkJavaCompi ler.execute(JdkJavaCompiler.java:55)
    at org.gradle.api.internal.tasks.compile.JdkJavaCompi ler.execute(JdkJavaCompiler.java:40)
    at org.gradle.api.internal.tasks.compile.NormalizingJ avaCompiler.delegateAndHandleErrors(NormalizingJav aCompiler.java:97)
    at org.gradle.api.internal.tasks.compile.NormalizingJ avaCompiler.execute(NormalizingJavaCompiler.java:5 1)
    at org.gradle.api.internal.tasks.compile.NormalizingJ avaCompiler.execute(NormalizingJavaCompiler.java:3 7)
    at org.gradle.api.internal.tasks.compile.AnnotationPr ocessorDiscoveringCompiler.execute(AnnotationProce ssorDiscoveringCompiler.java:51)
    at org.gradle.api.internal.tasks.compile.AnnotationPr ocessorDiscoveringCompiler.execute(AnnotationProce ssorDiscoveringCompiler.java:37)
    at org.gradle.api.internal.tasks.compile.ModuleApplic ationNameWritingCompiler.execute(ModuleApplication NameWritingCompiler.java:46)
    at org.gradle.api.internal.tasks.compile.ModuleApplic ationNameWritingCompiler.execute(ModuleApplication NameWritingCompiler.java:36)
    at org.gradle.jvm.toolchain.internal.DefaultToolchain JavaCompiler.execute(DefaultToolchainJavaCompiler. java:57)
    at org.gradle.api.tasks.compile.JavaCompile.lambda$cr eateToolchainCompiler$1(JavaCompile.java:251)
    at org.gradle.api.internal.tasks.compile.CleaningJava Compiler.execute(CleaningJavaCompiler.java:53)
    at org.gradle.api.internal.tasks.compile.incremental. IncrementalCompilerFactory.lambda$createRebuildAll Compiler$0(IncrementalCompilerFactory.java:98)
    at org.gradle.api.internal.tasks.compile.incremental. IncrementalResultStoringCompiler.execute(Increment alResultStoringCompiler.java:61)
    at org.gradle.api.internal.tasks.compile.incremental. IncrementalResultStoringCompiler.execute(Increment alResultStoringCompiler.java:45)
    at org.gradle.api.internal.tasks.compile.CompileJavaB uildOperationReportingCompiler$2.call(CompileJavaB uildOperationReportingCompiler.java:59)
    at org.gradle.api.internal.tasks.compile.CompileJavaB uildOperationReportingCompiler$2.call(CompileJavaB uildOperationReportingCompiler.java:51)
    at org.gradle.internal.operations.DefaultBuildOperati onRunner$CallableBuildOperationWorker.execute(Defa ultBuildOperationRunner.java:200)
    at org.gradle.internal.operations.DefaultBuildOperati onRunner$CallableBuildOperationWorker.execute(Defa ultBuildOperationRunner.java:195)
    at org.gradle.internal.operations.DefaultBuildOperati onRunner$3.execute(DefaultBuildOperationRunner.jav a:75)
    at org.gradle.internal.operations.DefaultBuildOperati onRunner$3.execute(DefaultBuildOperationRunner.jav a:68)
    at org.gradle.internal.operations.DefaultBuildOperati onRunner.execute(DefaultBuildOperationRunner.java: 153)
    at org.gradle.internal.operations.DefaultBuildOperati onRunner.execute(DefaultBuildOperationRunner.java: 68)
    at org.gradle.internal.operations.DefaultBuildOperati onRunner.call(DefaultBuildOperationRunner.java:62)
    at org.gradle.internal.operations.DefaultBuildOperati onExecutor.lambda$call$2(DefaultBuildOperationExec utor.java:76)
    at org.gradle.internal.operations.UnmanagedBuildOpera tionWrapper.callWithUnmanagedSupport(UnmanagedBuil dOperationWrapper.java:54)
    at org.gradle.internal.operations.DefaultBuildOperati onExecutor.call(DefaultBuildOperationExecutor.java :76)
    at org.gradle.api.internal.tasks.compile.CompileJavaB uildOperationReportingCompiler.execute(CompileJava BuildOperationReportingCompiler.java:51)
    at org.gradle.api.tasks.compile.JavaCompile.performCo mpilation(JavaCompile.java:300)
    at org.gradle.api.tasks.compile.JavaCompile.performIn crementalCompilation(JavaCompile.java:179)
    at org.gradle.api.tasks.compile.JavaCompile.compile(J avaCompile.java:152)
    at sun.reflect.NativeMethodAccessorImpl.invoke0(Nativ e Method)
    at sun.reflect.NativeMethodAccessorImpl.invoke(Native MethodAccessorImpl.java:62)
    at sun.reflect.DelegatingMethodAccessorImpl.invoke(De legatingMethodAccessorImpl.java:43)
    at java.lang.reflect.Method.invoke(Method.java:498)
    at org.gradle.internal.reflect.JavaMethod.invoke(Java Method.java:104)
    at org.gradle.api.internal.project.taskfactory.Increm entalInputsTaskAction.doExecute(IncrementalInputsT askAction.java:32)
    at org.gradle.api.internal.project.taskfactory.Standa rdTaskAction.execute(StandardTaskAction.java:51)
    at org.gradle.api.internal.project.taskfactory.Abstra ctIncrementalTaskAction.execute(AbstractIncrementa lTaskAction.java:25)
    at org.gradle.api.internal.project.taskfactory.Standa rdTaskAction.execute(StandardTaskAction.java:29)
    at org.gradle.api.internal.tasks.execution.ExecuteAct ionsTaskExecuter$2.run(ExecuteActionsTaskExecuter. java:498)
    at org.gradle.internal.operations.DefaultBuildOperati onRunner$1.execute(DefaultBuildOperationRunner.jav a:29)
    at org.gradle.internal.operations.DefaultBuildOperati onRunner$1.execute(DefaultBuildOperationRunner.jav a:26)
    at org.gradle.internal.operations.DefaultBuildOperati onRunner$3.execute(DefaultBuildOperationRunner.jav a:75)
    at org.gradle.internal.operations.DefaultBuildOperati onRunner$3.execute(DefaultBuildOperationRunner.jav a:68)
    at org.gradle.internal.operations.DefaultBuildOperati onRunner.execute(DefaultBuildOperationRunner.java: 153)
    at org.gradle.internal.operations.DefaultBuildOperati onRunner.execute(DefaultBuildOperationRunner.java: 68)
    at org.gradle.internal.operations.DefaultBuildOperati onRunner.run(DefaultBuildOperationRunner.java:56)
    at org.gradle.internal.operations.DefaultBuildOperati onExecutor.lambda$run$1(DefaultBuildOperationExecu tor.java:71)
    at org.gradle.internal.operations.UnmanagedBuildOpera tionWrapper.runWithUnmanagedSupport(UnmanagedBuild OperationWrapper.java:45)
    at org.gradle.internal.operations.DefaultBuildOperati onExecutor.run(DefaultBuildOperationExecutor.java: 71)
    at org.gradle.api.internal.tasks.execution.ExecuteAct ionsTaskExecuter.executeAction(ExecuteActionsTaskE xecuter.java:483)
    at org.gradle.api.internal.tasks.execution.ExecuteAct ionsTaskExecuter.executeActions(ExecuteActionsTask Executer.java:466)
    at org.gradle.api.internal.tasks.execution.ExecuteAct ionsTaskExecuter.access$300(ExecuteActionsTaskExec uter.java:105)
    at org.gradle.api.internal.tasks.execution.ExecuteAct ionsTaskExecuter$TaskExecution.executeWithPrevious OutputFiles(ExecuteActionsTaskExecuter.java:270)
    at org.gradle.api.internal.tasks.execution.ExecuteAct ionsTaskExecuter$TaskExecution.execute(ExecuteActi onsTaskExecuter.java:248)
    at org.gradle.internal.execution.steps.ExecuteStep.ex ecuteInternal(ExecuteStep.java:83)
    at org.gradle.internal.execution.steps.ExecuteStep.ac cess$000(ExecuteStep.java:37)
    at org.gradle.internal.execution.steps.ExecuteStep$1. call(ExecuteStep.java:50)
    at org.gradle.internal.execution.steps.ExecuteStep$1. call(ExecuteStep.java:47)
    at org.gradle.internal.operations.DefaultBuildOperati onRunner$CallableBuildOperationWorker.execute(Defa ultBuildOperationRunner.java:200)
    at org.gradle.internal.operations.DefaultBuildOperati onRunner$CallableBuildOperationWorker.execute(Defa ultBuildOperationRunner.java:195)
    at org.gradle.internal.operations.DefaultBuildOperati onRunner$3.execute(DefaultBuildOperationRunner.jav a:75)
    at org.gradle.internal.operations.DefaultBuildOperati onRunner$3.execute(DefaultBuildOperationRunner.jav a:68)
    at org.gradle.internal.operations.DefaultBuildOperati onRunner.execute(DefaultBuildOperationRunner.java: 153)
    at org.gradle.internal.operations.DefaultBuildOperati onRunner.execute(DefaultBuildOperationRunner.java: 68)
    at org.gradle.internal.operations.DefaultBuildOperati onRunner.call(DefaultBuildOperationRunner.java:62)
    at org.gradle.internal.operations.DefaultBuildOperati onExecutor.lambda$call$2(DefaultBuildOperationExec utor.java:76)
    at org.gradle.internal.operations.UnmanagedBuildOpera tionWrapper.callWithUnmanagedSupport(UnmanagedBuil dOperationWrapper.java:54)
    at org.gradle.internal.operations.DefaultBuildOperati onExecutor.call(DefaultBuildOperationExecutor.java :76)
    at org.gradle.internal.execution.steps.ExecuteStep.ex ecute(ExecuteStep.java:47)
    at org.gradle.internal.execution.steps.ExecuteStep.ex ecute(ExecuteStep.java:37)
    at org.gradle.internal.execution.steps.RemovePrevious OutputsStep.execute(RemovePreviousOutputsStep.java :68)
    at org.gradle.internal.execution.steps.RemovePrevious OutputsStep.execute(RemovePreviousOutputsStep.java :38)
    at org.gradle.internal.execution.steps.ResolveInputCh angesStep.execute(ResolveInputChangesStep.java:50)
    at org.gradle.internal.execution.steps.ResolveInputCh angesStep.execute(ResolveInputChangesStep.java:36)
    at org.gradle.internal.execution.steps.CancelExecutio nStep.execute(CancelExecutionStep.java:41)
    at org.gradle.internal.execution.steps.TimeoutStep.ex ecuteWithoutTimeout(TimeoutStep.java:74)
    at org.gradle.internal.execution.steps.TimeoutStep.ex ecute(TimeoutStep.java:55)
    at org.gradle.internal.execution.steps.CreateOutputsS tep.execute(CreateOutputsStep.java:51)
    at org.gradle.internal.execution.steps.CreateOutputsS tep.execute(CreateOutputsStep.java:29)
    at org.gradle.internal.execution.steps.CaptureStateAf terExecutionStep.execute(CaptureStateAfterExecutio nStep.java:54)
    at org.gradle.internal.execution.steps.CaptureStateAf terExecutionStep.execute(CaptureStateAfterExecutio nStep.java:35)
    at org.gradle.internal.execution.steps.BroadcastChang ingOutputsStep.execute(BroadcastChangingOutputsSte p.java:60)
    at org.gradle.internal.execution.steps.BroadcastChang ingOutputsStep.execute(BroadcastChangingOutputsSte p.java:27)
    at org.gradle.internal.execution.steps.BuildCacheStep .executeWithoutCache(BuildCacheStep.java:174)
    at org.gradle.internal.execution.steps.BuildCacheStep .execute(BuildCacheStep.java:74)
    at org.gradle.internal.execution.steps.BuildCacheStep .execute(BuildCacheStep.java:45)
    at org.gradle.internal.execution.steps.StoreExecution StateStep.execute(StoreExecutionStateStep.java:40)
    at org.gradle.internal.execution.steps.StoreExecution StateStep.execute(StoreExecutionStateStep.java:29)
    at org.gradle.internal.execution.steps.RecordOutputsS tep.execute(RecordOutputsStep.java:36)
    at org.gradle.internal.execution.steps.RecordOutputsS tep.execute(RecordOutputsStep.java:22)
    at org.gradle.internal.execution.steps.SkipUpToDateSt ep.executeBecause(SkipUpToDateStep.java:99)
    at org.gradle.internal.execution.steps.SkipUpToDateSt ep.lambda$execute$0(SkipUpToDateStep.java:92)
    at java.util.Optional.map(Optional.java:215)
    at org.gradle.internal.execution.steps.SkipUpToDateSt ep.execute(SkipUpToDateStep.java:52)
    at org.gradle.internal.execution.steps.SkipUpToDateSt ep.execute(SkipUpToDateStep.java:36)
    at org.gradle.internal.execution.steps.ResolveChanges Step.execute(ResolveChangesStep.java:84)
    at org.gradle.internal.execution.steps.ResolveChanges Step.execute(ResolveChangesStep.java:41)
    at org.gradle.internal.execution.steps.legacy.MarkSna pshottingInputsFinishedStep.execute(MarkSnapshotti ngInputsFinishedStep.java:37)
    at org.gradle.internal.execution.steps.legacy.MarkSna pshottingInputsFinishedStep.execute(MarkSnapshotti ngInputsFinishedStep.java:27)
    at org.gradle.internal.execution.steps.ResolveCaching StateStep.execute(ResolveCachingStateStep.java:91)
    at org.gradle.internal.execution.steps.ResolveCaching StateStep.execute(ResolveCachingStateStep.java:49)
    at org.gradle.internal.execution.steps.CaptureStateBe foreExecutionStep.execute(CaptureStateBeforeExecut ionStep.java:78)
    at org.gradle.internal.execution.steps.CaptureStateBe foreExecutionStep.execute(CaptureStateBeforeExecut ionStep.java:49)
    at org.gradle.internal.execution.steps.ValidateStep.e xecute(ValidateStep.java:105)
    at org.gradle.internal.execution.steps.ValidateStep.e xecute(ValidateStep.java:50)
    at org.gradle.internal.execution.steps.SkipEmptyWorkS tep.lambda$execute$2(SkipEmptyWorkStep.java:86)
    at java.util.Optional.orElseGet(Optional.java:267)
    at org.gradle.internal.execution.steps.SkipEmptyWorkS tep.execute(SkipEmptyWorkStep.java:86)
    at org.gradle.internal.execution.steps.SkipEmptyWorkS tep.execute(SkipEmptyWorkStep.java:32)
    at org.gradle.internal.execution.steps.legacy.MarkSna pshottingInputsStartedStep.execute(MarkSnapshottin gInputsStartedStep.java:38)
    at org.gradle.internal.execution.steps.LoadExecutionS tateStep.execute(LoadExecutionStateStep.java:43)
    at org.gradle.internal.execution.steps.LoadExecutionS tateStep.execute(LoadExecutionStateStep.java:31)
    at org.gradle.internal.execution.steps.AssignWorkspac eStep.lambda$execute$0(AssignWorkspaceStep.java:40 )
    at org.gradle.api.internal.tasks.execution.ExecuteAct ionsTaskExecuter$TaskExecution$2.withWorkspace(Exe cuteActionsTaskExecuter.java:283)
    at org.gradle.internal.execution.steps.AssignWorkspac eStep.execute(AssignWorkspaceStep.java:40)
    at org.gradle.internal.execution.steps.AssignWorkspac eStep.execute(AssignWorkspaceStep.java:30)
    at org.gradle.internal.execution.steps.IdentityCacheS tep.execute(IdentityCacheStep.java:37)
    at org.gradle.internal.execution.steps.IdentityCacheS tep.execute(IdentityCacheStep.java:27)
    at org.gradle.internal.execution.steps.IdentifyStep.e xecute(IdentifyStep.java:49)
    at org.gradle.internal.execution.steps.IdentifyStep.e xecute(IdentifyStep.java:35)
    at org.gradle.internal.execution.impl.DefaultExecutio nEngine$1.execute(DefaultExecutionEngine.java:76)
    at org.gradle.api.internal.tasks.execution.ExecuteAct ionsTaskExecuter.executeIfValid(ExecuteActionsTask Executer.java:184)
    at org.gradle.api.internal.tasks.execution.ExecuteAct ionsTaskExecuter.execute(ExecuteActionsTaskExecute r.java:173)
    at org.gradle.api.internal.tasks.execution.CleanupSta leOutputsExecuter.execute(CleanupStaleOutputsExecu ter.java:109)
    at org.gradle.api.internal.tasks.execution.FinalizePr opertiesTaskExecuter.execute(FinalizePropertiesTas kExecuter.java:46)
    at org.gradle.api.internal.tasks.execution.ResolveTas kExecutionModeExecuter.execute(ResolveTaskExecutio nModeExecuter.java:51)
    at org.gradle.api.internal.tasks.execution.SkipTaskWi thNoActionsExecuter.execute(SkipTaskWithNoActionsE xecuter.java:57)
    at org.gradle.api.internal.tasks.execution.SkipOnlyIf TaskExecuter.execute(SkipOnlyIfTaskExecuter.java:5 6)
    at org.gradle.api.internal.tasks.execution.CatchExcep tionTaskExecuter.execute(CatchExceptionTaskExecute r.java:36)
    at org.gradle.api.internal.tasks.execution.EventFirin gTaskExecuter$1.executeTask(EventFiringTaskExecute r.java:77)
    at org.gradle.api.internal.tasks.execution.EventFirin gTaskExecuter$1.call(EventFiringTaskExecuter.java: 55)
    at org.gradle.api.internal.tasks.execution.EventFirin gTaskExecuter$1.call(EventFiringTaskExecuter.java: 52)
    at org.gradle.internal.operations.DefaultBuildOperati onRunner$CallableBuildOperationWorker.execute(Defa ultBuildOperationRunner.java:200)
    at org.gradle.internal.operations.DefaultBuildOperati onRunner$CallableBuildOperationWorker.execute(Defa ultBuildOperationRunner.java:195)
    at org.gradle.internal.operations.DefaultBuildOperati onRunner$3.execute(DefaultBuildOperationRunner.jav a:75)
    at org.gradle.internal.operations.DefaultBuildOperati onRunner$3.execute(DefaultBuildOperationRunner.jav a:68)
    at org.gradle.internal.operations.DefaultBuildOperati onRunner.execute(DefaultBuildOperationRunner.java: 153)
    at org.gradle.internal.operations.DefaultBuildOperati onRunner.execute(DefaultBuildOperationRunner.java: 68)
    at org.gradle.internal.operations.DefaultBuildOperati onRunner.call(DefaultBuildOperationRunner.java:62)
    at org.gradle.internal.operations.DefaultBuildOperati onExecutor.lambda$call$2(DefaultBuildOperationExec utor.java:76)
    at org.gradle.internal.operations.UnmanagedBuildOpera tionWrapper.callWithUnmanagedSupport(UnmanagedBuil dOperationWrapper.java:54)
    at org.gradle.internal.operations.DefaultBuildOperati onExecutor.call(DefaultBuildOperationExecutor.java :76)
    at org.gradle.api.internal.tasks.execution.EventFirin gTaskExecuter.execute(EventFiringTaskExecuter.java :52)
    at org.gradle.execution.plan.LocalTaskNodeExecutor.ex ecute(LocalTaskNodeExecutor.java:74)
    at org.gradle.execution.taskgraph.DefaultTaskExecutio nGraph$InvokeNodeExecutorsAction.execute(DefaultTa skExecutionGraph.java:408)
    at org.gradle.execution.taskgraph.DefaultTaskExecutio nGraph$InvokeNodeExecutorsAction.execute(DefaultTa skExecutionGraph.java:395)
    at org.gradle.execution.taskgraph.DefaultTaskExecutio nGraph$BuildOperationAwareExecutionAction.execute( DefaultTaskExecutionGraph.java:388)
    at org.gradle.execution.taskgraph.DefaultTaskExecutio nGraph$BuildOperationAwareExecutionAction.execute( DefaultTaskExecutionGraph.java:374)
    at org.gradle.execution.plan.DefaultPlanExecutor$Exec utorWorker.lambda$run$0(DefaultPlanExecutor.java:1 27)
    at org.gradle.execution.plan.DefaultPlanExecutor$Exec utorWorker.execute(DefaultPlanExecutor.java:191)
    at org.gradle.execution.plan.DefaultPlanExecutor$Exec utorWorker.executeNextNode(DefaultPlanExecutor.jav a:182)
    at org.gradle.execution.plan.DefaultPlanExecutor$Exec utorWorker.run(DefaultPlanExecutor.java:124)
    at org.gradle.internal.concurrent.ExecutorPolicy$Catc hAndRecordFailures.onExecute(ExecutorPolicy.java:6 4)
    at org.gradle.internal.concurrent.ManagedExecutorImpl $1.run(ManagedExecutorImpl.java:48)
    at java.util.concurrent.ThreadPoolExecutor.runWorker( ThreadPoolExecutor.java:1149)
    at java.util.concurrent.ThreadPoolExecutor$Worker.run (ThreadPoolExecutor.java:624)
    at org.gradle.internal.concurrent.ThreadFactoryImpl$M anagedThreadRunnable.run(ThreadFactoryImpl.java:56 )
    at java.lang.Thread.run(Thread.java:748)


    FAILURE: Build failed with an exception.


    * What went wrong:
    Execution failed for task ':app:compileReleaseJavaWithJavac'.
    > Compilation failed; see the compiler error output for details.


    * Try:
    Run with --stacktrace option to get the stack trace. Run with --info or --debug option to get more log output. Run with --scan to get full insights.


    * Get more help at https://help.gradle.org


    BUILD FAILED in 16s
    23 actionable tasks: 23 executed


  2. #652
    Clicker Fusion 2.5 DeveloperAndroid Export ModuleiOS Export Module
    VBEinc's Avatar
    Join Date
    Oct 2015
    Posts
    496
    Mentioned
    12 Post(s)
    Tagged
    0 Thread(s)

  3. #653
    Clickteam Clickteam

    Join Date
    Jun 2006
    Location
    France
    Posts
    14,384
    Mentioned
    279 Post(s)
    Tagged
    3 Thread(s)
    Quote Originally Posted by SHINBAXTER View Post
    Yves were you able to reproduce the spritesheet box mode export/import issue mfa i sent you, as it is still present in the last 2 builds.
    No sorry, apparently I didn't download your MFA. I'll fix it.

  4. #654
    Clickteam Clickteam

    Join Date
    Jun 2006
    Location
    France
    Posts
    14,384
    Mentioned
    279 Post(s)
    Tagged
    3 Thread(s)
    Quote Originally Posted by defisym View Post
    Talking about the global objects, now only actives can sync settings over frames. However there are some limitations, hopes global object's sync could be split into different parts, e.g., only sync alterable values & only sync animations or display/runtime settings. For example, I have a megbox object, which should share the same UI over frames, but it will display different stuff in different sub systems (e.g., skill info or item info), so the alterable values are different, which stops me setting them global, and need to modify each object when I need to tweak UI.
    BTW, maybe it's impossible in 2.5, can we set extension to "global" and sync it's settings & alterable values over frame? If I have some basic extensions in each frame, it's a bit annoying to sync the settings manually.
    I'll check if the current system could work with this option.

  5. #655
    Clickteam Clickteam

    Join Date
    Jun 2006
    Location
    France
    Posts
    14,384
    Mentioned
    279 Post(s)
    Tagged
    3 Thread(s)
    Quote Originally Posted by AndyH View Post
    Hope F3 is going well. As others I would love to be able to use it. As for F2.5, I have suggested this before but I don't remember if the answer was it was too difficult or not worth adding as F3 was coming out with support? This is a workaround but if it could be possible it would solve the problem for active objects.

    Create objects from Global Event editor
    Could you allow the creation of objects in the Global event editor even if the current frame it runs from does not have that object?

    When you try to create an active object from the global event editor, the action will only be performed if the frame already has that object. If it does not then no object is created. In contrast, when you create an object in a Frames Event editor you can pick objects from other frames to create and the action will work.

    If I can create objects in the same way from the global event editor I can easily bring in game objects from my template frame to all of my game frames.

    The workflow for the developer would be:
    1. Create a frame to use as the template
    2. Create all the active objects in this frame, with global and behaviour events.
    3. Create many frames as my game frames ensuring the Global Event editor is enabled for them
    4. In the global event editor add the actions to create each global active object, picked from my template frame.
    5. All the game frames that use the global event editor would now create the objects when the frame starts.
    6. When I need to add a new game frame, I just create the frame as normal with the global event editor enabled, the objects are created automatically when the frame starts.


    Template objects (parent and child)

    Another idea I have had is a template 'parent' object. This object has a list in its properties. In this list you add active objects from a frame (pick them like you would in the Create event action).

    Then create a 'child' template object. The property of this object is to specify the name of a parent template object. When the frame runs, the child template object would query the named parent and bring all the objects into the frame to use.

    The advantage would be I would only need to add one child template object to every frame in my game and I can update the parent template object to add or remove objects as needed during development. Furthermore, I could create several parent template objects and chose which ones to use in any given frame.
    Hey Andy, thanks.

    Tons of possible solutions.

    Actually I'm going to experiment real frame templates, last night I thought of a possible not-so-difficult solution.

  6. #656
    Forum Moderator Fusion 2.5 DeveloperFusion 2.5+ DLCAndroid Export ModuleHTML5 Export ModuleiOS Export ModuleMac Export ModuleSWF Export Module
    AndyH's Avatar
    Join Date
    Jun 2006
    Location
    UK
    Posts
    1,454
    Mentioned
    1 Post(s)
    Tagged
    0 Thread(s)
    Quote Originally Posted by Yves View Post
    Hey Andy, thanks.

    Tons of possible solutions.

    Actually I'm going to experiment real frame templates, last night I thought of a possible not-so-difficult solution.
    Sounds exciting! Fusion is still at the top of my all time most favourite applications. Anything that helps with centralising development in this way would be most welcome.

    Happy new year BTW, hope you and all Clickers are well.

  7. #657
    Clicker Fusion 2.5 (Steam)Fusion 2.5 Developer (Steam)Fusion 2.5+ DLC (Steam)Android Export Module (Steam)HTML5 Export Module (Steam)iOS Export Module (Steam)Universal Windows Platform Export Module (Steam)
    Volnaiskra's Avatar
    Join Date
    Jan 2014
    Location
    www.sprykegame.com
    Posts
    2,846
    Mentioned
    133 Post(s)
    Tagged
    0 Thread(s)
    Quote Originally Posted by piscesdreams View Post
    Maybe I misunderstood. I was under the impression this was to have objects available in the frame library/event editor so they didn't have to be copy/pasted to every frame, not necessarily loaded into the runtime at the start. If that were the case, then yeah, I definitely agree about potential bugs and resource waste.

    Selecting multiple objects is fine in almost all cases, just draw a box, change your option and boom - done. But what I meant is if someone is retroactively activating this for their existing frames. It'd be tedious to find every object and click if they're not in a "pool" area outside of the playfield. If I were to have to go back and click on every object I wanted to activate this option for in my level, it'd be a whole BUNCH of clicking. My tiles are broken down into chunks and I can have hundreds of tiles alone for backdrops, let alone sprites. That's why I like the idea of an option to manually force all objects as global. But only if this is strictly for carrying over the objects to other frame/event libraries and doesn't automatically load them into memory at runtime.
    Perhaps I'm the one who misunderstood. What you're describing (something that allows us to create an object - on demand rather than automatically - regardless whether it exists in the frame editor of the current frame) sounds really nice actually.

    I'm looking forward to seeing what Yves comes up with.

  8. #658
    Clicker Fusion 2.5HTML5 Export ModuleFirefly 3D Module
    Minimus's Avatar
    Join Date
    Mar 2015
    Posts
    8
    Mentioned
    0 Post(s)
    Tagged
    0 Thread(s)
    option for unpacked EXE is a great change

  9. #659
    Clicker

    Fusion 2.5 DeveloperAndroid Export ModuleHTML5 Export ModuleiOS Export ModuleSWF Export ModuleXNA Export ModuleUnicode Add-on
    Fusion 2.5 (Steam)
    ASD's Avatar
    Join Date
    Feb 2007
    Location
    Japan
    Posts
    1,873
    Mentioned
    11 Post(s)
    Tagged
    1 Thread(s)
    BUG?
    I think current build of the CF2.5(293.10) canot load the UTF-8N ini file even if UTF8 option of the ini object is checked.

  10. #660
    Clickteam Clickteam

    Join Date
    Jun 2006
    Location
    France
    Posts
    14,384
    Mentioned
    279 Post(s)
    Tagged
    3 Thread(s)
    Quote Originally Posted by ASD View Post
    BUG?
    I think current build of the CF2.5(293.10) canot load the UTF-8N ini file even if UTF8 option of the ini object is checked.
    Works fine here and there was no change in this part of code. Make sure the INI file has no BOM (byte-order-mark) at the beginning.

Page 66 of 92 FirstFirst ... 16 56 64 65 66 67 68 76 ... LastLast

Similar Threads

  1. Build 292.11 - Beta version
    By Yves in forum Fusion 2.5
    Replies: 63
    Last Post: 30th August 2019, 04:16 PM
  2. Build 288.0 - Beta version
    By Yves in forum Fusion 2.5
    Replies: 43
    Last Post: 25th February 2017, 06:21 PM
  3. Build 287.1 - beta version
    By Yves in forum Fusion 2.5
    Replies: 21
    Last Post: 23rd July 2016, 02:40 PM
  4. Build 285.1 - Beta version
    By Yves in forum Fusion 2.5
    Replies: 122
    Last Post: 8th April 2016, 08:21 PM
  5. Build 284.2 - beta version
    By Yves in forum Fusion 2.5
    Replies: 89
    Last Post: 17th April 2015, 04:41 PM

Posting Permissions

  • You may not post new threads
  • You may not post replies
  • You may not post attachments
  • You may not edit your posts
  •