User Tag List

Page 4 of 48 FirstFirst ... 2 3 4 5 6 14 ... LastLast
Results 31 to 40 of 474

Thread: Build 293.9 - Beta version

  1. #31
    Clicker Fusion 2.5 (Steam)
    Linky's Avatar
    Join Date
    Mar 2020
    Location
    Egypt
    Posts
    111
    Mentioned
    0 Post(s)
    Tagged
    0 Thread(s)

    Exclamation Event list editor scrolling bug

    This is not specific to this build as it happens in previous builds too anyways the problem is when I do some eventing in the event list editor like opening/ closing grouping, moving event or deleting them, basically the normal stuff done in that editor it randomly clamps to an area when I try to scroll up even if there is more content left, I really don't know what specifically causes it but it basically happens very randomly and very frequently, the only fix to it is to quit that editor and return to it again but that resets undo / redo data

  2. #32
    Clicker Fusion 2.5 DeveloperFusion 2.5+ DLCAndroid Export ModuleHTML5 Export ModuleiOS Export ModuleUniversal Windows Platform Export ModuleXNA Export Module
    Dobermann's Avatar
    Join Date
    Feb 2009
    Location
    France
    Posts
    884
    Mentioned
    38 Post(s)
    Tagged
    0 Thread(s)
    It seems there is a mistake in Android In-App object with new security strings.

    If i select Profile ID or Account ID, it will show "account profile ID" and "obfuscate profile ID" instead (i guess) of "obfuscate account ID" and "obfuscate profile ID".
    Sans titre.png

  3. #33
    Clicker Fusion 2.5 DeveloperFusion 2.5+ DLCAndroid Export ModuleHTML5 Export ModuleiOS Export ModuleUniversal Windows Platform Export ModuleXNA Export Module
    Dobermann's Avatar
    Join Date
    Feb 2009
    Location
    France
    Posts
    884
    Mentioned
    38 Post(s)
    Tagged
    0 Thread(s)
    I'm also unable to compile my app for android, got this error message:

    Code:
    Downloading https://services.gradle.org/distributions/gradle-6.7.1-all.zip
    ...........................................................................................................................................
    Unzipping C:\Users\willb\.gradle\wrapper\dists\gradle-6.7.1-all\2moa8rlfac5eqlcfgk98k0deb\gradle-6.7.1-all.zip to C:\Users\willb\.gradle\wrapper\dists\gradle-6.7.1-all\2moa8rlfac5eqlcfgk98k0deb
    
    Welcome to Gradle 6.7.1!
    
    Here are the highlights of this release:
     - File system watching is ready for production use
     - Declare the version of Java your build requires
     - Java 15 support
    
    For more details see https://docs.gradle.org/6.7.1/release-notes.html
    
    Starting a Gradle Daemon (subsequent builds will be faster)
    WARNING:: Please remove usages of `jcenter()` Maven repository from your build scripts and migrate your build to other Maven repositories.
    This repository is deprecated and it will be shut down in the future.
    See http://developer.android.com/r/tools/jcenter-end-of-service for more information.
    Currently detected usages in: root project 'And3210.tmp', project ':app'
    File C:\Users\willb\.android\repositories.cfg could not be loaded.
    Checking the license for package Android SDK Build-Tools 30.0.2 in C:\Users\willb\AppData\Local\Android\Sdk\licenses
    License for package Android SDK Build-Tools 30.0.2 accepted.
    Preparing "Install Android SDK Build-Tools 30.0.2 (revision: 30.0.2)".
    "Install Android SDK Build-Tools 30.0.2 (revision: 30.0.2)" ready.
    Installing Android SDK Build-Tools 30.0.2 in C:\Users\willb\AppData\Local\Android\Sdk\build-tools\30.0.2
    "Install Android SDK Build-Tools 30.0.2 (revision: 30.0.2)" complete.
    "Install Android SDK Build-Tools 30.0.2 (revision: 30.0.2)" finished.
    > Task :app:preBuild UP-TO-DATE
    > Task :app:preReleaseBuild UP-TO-DATE
    > Task :app:compileReleaseAidl NO-SOURCE
    > Task :app:compileReleaseRenderscript NO-SOURCE
    > Task :app:generateReleaseBuildConfig
    > Task :app:javaPreCompileRelease
    > Task :app:writeReleaseApplicationId
    > Task :app:analyticsRecordingRelease
    > Task :app:generateReleaseResValues
    > Task :app:checkReleaseAarMetadata
    > Task :app:generateReleaseResources
    > Task :app:createReleaseCompatibleScreenManifests
    > Task :app:extractDeepLinksRelease
    > Task :app:processReleaseMainManifest
    > Task :app:mergeReleaseResources
    > Task :app:processReleaseManifest
    > Task :app:mergeReleaseJniLibFolders
    > Task :app:mergeReleaseShaders
    > Task :app:compileReleaseShaders NO-SOURCE
    > Task :app:generateReleaseAssets UP-TO-DATE
    > Task :app:mergeReleaseAssets
    > Task :app:compressReleaseAssets
    > Task :app:checkReleaseDuplicateClasses
    > Task :app:mergeReleaseNativeLibs
    
    > Task :app:stripReleaseDebugSymbols
    Unable to strip the following libraries, packaging them as they are: libES1Renderer.so, libES2Renderer.so, libES3Renderer.so, libRuntimeNative.so, libgdx.so.
    
    > Task :app:processReleaseJavaRes NO-SOURCE
    
    > Task :app:extractReleaseNativeSymbolTables
    Unable to extract native debug metadata from C:\Users\willb\AppData\Local\Temp\And3210.tmp\app\build\intermediates\merged_native_libs\release\out\lib\arm64-v8a\libES1Renderer.so because unable to locate the objcopy executable for the arm64-v8a ABI.
    Unable to extract native debug metadata from C:\Users\willb\AppData\Local\Temp\And3210.tmp\app\build\intermediates\merged_native_libs\release\out\lib\arm64-v8a\libES2Renderer.so because unable to locate the objcopy executable for the arm64-v8a ABI.
    Unable to extract native debug metadata from C:\Users\willb\AppData\Local\Temp\And3210.tmp\app\build\intermediates\merged_native_libs\release\out\lib\arm64-v8a\libES3Renderer.so because unable to locate the objcopy executable for the arm64-v8a ABI.
    Unable to extract native debug metadata from C:\Users\willb\AppData\Local\Temp\And3210.tmp\app\build\intermediates\merged_native_libs\release\out\lib\arm64-v8a\libgdx.so because unable to locate the objcopy executable for the arm64-v8a ABI.
    Unable to extract native debug metadata from C:\Users\willb\AppData\Local\Temp\And3210.tmp\app\build\intermediates\merged_native_libs\release\out\lib\arm64-v8a\libRuntimeNative.so because unable to locate the objcopy executable for the arm64-v8a ABI.
    Unable to extract native debug metadata from C:\Users\willb\AppData\Local\Temp\And3210.tmp\app\build\intermediates\merged_native_libs\release\out\lib\armeabi-v7a\libES1Renderer.so because unable to locate the objcopy executable for the armeabi-v7a ABI.
    Unable to extract native debug metadata from C:\Users\willb\AppData\Local\Temp\And3210.tmp\app\build\intermediates\merged_native_libs\release\out\lib\armeabi-v7a\libES2Renderer.so because unable to locate the objcopy executable for the armeabi-v7a ABI.
    Unable to extract native debug metadata from C:\Users\willb\AppData\Local\Temp\And3210.tmp\app\build\intermediates\merged_native_libs\release\out\lib\armeabi-v7a\libES3Renderer.so because unable to locate the objcopy executable for the armeabi-v7a ABI.
    Unable to extract native debug metadata from C:\Users\willb\AppData\Local\Temp\And3210.tmp\app\build\intermediates\merged_native_libs\release\out\lib\armeabi-v7a\libgdx.so because unable to locate the objcopy executable for the armeabi-v7a ABI.
    Unable to extract native debug metadata from C:\Users\willb\AppData\Local\Temp\And3210.tmp\app\build\intermediates\merged_native_libs\release\out\lib\armeabi-v7a\libRuntimeNative.so because unable to locate the objcopy executable for the armeabi-v7a ABI.
    Unable to extract native debug metadata from C:\Users\willb\AppData\Local\Temp\And3210.tmp\app\build\intermediates\merged_native_libs\release\out\lib\x86\libES1Renderer.so because unable to locate the objcopy executable for the x86 ABI.
    Unable to extract native debug metadata from C:\Users\willb\AppData\Local\Temp\And3210.tmp\app\build\intermediates\merged_native_libs\release\out\lib\x86\libES2Renderer.so because unable to locate the objcopy executable for the x86 ABI.
    Unable to extract native debug metadata from C:\Users\willb\AppData\Local\Temp\And3210.tmp\app\build\intermediates\merged_native_libs\release\out\lib\x86\libES3Renderer.so because unable to locate the objcopy executable for the x86 ABI.
    Unable to extract native debug metadata from C:\Users\willb\AppData\Local\Temp\And3210.tmp\app\build\intermediates\merged_native_libs\release\out\lib\x86\libgdx.so because unable to locate the objcopy executable for the x86 ABI.
    Unable to extract native debug metadata from C:\Users\willb\AppData\Local\Temp\And3210.tmp\app\build\intermediates\merged_native_libs\release\out\lib\x86\libRuntimeNative.so because unable to locate the objcopy executable for the x86 ABI.
    Unable to extract native debug metadata from C:\Users\willb\AppData\Local\Temp\And3210.tmp\app\build\intermediates\merged_native_libs\release\out\lib\x86_64\libES1Renderer.so because unable to locate the objcopy executable for the x86_64 ABI.
    Unable to extract native debug metadata from C:\Users\willb\AppData\Local\Temp\And3210.tmp\app\build\intermediates\merged_native_libs\release\out\lib\x86_64\libES2Renderer.so because unable to locate the objcopy executable for the x86_64 ABI.
    Unable to extract native debug metadata from C:\Users\willb\AppData\Local\Temp\And3210.tmp\app\build\intermediates\merged_native_libs\release\out\lib\x86_64\libES3Renderer.so because unable to locate the objcopy executable for the x86_64 ABI.
    Unable to extract native debug metadata from C:\Users\willb\AppData\Local\Temp\And3210.tmp\app\build\intermediates\merged_native_libs\release\out\lib\x86_64\libgdx.so because unable to locate the objcopy executable for the x86_64 ABI.
    Unable to extract native debug metadata from C:\Users\willb\AppData\Local\Temp\And3210.tmp\app\build\intermediates\merged_native_libs\release\out\lib\x86_64\libRuntimeNative.so because unable to locate the objcopy executable for the x86_64 ABI.
    
    > Task :app:mergeReleaseNativeDebugMetadata NO-SOURCE
    > Task :app:collectReleaseDependencies
    > Task :app:sdkReleaseDependencyData
    > Task :app:validateSigningRelease
    > Task :app:writeReleaseAppMetadata
    > Task :app:writeReleaseSigningConfigVersions
    > Task :app:processReleaseManifestForPackage
    > Task :app:desugarReleaseFileDependencies
    > Task :app:mergeReleaseJavaResource
    > Task :app:processReleaseResources
    > Task :app:mergeExtDexRelease
    
    > Task :app:compileReleaseJavaWithJavac
    C:\Users\willb\AppData\Local\Temp\And3210.tmp\app\src\main\java\Extensions\BaseGameActivity.java:21: error: cannot find symbol
    import android.support.v4.app.FragmentActivity;
                                 ^
      symbol:   class FragmentActivity
      location: package android.support.v4.app
    C:\Users\willb\AppData\Local\Temp\And3210.tmp\app\src\main\java\Extensions\BaseGameActivity.java:43: error: cannot find symbol
    public abstract class BaseGameActivity extends FragmentActivity implements
                                                   ^
      symbol: class FragmentActivity
    C:\Users\willb\AppData\Local\Temp\And3210.tmp\app\src\main\java\Extensions\BaseGameActivity.java:93: error: incompatible types: BaseGameActivity cannot be converted to Activity
                mHelper = new GameHelper(this, mRequestedClients);
                                         ^
    C:\Users\willb\AppData\Local\Temp\And3210.tmp\app\src\main\java\Extensions\BaseGameActivity.java:99: error: method does not override or implement a method from a supertype
        @Override
        ^
    C:\Users\willb\AppData\Local\Temp\And3210.tmp\app\src\main\java\Extensions\BaseGameActivity.java:101: error: cannot find symbol
            super.onCreate(b);
            ^
      symbol:   variable super
      location: class BaseGameActivity
    C:\Users\willb\AppData\Local\Temp\And3210.tmp\app\src\main\java\Extensions\BaseGameActivity.java:108: error: method does not override or implement a method from a supertype
        @Override
        ^
    C:\Users\willb\AppData\Local\Temp\And3210.tmp\app\src\main\java\Extensions\BaseGameActivity.java:110: error: cannot find symbol
            super.onStart();
            ^
      symbol:   variable super
      location: class BaseGameActivity
    C:\Users\willb\AppData\Local\Temp\And3210.tmp\app\src\main\java\Extensions\BaseGameActivity.java:111: error: incompatible types: BaseGameActivity cannot be converted to Activity
            mHelper.onStart(this);
                            ^
    C:\Users\willb\AppData\Local\Temp\And3210.tmp\app\src\main\java\Extensions\BaseGameActivity.java:114: error: method does not override or implement a method from a supertype
        @Override
        ^
    C:\Users\willb\AppData\Local\Temp\And3210.tmp\app\src\main\java\Extensions\BaseGameActivity.java:116: error: cannot find symbol
            super.onStop();
            ^
      symbol:   variable super
      location: class BaseGameActivity
    C:\Users\willb\AppData\Local\Temp\And3210.tmp\app\src\main\java\Extensions\BaseGameActivity.java:120: error: method does not override or implement a method from a supertype
        @Override
        ^
    C:\Users\willb\AppData\Local\Temp\And3210.tmp\app\src\main\java\Extensions\BaseGameActivity.java:122: error: cannot find symbol
            super.onActivityResult(request, response, data);
            ^
      symbol:   variable super
      location: class BaseGameActivity
    Note: Some input files use or override a deprecated API.
    Note: Recompile with -Xlint:deprecation for details.
    Note: Some input files use unchecked or unsafe operations.
    Note: Recompile with -Xlint:unchecked for details.
    Note: Some messages have been simplified; recompile with -Xdiags:verbose to get full output
    12 errors
    
    > Task :app:compileReleaseJavaWithJavac FAILED
    
    FAILURE: Build failed with an exception.
    
    * What went wrong:
    Execution failed for task ':app:compileReleaseJavaWithJavac'.
    > Compilation failed; see the compiler error output for details.
    
    * Try:
    Run with --stacktrace option to get the stack trace. Run with --info or --debug option to get more log output. Run with --scan to get full insights.
    
    * Get more help at https://help.gradle.org
    
    BUILD FAILED in 2m 9s
    30 actionable tasks: 30 executed

  4. #34
    Clickteam Clickteam
    Fernando's Avatar
    Join Date
    Dec 2006
    Posts
    6,979
    Mentioned
    298 Post(s)
    Tagged
    4 Thread(s)
    Sorry @Dobermann, you need a new version of GPG objects that will be publish tomorrow.

    If i select Profile ID or Account ID, it will show "account profile ID" and "obfuscate profile ID" instead (i guess) of "obfuscate account ID" and "obfuscate profile ID".
    yes this text will be corrected also
    Regards,


    Fernando Vivolo

    ... new things are coming ...

  5. #35
    Clicker

    Fusion 2.5 MacFusion 2.5 DeveloperFusion 2.5+ DLCAndroid Export ModuleHTML5 Export ModuleiOS Export ModuleUniversal Windows Platform Export ModuleSWF Export ModuleFirefly 3D ModuleInstall Creator Pro
    Fusion 2.5 (Steam)Fusion 2.5 Developer (Steam)Fusion 2.5+ DLC (Steam)Android Export Module (Steam)HTML5 Export Module (Steam)iOS Export Module (Steam)Universal Windows Platform Export Module (Steam)Firefly 3D Module (Steam)
    pradeep's Avatar
    Join Date
    Dec 2013
    Location
    India
    Posts
    368
    Mentioned
    11 Post(s)
    Tagged
    0 Thread(s)
    I'm also unable to compile my app for android, got this error message:
    WARNING:: Please remove usages of `jcenter()` Maven repository from your build scripts and migrate your build to other Maven repositories.
    This repository is deprecated and it will be shut down in the future.
    See http://developer.android.com/r/tools...end-of-service for more information.
    Currently detected usages in: root project 'And928A.tmp', project ':app'
    > Task :app:preBuild UP-TO-DATE
    > Task :app:preReleaseBuild UP-TO-DATE
    > Task :app:compileReleaseAidl NO-SOURCE
    > Task :app:compileReleaseRenderscript NO-SOURCE
    > Task :app:generateReleaseBuildConfig
    > Task :app:javaPreCompileRelease
    > Task :app:writeReleaseApplicationId
    > Task :app:analyticsRecordingRelease
    > Task :app:checkReleaseAarMetadata
    > Task :app:generateReleaseResValues
    > Task :app:generateReleaseResources
    > Task :app:createReleaseCompatibleScreenManifests
    > Task :app:extractDeepLinksRelease
    > Task :app:processReleaseMainManifest
    > Task :app:processReleaseManifest
    > Task :app:mergeReleaseJniLibFolders
    > Task :app:mergeReleaseResources
    > Task :app:mergeReleaseShaders
    > Task :app:compileReleaseShaders NO-SOURCE
    > Task :app:generateReleaseAssets UP-TO-DATE
    > Task :app:mergeReleaseAssets
    > Task :app:compressReleaseAssets
    > Task :app:checkReleaseDuplicateClasses
    > Task :app:processReleaseManifestForPackage
    > Task :app:desugarReleaseFileDependencies
    > Task :app:processReleaseJavaRes NO-SOURCE
    > Task :app:mergeExtDexRelease
    > Task :app:collectReleaseDependencies
    > Task :app:sdkReleaseDependencyData
    > Task :app:validateSigningRelease
    > Task :app:writeReleaseAppMetadata
    > Task :app:writeReleaseSigningConfigVersions
    > Task :app:mergeReleaseNativeLibs
    > Task :app:mergeReleaseJavaResource

    > Task :app:stripReleaseDebugSymbols
    Unable to strip the following libraries, packaging them as they are: libES1Renderer.so, libES2Renderer.so, libES3Renderer.so, libRuntimeNative.so, libgdx.so.

    > Task :app:extractReleaseNativeSymbolTables
    Unable to extract native debug metadata from C:\Users\Pradeep\AppData\Local\Temp\And928A.tmp\ap p\build\intermediates\merged_native_libs\release\o ut\lib\arm64-v8a\libES1Renderer.so because unable to locate the objcopy executable for the arm64-v8a ABI.
    Unable to extract native debug metadata from C:\Users\Pradeep\AppData\Local\Temp\And928A.tmp\ap p\build\intermediates\merged_native_libs\release\o ut\lib\arm64-v8a\libES2Renderer.so because unable to locate the objcopy executable for the arm64-v8a ABI.
    Unable to extract native debug metadata from C:\Users\Pradeep\AppData\Local\Temp\And928A.tmp\ap p\build\intermediates\merged_native_libs\release\o ut\lib\arm64-v8a\libES3Renderer.so because unable to locate the objcopy executable for the arm64-v8a ABI.
    Unable to extract native debug metadata from C:\Users\Pradeep\AppData\Local\Temp\And928A.tmp\ap p\build\intermediates\merged_native_libs\release\o ut\lib\arm64-v8a\libgdx.so because unable to locate the objcopy executable for the arm64-v8a ABI.
    Unable to extract native debug metadata from C:\Users\Pradeep\AppData\Local\Temp\And928A.tmp\ap p\build\intermediates\merged_native_libs\release\o ut\lib\arm64-v8a\libRuntimeNative.so because unable to locate the objcopy executable for the arm64-v8a ABI.
    Unable to extract native debug metadata from C:\Users\Pradeep\AppData\Local\Temp\And928A.tmp\ap p\build\intermediates\merged_native_libs\release\o ut\lib\armeabi-v7a\libES1Renderer.so because unable to locate the objcopy executable for the armeabi-v7a ABI.
    Unable to extract native debug metadata from C:\Users\Pradeep\AppData\Local\Temp\And928A.tmp\ap p\build\intermediates\merged_native_libs\release\o ut\lib\armeabi-v7a\libES2Renderer.so because unable to locate the objcopy executable for the armeabi-v7a ABI.
    Unable to extract native debug metadata from C:\Users\Pradeep\AppData\Local\Temp\And928A.tmp\ap p\build\intermediates\merged_native_libs\release\o ut\lib\armeabi-v7a\libES3Renderer.so because unable to locate the objcopy executable for the armeabi-v7a ABI.
    Unable to extract native debug metadata from C:\Users\Pradeep\AppData\Local\Temp\And928A.tmp\ap p\build\intermediates\merged_native_libs\release\o ut\lib\armeabi-v7a\libgdx.so because unable to locate the objcopy executable for the armeabi-v7a ABI.
    Unable to extract native debug metadata from C:\Users\Pradeep\AppData\Local\Temp\And928A.tmp\ap p\build\intermediates\merged_native_libs\release\o ut\lib\armeabi-v7a\libRuntimeNative.so because unable to locate the objcopy executable for the armeabi-v7a ABI.
    Unable to extract native debug metadata from C:\Users\Pradeep\AppData\Local\Temp\And928A.tmp\ap p\build\intermediates\merged_native_libs\release\o ut\lib\x86\libES1Renderer.so because unable to locate the objcopy executable for the x86 ABI.
    Unable to extract native debug metadata from C:\Users\Pradeep\AppData\Local\Temp\And928A.tmp\ap p\build\intermediates\merged_native_libs\release\o ut\lib\x86\libES2Renderer.so because unable to locate the objcopy executable for the x86 ABI.
    Unable to extract native debug metadata from C:\Users\Pradeep\AppData\Local\Temp\And928A.tmp\ap p\build\intermediates\merged_native_libs\release\o ut\lib\x86\libES3Renderer.so because unable to locate the objcopy executable for the x86 ABI.
    Unable to extract native debug metadata from C:\Users\Pradeep\AppData\Local\Temp\And928A.tmp\ap p\build\intermediates\merged_native_libs\release\o ut\lib\x86\libgdx.so because unable to locate the objcopy executable for the x86 ABI.
    Unable to extract native debug metadata from C:\Users\Pradeep\AppData\Local\Temp\And928A.tmp\ap p\build\intermediates\merged_native_libs\release\o ut\lib\x86\libRuntimeNative.so because unable to locate the objcopy executable for the x86 ABI.
    Unable to extract native debug metadata from C:\Users\Pradeep\AppData\Local\Temp\And928A.tmp\ap p\build\intermediates\merged_native_libs\release\o ut\lib\x86_64\libES1Renderer.so because unable to locate the objcopy executable for the x86_64 ABI.
    Unable to extract native debug metadata from C:\Users\Pradeep\AppData\Local\Temp\And928A.tmp\ap p\build\intermediates\merged_native_libs\release\o ut\lib\x86_64\libES2Renderer.so because unable to locate the objcopy executable for the x86_64 ABI.
    Unable to extract native debug metadata from C:\Users\Pradeep\AppData\Local\Temp\And928A.tmp\ap p\build\intermediates\merged_native_libs\release\o ut\lib\x86_64\libES3Renderer.so because unable to locate the objcopy executable for the x86_64 ABI.
    Unable to extract native debug metadata from C:\Users\Pradeep\AppData\Local\Temp\And928A.tmp\ap p\build\intermediates\merged_native_libs\release\o ut\lib\x86_64\libgdx.so because unable to locate the objcopy executable for the x86_64 ABI.
    Unable to extract native debug metadata from C:\Users\Pradeep\AppData\Local\Temp\And928A.tmp\ap p\build\intermediates\merged_native_libs\release\o ut\lib\x86_64\libRuntimeNative.so because unable to locate the objcopy executable for the x86_64 ABI.

    > Task :app:mergeReleaseNativeDebugMetadata NO-SOURCE
    > Task :app:processReleaseResources

    > Task :app:compileReleaseJavaWithJavac
    C:\Users\Pradeep\AppData\Local\Temp\And928A.tmp\ap p\src\main\java\Extensions\CRunWebView2.java:25: error: package android.support.annotation does not exist
    import android.support.annotation.RequiresApi;
    ^
    C:\Users\Pradeep\AppData\Local\Temp\And928A.tmp\ap p\src\main\java\Extensions\CRunWebView2.java:655: error: cannot find symbol
    MMFRuntime.inst.pushForPermissions(permissionsApi2 3_loc, PERMISSIONS_WEBLOC_REQUEST);
    ^
    symbol: method pushForPermissions(HashMap<String,String>,int)
    location: variable inst of type MMFRuntime
    C:\Users\Pradeep\AppData\Local\Temp\And928A.tmp\ap p\src\main\java\Extensions\CRunWebView2.java:656: error: cannot find symbol
    enabled_perms_loc = MMFRuntime.inst.verifyOkPermissionsApi23(permissio nsApi23_loc);
    ^
    symbol: method verifyOkPermissionsApi23(HashMap<String,String>)
    location: variable inst of type MMFRuntime
    C:\Users\Pradeep\AppData\Local\Temp\And928A.tmp\ap p\src\main\java\Extensions\CRunWebView2.java:658: error: cannot find symbol
    MMFRuntime.inst.askForPermissionsApi23();
    ^
    symbol: method askForPermissionsApi23()
    location: variable inst of type MMFRuntime
    C:\Users\Pradeep\AppData\Local\Temp\And928A.tmp\ap p\src\main\java\Extensions\CRunWebView2.java:690: error: cannot find symbol
    MMFRuntime.inst.pushForPermissions(permissionsApi2 3_file, PERMISSIONS_WEBFILE_REQUEST);
    ^
    symbol: method pushForPermissions(HashMap<String,String>,int)
    location: variable inst of type MMFRuntime
    C:\Users\Pradeep\AppData\Local\Temp\And928A.tmp\ap p\src\main\java\Extensions\CRunWebView2.java:691: error: cannot find symbol
    enabled_perms_file = MMFRuntime.inst.verifyOkPermissionsApi23(permissio nsApi23_file);
    ^
    symbol: method verifyOkPermissionsApi23(HashMap<String,String>)
    location: variable inst of type MMFRuntime
    C:\Users\Pradeep\AppData\Local\Temp\And928A.tmp\ap p\src\main\java\Extensions\CRunWebView2.java:693: error: cannot find symbol
    MMFRuntime.inst.askForPermissionsApi23();
    ^
    symbol: method askForPermissionsApi23()
    location: variable inst of type MMFRuntime
    C:\Users\Pradeep\AppData\Local\Temp\And928A.tmp\ap p\src\main\java\Extensions\CRunWebView2.java:1004: error: cannot find symbol
    enabled_geolocation = MMFRuntime.inst.checkForManifestPermissions(Manife st.permission.ACCESS_FINE_LOCATION); // Include in version 292.15
    ^
    symbol: method checkForManifestPermissions(String)
    location: variable inst of type MMFRuntime
    C:\Users\Pradeep\AppData\Local\Temp\And928A.tmp\ap p\src\main\java\Extensions\CRunWebView2.java:1005: error: cannot find symbol
    enabled_camera = MMFRuntime.inst.checkForManifestPermissions(Manife st.permission.CAMERA); // Include in version 292.15
    ^
    symbol: method checkForManifestPermissions(String)
    location: variable inst of type MMFRuntime
    C:\Users\Pradeep\AppData\Local\Temp\And928A.tmp\ap p\src\main\java\Extensions\CRunWebView2.java:1011: error: cannot find symbol
    MMFRuntime.inst.pushForPermissions(permissionsApi2 3_cam, PERMISSIONS_WEBCAM_REQUEST);
    ^
    symbol: method pushForPermissions(HashMap<String,String>,int)
    location: variable inst of type MMFRuntime
    C:\Users\Pradeep\AppData\Local\Temp\And928A.tmp\ap p\src\main\java\Extensions\CRunWebView2.java:1012: error: cannot find symbol
    enabled_perms_cam = MMFRuntime.inst.verifyOkPermissionsApi23(permissio nsApi23_cam);
    ^
    symbol: method verifyOkPermissionsApi23(HashMap<String,String>)
    location: variable inst of type MMFRuntime
    C:\Users\Pradeep\AppData\Local\Temp\And928A.tmp\ap p\src\main\java\Extensions\CRunWebView2.java:1040: error: cannot find symbol
    MMFRuntime.inst.askForPermissionsApi23();
    ^
    symbol: method askForPermissionsApi23()
    location: variable inst of type MMFRuntime
    C:\Users\Pradeep\AppData\Local\Temp\And928A.tmp\ap p\src\main\java\Extensions\CRunWebView2.java:1143: error: method does not override or implement a method from a supertype
    @Override
    ^
    C:\Users\Pradeep\AppData\Local\Temp\And928A.tmp\ap p\src\main\java\Extensions\CRunWebView2.java:1145: error: cannot find symbol
    if (permissionsReturned.contains(PERMISSIONS_WEBLOC_R EQUEST) || MMFRuntime.inst.verifyOkPermissionsApi23(permissio nsApi23_loc)) {
    ^
    symbol: method verifyOkPermissionsApi23(HashMap<String,String>)
    location: variable inst of type MMFRuntime
    C:\Users\Pradeep\AppData\Local\Temp\And928A.tmp\ap p\src\main\java\Extensions\CRunWebView2.java:1146: error: cannot find symbol
    enabled_perms_loc = verifyResponseApi23(permissions, permissionsApi23_loc);
    ^
    symbol: method verifyResponseApi23(String[],HashMap<String,String>)
    location: class CRunWebView2<JavaScriptInterface>
    where JavaScriptInterface is a type-variable:
    JavaScriptInterface extends Object declared in class CRunWebView2
    C:\Users\Pradeep\AppData\Local\Temp\And928A.tmp\ap p\src\main\java\Extensions\CRunWebView2.java:1172: error: cannot find symbol
    if (permissionsReturned.contains(PERMISSIONS_WEBCAM_R EQUEST) || MMFRuntime.inst.verifyOkPermissionsApi23(permissio nsApi23_cam)) {
    ^
    symbol: method verifyOkPermissionsApi23(HashMap<String,String>)
    location: variable inst of type MMFRuntime
    C:\Users\Pradeep\AppData\Local\Temp\And928A.tmp\ap p\src\main\java\Extensions\CRunWebView2.java:1173: error: cannot find symbol
    enabled_perms_cam = verifyResponseApi23(permissions, permissionsApi23_cam);
    ^
    symbol: method verifyResponseApi23(String[],HashMap<String,String>)
    location: class CRunWebView2<JavaScriptInterface>
    where JavaScriptInterface is a type-variable:
    JavaScriptInterface extends Object declared in class CRunWebView2
    C:\Users\Pradeep\AppData\Local\Temp\And928A.tmp\ap p\src\main\java\Extensions\CRunWebView2.java:1176: error: cannot find symbol
    if (permissionsReturned.contains(PERMISSIONS_WEBFILE_ REQUEST) || MMFRuntime.inst.verifyOkPermissionsApi23(permissio nsApi23_file)) {
    ^
    symbol: method verifyOkPermissionsApi23(HashMap<String,String>)
    location: variable inst of type MMFRuntime
    C:\Users\Pradeep\AppData\Local\Temp\And928A.tmp\ap p\src\main\java\Extensions\CRunWebView2.java:1177: error: cannot find symbol
    enabled_perms_file = verifyResponseApi23(permissions, permissionsApi23_file);
    ^
    symbol: method verifyResponseApi23(String[],HashMap<String,String>)
    location: class CRunWebView2<JavaScriptInterface>
    where JavaScriptInterface is a type-variable:
    JavaScriptInterface extends Object declared in class CRunWebView2
    Note: Some input files use or override a deprecated API.
    Note: Recompile with -Xlint:deprecation for details.
    Note: Some input files use unchecked or unsafe operations.
    Note: Recompile with -Xlint:unchecked for details.
    19 errors

    > Task :app:compileReleaseJavaWithJavac FAILED

    FAILURE: Build failed with an exception.

    * What went wrong:
    Execution failed for task ':app:compileReleaseJavaWithJavac'.
    > Compilation failed; see the compiler error output for details.

    * Try:
    Run with --stacktrace option to get the stack trace. Run with --info or --debug option to get more log output. Run with --scan to get full insights.

    * Get more help at https://help.gradle.org

    BUILD FAILED in 20s
    30 actionable tasks: 30 executed

  6. #36
    Clickteam Clickteam

    Join Date
    Jun 2006
    Location
    France
    Posts
    14,142
    Mentioned
    279 Post(s)
    Tagged
    3 Thread(s)
    Quote Originally Posted by defisym View Post
    Good to know this issue has been fixed, but other blank character, like Tab, is still ignored
    I think TAB is ignored by the font library we use, not sure what we can do about it.

    Unfortunately on my PC I still get this issue:
    Windows runtime: in DirectX11 mode sometimes scaled and rotated objects could have a semi-transparent black box around them
    This issue is fixed, your screen shot shows a different issue, maybe a shader or premultiplied alpha difference.

  7. #37
    Clickteam Clickteam

    Join Date
    Jun 2006
    Location
    France
    Posts
    14,142
    Mentioned
    279 Post(s)
    Tagged
    3 Thread(s)
    Quote Originally Posted by NaitorStudios View Post
    Hi, just found this weird rendering bug on event editor, not sure why it happens, but this file seems to always get the bug on the latest beta...

    Here's how it looks:

    Attachment 30309

    Attachment 30308
    O_o. Thanks, I'll take a look. EDIT: this will be fixed in the build 293.4.

  8. #38
    Clicker Fusion 2.5 DeveloperFusion 2.5+ DLCHTML5 Export ModuleiOS Export ModuleSWF Export Module
    MTCMusic's Avatar
    Join Date
    Jan 2007
    Location
    Montreal, Canada
    Posts
    389
    Mentioned
    0 Post(s)
    Tagged
    0 Thread(s)
    Thank you for this update. Your continued support is extremely appreciated!

  9. #39
    Clicker

    Fusion 2.5 DeveloperFusion 2.5+ DLCAndroid Export ModuleiOS Export ModuleInstall Creator
    SirEatAlot's Avatar
    Join Date
    Oct 2010
    Location
    Stockholm, Sweden
    Posts
    423
    Mentioned
    5 Post(s)
    Tagged
    0 Thread(s)
    getting random crashes in my app with the new build, seem to maybe have something to do with mouse and active system box interaction but can't nail it down..

    reverting back to previous build for the time being.

    I can send the app over for debugging if this would help?

  10. #40
    Clickteam Clickteam

    Join Date
    Jun 2006
    Location
    France
    Posts
    14,142
    Mentioned
    279 Post(s)
    Tagged
    3 Thread(s)
    Quote Originally Posted by SirEatAlot View Post
    getting random crashes in my app with the new build, seem to maybe have something to do with mouse and active system box interaction but can't nail it down..

    reverting back to previous build for the time being.

    I can send the app over for debugging if this would help?
    Ah yes, please, this would help a lot, thanks!

Page 4 of 48 FirstFirst ... 2 3 4 5 6 14 ... LastLast

Similar Threads

  1. Build 292.11 - Beta version
    By Yves in forum Fusion 2.5
    Replies: 63
    Last Post: 30th August 2019, 04:16 PM
  2. Build 288.0 - Beta version
    By Yves in forum Fusion 2.5
    Replies: 43
    Last Post: 25th February 2017, 06:21 PM
  3. Build 287.1 - beta version
    By Yves in forum Fusion 2.5
    Replies: 21
    Last Post: 23rd July 2016, 02:40 PM
  4. Build 285.1 - Beta version
    By Yves in forum Fusion 2.5
    Replies: 122
    Last Post: 8th April 2016, 08:21 PM
  5. Build 284.2 - beta version
    By Yves in forum Fusion 2.5
    Replies: 89
    Last Post: 17th April 2015, 04:41 PM

Posting Permissions

  • You may not post new threads
  • You may not post replies
  • You may not post attachments
  • You may not edit your posts
  •