User Tag List

Page 1 of 2 1 2 LastLast
Results 1 to 10 of 14

Thread: Self-suppression not permitted - Error

  1. #1
    Clicker Fusion 2.5 (Steam)Fusion 2.5 Developer (Steam)Android Export Module (Steam)

    Join Date
    Aug 2015
    Posts
    24
    Mentioned
    0 Post(s)
    Tagged
    0 Thread(s)

    Self-suppression not permitted - Error

    Hi guys.

    I'm developing an app and always I compile it to do a test and the exporter is working OK. But last day when I put two more frames, the exporter is not working more and return me this error. So, I made a new test, I deleted two or more frames from the app and try to compile. It works again.

    Are there a limit to create new frames? Now it's with 50 frames, but I have another app with more than 100 and works fine.

    Can you verify the error log, please?

    The current default is 'false'.
    It has been removed from the current version of the Android Gradle plugin.
    NdkCompile is no longer supported

    > Task :app:preBuild UP-TO-DATE
    > Task :app:preDebugBuild UP-TO-DATE
    > Task :app:compileDebugAidl NO-SOURCE
    > Task :app:compileDebugRenderscript NO-SOURCE
    > Task :app:generateDebugBuildConfig
    > Task :app:generateDebugResValues
    > Task :app:generateDebugResources
    > Task :app:createDebugCompatibleScreenManifests
    > Task :app:extractDeepLinksDebug
    > Task :app:processDebugManifest
    > Task :app:mergeDebugShaders
    > Task :app:compileDebugShaders NO-SOURCE
    > Task :app:generateDebugAssets UP-TO-DATE
    > Task :app:mergeDebugAssets
    > Task :app:processDebugJavaRes NO-SOURCE
    > Task :app:checkDebugDuplicateClasses
    > Task :app:mergeDebugJniLibFolders
    > Task :app:validateSigningDebug
    > Task :app:javaPreCompileDebug
    > Task :app:mergeDebugResources
    > Task :app:processDebugResources

    > Task :app:compileDebugJavaWithJavac
    Note: Some input files use or override a deprecated API.
    Note: Recompile with -Xlint:deprecation for details.
    Note: Some input files use unchecked or unsafe operations.
    Note: Recompile with -Xlint:unchecked for details.

    > Task :app:compileDebugSources
    > Task :app:dexBuilderDebug
    > Task :app:mergeExtDexDebug
    > Task :app:mergeDebugNativeLibs
    > Task :app:stripDebugDebugSymbols
    > Task :app:mergeDebugJavaResource
    > Task :app:mergeDexDebug
    > Task :app:packageDebug FAILED

    FAILURE: Build failed with an exception.

    * What went wrong:
    Execution failed for task ':app:packageDebug'.
    > A failure occurred while executing com.android.build.gradle.internal.tasks.Workers$Ac tionFacade
    > Self-suppression not permitted

    * Try:
    Run with --stacktrace option to get the stack trace. Run with --info or --debug option to get more log output. Run with --scan to get full insights.

    * Get more help at https://help.gradle.org

    BUILD FAILED in 13s
    21 actionable tasks: 21 executed
    Images attachées Images attachées

  2. #2
    Clickteam Clickteam
    Fernando's Avatar
    Join Date
    Dec 2006
    Posts
    7,056
    Mentioned
    298 Post(s)
    Tagged
    4 Thread(s)
    can you please give me more information, version, what extensions are involved, can you post a small mfa that reproduce this issue
    Regards,


    Fernando Vivolo

    ... new things are coming ...

  3. #3
    Clicker Fusion 2.5 (Steam)Fusion 2.5 Developer (Steam)Android Export Module (Steam)

    Join Date
    Aug 2015
    Posts
    24
    Mentioned
    0 Post(s)
    Tagged
    0 Thread(s)
    Hi Fernando...

    So, I'm using Build R293.1 and unfortunatelly I can´t pos a .mfa because is now with "just" with more than 500Mb. No extensions are in use. The app has a lot of images and I need to put more. I'm reading a lot about it on internet and now I got this error with Java. Aparentelly, when my app is less than 500Mb, I can compile with no problems. But if .mfa has more than 500GB, the error is showed and not compile.


    > Configure project :app
    WARNING: The option 'android.useDeprecatedNdk' is deprecated.
    The current default is 'false'.
    It has been removed from the current version of the Android Gradle plugin.
    NdkCompile is no longer supported

    > Task :app:preBuild UP-TO-DATE
    > Task :app:preDebugBuild UP-TO-DATE
    > Task :app:compileDebugAidl NO-SOURCE
    > Task :app:compileDebugRenderscript NO-SOURCE
    > Task :app:generateDebugBuildConfig
    > Task :app:generateDebugResValues
    > Task :app:generateDebugResources
    > Task :app:javaPreCompileDebug
    > Task :app:createDebugCompatibleScreenManifests
    > Task :app:extractDeepLinksDebug
    > Task :app:processDebugManifest
    > Task :app:mergeDebugShaders
    > Task :app:compileDebugShaders NO-SOURCE
    > Task :app:generateDebugAssets UP-TO-DATE
    > Task :app:mergeDebugAssets
    > Task :app:processDebugJavaRes NO-SOURCE
    > Task :app:checkDebugDuplicateClasses
    > Task :app:mergeDebugJniLibFolders
    > Task :app:validateSigningDebug
    > Task :app:mergeDebugResources
    > Task :app:processDebugResources

    > Task :app:compileDebugJavaWithJavac
    Note: Some input files use or override a deprecated API.
    Note: Recompile with -Xlint:deprecation for details.
    Note: Some input files use unchecked or unsafe operations.
    Note: Recompile with -Xlint:unchecked for details.

    > Task :app:compileDebugSources
    > Task :app:dexBuilderDebug
    > Task :app:mergeDebugJavaResource
    > Task :app:mergeExtDexDebug
    > Task :app:mergeDebugNativeLibs
    > Task :app:stripDebugDebugSymbols
    > Task :app:mergeDexDebug
    > Task :app:packageDebug FAILED

    FAILURE: Build failed with an exception.

    * What went wrong:
    Execution failed for task ':app:packageDebug'.
    > A failure occurred while executing com.android.build.gradle.internal.tasks.Workers$Ac tionFacade
    > Java heap space

    * Try:
    Run with --stacktrace option to get the stack trace. Run with --info or --debug option to get more log output. Run with --scan to get full insights.

    * Get more help at https://help.gradle.org

    BUILD FAILED in 16s
    21 actionable tasks: 21 executed

    What I found about this "Java Heap Space"

    "In some cases, the amount of heap you have allocated to your JVM is just not enough to accommodate the needs of your applications running on that JVM. In that case, you should just allocate more heap – see at the end of this chapter for how to achieve that."

  4. #4
    Clicker Fusion 2.5 (Steam)Fusion 2.5 Developer (Steam)Android Export Module (Steam)

    Join Date
    Aug 2015
    Posts
    24
    Mentioned
    0 Post(s)
    Tagged
    0 Thread(s)
    Fernando... My new test now: The .mfa has 525Mb. I deleted some frames until let the .mfa with 400Mb and run the exporter. I got success, the .apk is created, so, I think is when I have a big .mfa size. Any solution, please?

  5. #5
    Clickteam Clickteam
    Fernando's Avatar
    Join Date
    Dec 2006
    Posts
    7,056
    Mentioned
    298 Post(s)
    Tagged
    4 Thread(s)
    if so, please go to data/runtime/android look for RuntimeAndroid.zip

    open it, and open also the gradle.properties and look for this line (nearly at the bottom)

    #org.gradle.jvmargs=-Xmx1536m

    remove the # save and update the zip and build again and let me know how it goes.
    Regards,


    Fernando Vivolo

    ... new things are coming ...

  6. #6
    Clicker Fusion 2.5 (Steam)Fusion 2.5 Developer (Steam)Android Export Module (Steam)

    Join Date
    Aug 2015
    Posts
    24
    Mentioned
    0 Post(s)
    Tagged
    0 Thread(s)
    Ok, i did it and now a got this error (picture).Print 02.jpgPrint 03.jpg

  7. #7
    Clickteam Clickteam
    Fernando's Avatar
    Join Date
    Dec 2006
    Posts
    7,056
    Mentioned
    298 Post(s)
    Tagged
    4 Thread(s)
    oh that is not the one to uncomment is the one near the bottom

    =========================

    and of course nothing else is altered, right?
    Regards,


    Fernando Vivolo

    ... new things are coming ...

  8. #8
    Clicker Fusion 2.5 (Steam)Fusion 2.5 Developer (Steam)Android Export Module (Steam)

    Join Date
    Aug 2015
    Posts
    24
    Mentioned
    0 Post(s)
    Tagged
    0 Thread(s)
    Sorry, my mistake. I uncomment the right one now, but the error is the same.

    And I altered only this.

    To make sure that is right, I tried to compile my 400mb .mfa with the old zip commented with #. It worked.

    So, I put the new RuntimeAndroid.zip on the folder, tried to compile and got the error.

    Third, I put the old RuntimeAndroid.zip again and run the exporter. It worked again.

    PS.: (I'm using the 400mb mfa just to test the old compile, but with the 525 mb mfa I got the same error)

    Print 04.jpg

  9. #9
    Clickteam Clickteam
    Fernando's Avatar
    Join Date
    Dec 2006
    Posts
    7,056
    Mentioned
    298 Post(s)
    Tagged
    4 Thread(s)
    now you need to explain what configuration you have there in your PC, windows?, RAM?
    Regards,


    Fernando Vivolo

    ... new things are coming ...

  10. #10
    Clicker Fusion 2.5 (Steam)Fusion 2.5 Developer (Steam)Android Export Module (Steam)

    Join Date
    Aug 2015
    Posts
    24
    Mentioned
    0 Post(s)
    Tagged
    0 Thread(s)
    OK...

    I have a Notebook Gamer Acer Aspire Nitro 5 AN517-51-50JS

    Intel(R) Core(TM) i5-9300H CPU @ 2.40GHz

    8GB RAM

    SSD 512 GB

    Windows 10 Home Edition

Page 1 of 2 1 2 LastLast

Similar Threads

  1. Replies: 11
    Last Post: 15th March 2014, 06:22 AM
  2. suppression d'un répertoire
    By jose in forum Multimedia Fusion 2 - Technical Support
    Replies: 1
    Last Post: 17th September 2010, 02:02 AM
  3. suppression de fichiers
    By jose in forum Multimedia Fusion 2 - Technical Support
    Replies: 1
    Last Post: 16th September 2010, 09:57 PM
  4. [Bug] Event Group Error and Sphax MessageBox Error
    By Gustav in forum File Archive
    Replies: 10
    Last Post: 18th April 2008, 02:24 PM
  5. Error with mmf1-game: extension load error in mmf2
    By Quinto in forum Multimedia Fusion 2 - Technical Support
    Replies: 3
    Last Post: 27th November 2006, 12:54 PM

Posting Permissions

  • You may not post new threads
  • You may not post replies
  • You may not post attachments
  • You may not edit your posts
  •