User Tag List

Results 1 to 4 of 4

Thread: Speech To Text Android Extension

  1. #1
    Clicker Fusion 2.5
    Gigatron's Avatar
    Join Date
    Jun 2020
    Location
    France
    Posts
    178
    Mentioned
    3 Post(s)
    Tagged
    0 Thread(s)

    Speech To Text Android Extension

    Hi,
    Late on night i have finished at 85% SST extension, you can speak and the extension write the sentence on
    an edit box. This extension will go to clickstore;

    Stay tuned

  2. #2
    Clicker Fusion 2.5
    Gigatron's Avatar
    Join Date
    Jun 2020
    Location
    France
    Posts
    178
    Mentioned
    3 Post(s)
    Tagged
    0 Thread(s)
    Hi,
    If you want to test this extension with example ;
    Attached files Attached files

  3. #3
    Clicker

    Fusion 2.5 MacFusion 2.5 DeveloperFusion 2.5+ DLCAndroid Export ModuleHTML5 Export ModuleiOS Export ModuleUniversal Windows Platform Export ModuleSWF Export ModuleFirefly 3D ModuleInstall Creator Pro
    Fusion 2.5 (Steam)Fusion 2.5 Developer (Steam)Fusion 2.5+ DLC (Steam)Android Export Module (Steam)HTML5 Export Module (Steam)iOS Export Module (Steam)Universal Windows Platform Export Module (Steam)Firefly 3D Module (Steam)
    pradeep's Avatar
    Join Date
    Dec 2013
    Location
    India
    Posts
    368
    Mentioned
    11 Post(s)
    Tagged
    0 Thread(s)
    Work properly in my device.

  4. #4
    Clicker Fusion 2.5 MacFusion 2.5 DeveloperFusion 2.5+ DLCAndroid Export ModuleiOS Export ModuleInstall Creator Pro
    wuxuechen's Avatar
    Join Date
    Nov 2006
    Posts
    285
    Mentioned
    1 Post(s)
    Tagged
    0 Thread(s)
    FAILURE: Build failed with an exception.

    * Where:
    Settings file 'C:\Users\Administrator\AppData\Local\Temp\And74B4 .tmp\settings.gradle'

    * What went wrong:
    Could not compile settings file 'C:\Users\Administrator\AppData\Local\Temp\And74B4 .tmp\settings.gradle'.
    > startup failed:
    General error during semantic analysis: Unsupported class file major version 60

    java.lang.IllegalArgumentException: Unsupported class file major version 60
    at groovyjarjarasm.asm.ClassReader.<init>(ClassReader .java:196)
    at groovyjarjarasm.asm.ClassReader.<init>(ClassReader .java:177)
    at groovyjarjarasm.asm.ClassReader.<init>(ClassReader .java:163)
    at groovyjarjarasm.asm.ClassReader.<init>(ClassReader .java:284)
    at org.codehaus.groovy.ast.decompiled.AsmDecompiler.p arseClass(AsmDecompiler.java:81)
    at org.codehaus.groovy.control.ClassNodeResolver.find Decompiled(ClassNodeResolver.java:251)
    at org.codehaus.groovy.control.ClassNodeResolver.tryA sLoaderClassOrScript(ClassNodeResolver.java:189)
    at org.codehaus.groovy.control.ClassNodeResolver.find ClassNode(ClassNodeResolver.java:169)
    at org.codehaus.groovy.control.ClassNodeResolver.reso lveName(ClassNodeResolver.java:125)
    at org.codehaus.groovy.ast.decompiled.AsmReferenceRes olver.resolveClassNullable(AsmReferenceResolver.ja va:57)
    at org.codehaus.groovy.ast.decompiled.AsmReferenceRes olver.resolveClass(AsmReferenceResolver.java:44)
    at org.codehaus.groovy.ast.decompiled.AsmReferenceRes olver.resolveNonArrayType(AsmReferenceResolver.jav a:79)
    at org.codehaus.groovy.ast.decompiled.AsmReferenceRes olver.resolveType(AsmReferenceResolver.java:70)
    at org.codehaus.groovy.ast.decompiled.MemberSignature Parser.createMethodNode(MemberSignatureParser.java :57)
    at org.codehaus.groovy.ast.decompiled.DecompiledClass Node$2.get(DecompiledClassNode.java:234)
    at org.codehaus.groovy.ast.decompiled.DecompiledClass Node$2.get(DecompiledClassNode.java:231)
    at org.codehaus.groovy.ast.decompiled.DecompiledClass Node.createMethodNode(DecompiledClassNode.java:242 )
    at org.codehaus.groovy.ast.decompiled.DecompiledClass Node.lazyInitMembers(DecompiledClassNode.java:199)
    at org.codehaus.groovy.ast.decompiled.DecompiledClass Node.getDeclaredMethods(DecompiledClassNode.java:1 22)
    at org.codehaus.groovy.ast.ClassNode.getMethods(Class Node.java:912)
    at org.codehaus.groovy.ast.ClassNode.tryFindPossibleM ethod(ClassNode.java:1280)
    at org.codehaus.groovy.control.StaticImportVisitor.tr ansformMethodCallExpression(StaticImportVisitor.ja va:252)
    at org.codehaus.groovy.control.StaticImportVisitor.tr ansform(StaticImportVisitor.java:113)
    at org.codehaus.groovy.ast.ClassCodeExpressionTransfo rmer.visitExpressionStatement(ClassCodeExpressionT ransformer.java:142)
    at org.codehaus.groovy.ast.stmt.ExpressionStatement.v isit(ExpressionStatement.java:40)
    at org.codehaus.groovy.ast.ClassCodeVisitorSupport.vi sitClassCodeContainer(ClassCodeVisitorSupport.java :110)
    at org.codehaus.groovy.ast.ClassCodeVisitorSupport.vi sitConstructorOrMethod(ClassCodeVisitorSupport.jav a:121)
    at org.codehaus.groovy.ast.ClassCodeExpressionTransfo rmer.visitConstructorOrMethod(ClassCodeExpressionT ransformer.java:53)
    at org.codehaus.groovy.control.StaticImportVisitor.vi sitConstructorOrMethod(StaticImportVisitor.java:89 )
    at org.codehaus.groovy.ast.ClassCodeVisitorSupport.vi sitConstructor(ClassCodeVisitorSupport.java:128)
    at org.codehaus.groovy.ast.ClassNode.visitContents(Cl assNode.java:1099)
    at org.codehaus.groovy.ast.ClassCodeVisitorSupport.vi sitClass(ClassCodeVisitorSupport.java:54)
    at org.codehaus.groovy.control.StaticImportVisitor.vi sitClass(StaticImportVisitor.java:83)
    at org.codehaus.groovy.control.CompilationUnit$14.cal l(CompilationUnit.java:708)
    at org.codehaus.groovy.control.CompilationUnit.applyT oPrimaryClassNodes(CompilationUnit.java:1084)
    at org.codehaus.groovy.control.CompilationUnit.doPhas eOperation(CompilationUnit.java:640)
    at org.codehaus.groovy.control.CompilationUnit.proces sPhaseOperations(CompilationUnit.java:618)
    at org.codehaus.groovy.control.CompilationUnit.compil e(CompilationUnit.java:595)
    at groovy.lang.GroovyClassLoader.doParseClass(GroovyC lassLoader.java:401)
    at groovy.lang.GroovyClassLoader.access$300(GroovyCla ssLoader.java:89)
    at groovy.lang.GroovyClassLoader$5.provide(GroovyClas sLoader.java:341)
    at groovy.lang.GroovyClassLoader$5.provide(GroovyClas sLoader.java:338)
    at org.codehaus.groovy.runtime.memoize.ConcurrentComm onCache.getAndPut(ConcurrentCommonCache.java:147)
    at groovy.lang.GroovyClassLoader.parseClass(GroovyCla ssLoader.java:336)
    at org.gradle.groovy.scripts.internal.DefaultScriptCo mpilationHandler.compileScript(DefaultScriptCompil ationHandler.java:139)
    at org.gradle.groovy.scripts.internal.DefaultScriptCo mpilationHandler.compileToDir(DefaultScriptCompila tionHandler.java:95)
    at org.gradle.groovy.scripts.internal.BuildOperationB ackedScriptCompilationHandler$2.run(BuildOperation BackedScriptCompilationHandler.java:54)
    at org.gradle.internal.operations.DefaultBuildOperati onRunner$1.execute(DefaultBuildOperationRunner.jav a:29)
    at org.gradle.internal.operations.DefaultBuildOperati onRunner$1.execute(DefaultBuildOperationRunner.jav a:26)
    at org.gradle.internal.operations.DefaultBuildOperati onRunner$3.execute(DefaultBuildOperationRunner.jav a:75)
    at org.gradle.internal.operations.DefaultBuildOperati onRunner$3.execute(DefaultBuildOperationRunner.jav a:68)
    at org.gradle.internal.operations.DefaultBuildOperati onRunner.execute(DefaultBuildOperationRunner.java: 153)
    at org.gradle.internal.operations.DefaultBuildOperati onRunner.execute(DefaultBuildOperationRunner.java: 68)
    at org.gradle.internal.operations.DefaultBuildOperati onRunner.run(DefaultBuildOperationRunner.java:56)
    at org.gradle.internal.operations.DefaultBuildOperati onExecutor.lambda$run$1(DefaultBuildOperationExecu tor.java:71)
    at org.gradle.internal.operations.UnmanagedBuildOpera tionWrapper.runWithUnmanagedSupport(UnmanagedBuild OperationWrapper.java:45)
    at org.gradle.internal.operations.DefaultBuildOperati onExecutor.run(DefaultBuildOperationExecutor.java: 71)
    at org.gradle.groovy.scripts.internal.BuildOperationB ackedScriptCompilationHandler.compileToDir(BuildOp erationBackedScriptCompilationHandler.java:51)
    at org.gradle.groovy.scripts.internal.FileCacheBacked ScriptClassCompiler$CompileToCrossBuildCacheAction .execute(FileCacheBackedScriptClassCompiler.java:1 90)
    at org.gradle.groovy.scripts.internal.FileCacheBacked ScriptClassCompiler$CompileToCrossBuildCacheAction .execute(FileCacheBackedScriptClassCompiler.java:1 70)
    at org.gradle.groovy.scripts.internal.FileCacheBacked ScriptClassCompiler$ProgressReportingInitializer.e xecute(FileCacheBackedScriptClassCompiler.java:211 )
    at org.gradle.groovy.scripts.internal.FileCacheBacked ScriptClassCompiler$ProgressReportingInitializer.e xecute(FileCacheBackedScriptClassCompiler.java:194 )
    at org.gradle.cache.internal.DefaultPersistentDirecto ryCache$Initializer.initialize(DefaultPersistentDi rectoryCache.java:100)
    at org.gradle.cache.internal.FixedSharedModeCrossProc essCacheAccess$1.run(FixedSharedModeCrossProcessCa cheAccess.java:86)
    at org.gradle.cache.internal.DefaultFileLockManager$D efaultFileLock.doWriteAction(DefaultFileLockManage r.java:215)
    at org.gradle.cache.internal.DefaultFileLockManager$D efaultFileLock.writeFile(DefaultFileLockManager.ja va:205)
    at org.gradle.cache.internal.FixedSharedModeCrossProc essCacheAccess.open(FixedSharedModeCrossProcessCac heAccess.java:83)
    at org.gradle.cache.internal.DefaultCacheAccess.open( DefaultCacheAccess.java:139)
    at org.gradle.cache.internal.DefaultPersistentDirecto ryStore.open(DefaultPersistentDirectoryStore.java: 78)
    at org.gradle.cache.internal.DefaultPersistentDirecto ryStore.open(DefaultPersistentDirectoryStore.java: 42)
    at org.gradle.cache.internal.DefaultCacheFactory.doOp en(DefaultCacheFactory.java:95)
    at org.gradle.cache.internal.DefaultCacheFactory.open (DefaultCacheFactory.java:68)
    at org.gradle.cache.internal.DefaultCacheRepository$P ersistentCacheBuilder.open(DefaultCacheRepository. java:126)
    at org.gradle.groovy.scripts.internal.FileCacheBacked ScriptClassCompiler.compile(FileCacheBackedScriptC lassCompiler.java:116)
    at org.gradle.groovy.scripts.internal.CrossBuildInMem oryCachingScriptClassCache.getOrCompile(CrossBuild InMemoryCachingScriptClassCache.java:50)
    at org.gradle.groovy.scripts.internal.BuildScopeInMem oryCachingScriptClassCompiler.compile(BuildScopeIn MemoryCachingScriptClassCompiler.java:50)
    at org.gradle.groovy.scripts.DefaultScriptCompilerFac tory$ScriptCompilerImpl.compile(DefaultScriptCompi lerFactory.java:49)
    at org.gradle.configuration.DefaultScriptPluginFactor y$ScriptPluginImpl.apply(DefaultScriptPluginFactor y.java:125)
    at org.gradle.configuration.BuildOperationScriptPlugi n$1.run(BuildOperationScriptPlugin.java:65)
    at org.gradle.internal.operations.DefaultBuildOperati onRunner$1.execute(DefaultBuildOperationRunner.jav a:29)
    at org.gradle.internal.operations.DefaultBuildOperati onRunner$1.execute(DefaultBuildOperationRunner.jav a:26)
    at org.gradle.internal.operations.DefaultBuildOperati onRunner$3.execute(DefaultBuildOperationRunner.jav a:75)
    at org.gradle.internal.operations.DefaultBuildOperati onRunner$3.execute(DefaultBuildOperationRunner.jav a:68)
    at org.gradle.internal.operations.DefaultBuildOperati onRunner.execute(DefaultBuildOperationRunner.java: 153)
    at org.gradle.internal.operations.DefaultBuildOperati onRunner.execute(DefaultBuildOperationRunner.java: 68)
    at org.gradle.internal.operations.DefaultBuildOperati onRunner.run(DefaultBuildOperationRunner.java:56)
    at org.gradle.internal.operations.DefaultBuildOperati onExecutor.lambda$run$1(DefaultBuildOperationExecu tor.java:71)
    at org.gradle.internal.operations.UnmanagedBuildOpera tionWrapper.runWithUnmanagedSupport(UnmanagedBuild OperationWrapper.java:45)
    at org.gradle.internal.operations.DefaultBuildOperati onExecutor.run(DefaultBuildOperationExecutor.java: 71)
    at org.gradle.configuration.BuildOperationScriptPlugi n.lambda$apply$0(BuildOperationScriptPlugin.java:6 2)
    at org.gradle.configuration.internal.DefaultUserCodeA pplicationContext.apply(DefaultUserCodeApplication Context.java:43)
    at org.gradle.configuration.BuildOperationScriptPlugi n.apply(BuildOperationScriptPlugin.java:62)
    at org.gradle.initialization.ScriptEvaluatingSettings Processor.applySettingsScript(ScriptEvaluatingSett ingsProcessor.java:74)
    at org.gradle.initialization.ScriptEvaluatingSettings Processor.process(ScriptEvaluatingSettingsProcesso r.java:67)
    at org.gradle.initialization.SettingsEvaluatedCallbac kFiringSettingsProcessor.process(SettingsEvaluated CallbackFiringSettingsProcessor.java:34)
    at org.gradle.initialization.RootBuildCacheController SettingsProcessor.process(RootBuildCacheController SettingsProcessor.java:36)
    at org.gradle.initialization.BuildOperationSettingsPr ocessor$2.call(BuildOperationSettingsProcessor.jav a:50)
    at org.gradle.initialization.BuildOperationSettingsPr ocessor$2.call(BuildOperationSettingsProcessor.jav a:47)
    at org.gradle.internal.operations.DefaultBuildOperati onRunner$CallableBuildOperationWorker.execute(Defa ultBuildOperationRunner.java:200)
    at org.gradle.internal.operations.DefaultBuildOperati onRunner$CallableBuildOperationWorker.execute(Defa ultBuildOperationRunner.java:195)
    at org.gradle.internal.operations.DefaultBuildOperati onRunner$3.execute(DefaultBuildOperationRunner.jav a:75)
    at org.gradle.internal.operations.DefaultBuildOperati onRunner$3.execute(DefaultBuildOperationRunner.jav a:68)
    at org.gradle.internal.operations.DefaultBuildOperati onRunner.execute(DefaultBuildOperationRunner.java: 153)
    at org.gradle.internal.operations.DefaultBuildOperati onRunner.execute(DefaultBuildOperationRunner.java: 68)
    at org.gradle.internal.operations.DefaultBuildOperati onRunner.call(DefaultBuildOperationRunner.java:62)
    at org.gradle.internal.operations.DefaultBuildOperati onExecutor.lambda$call$2(DefaultBuildOperationExec utor.java:76)
    at org.gradle.internal.operations.UnmanagedBuildOpera tionWrapper.callWithUnmanagedSupport(UnmanagedBuil dOperationWrapper.java:54)
    at org.gradle.internal.operations.DefaultBuildOperati onExecutor.call(DefaultBuildOperationExecutor.java :76)
    at org.gradle.initialization.BuildOperationSettingsPr ocessor.process(BuildOperationSettingsProcessor.ja va:47)
    at org.gradle.initialization.DefaultSettingsLoader.fi ndSettingsAndLoadIfAppropriate(DefaultSettingsLoad er.java:120)
    at org.gradle.initialization.DefaultSettingsLoader.fi ndAndLoadSettings(DefaultSettingsLoader.java:58)
    at org.gradle.initialization.SettingsAttachingSetting sLoader.findAndLoadSettings(SettingsAttachingSetti ngsLoader.java:35)
    at org.gradle.internal.composite.CommandLineIncludedB uildSettingsLoader.findAndLoadSettings(CommandLine IncludedBuildSettingsLoader.java:34)
    at org.gradle.internal.composite.ChildBuildRegisterin gSettingsLoader.findAndLoadSettings(ChildBuildRegi steringSettingsLoader.java:52)
    at org.gradle.internal.composite.CompositeBuildSettin gsLoader.findAndLoadSettings(CompositeBuildSetting sLoader.java:35)
    at org.gradle.initialization.DefaultSettingsPreparer. prepareSettings(DefaultSettingsPreparer.java:36)
    at org.gradle.initialization.BuildOperationFiringSett ingsPreparer$LoadBuild.doLoadBuild(BuildOperationF iringSettingsPreparer.java:59)
    at org.gradle.initialization.BuildOperationFiringSett ingsPreparer$LoadBuild.run(BuildOperationFiringSet tingsPreparer.java:54)
    at org.gradle.internal.operations.DefaultBuildOperati onRunner$1.execute(DefaultBuildOperationRunner.jav a:29)
    at org.gradle.internal.operations.DefaultBuildOperati onRunner$1.execute(DefaultBuildOperationRunner.jav a:26)
    at org.gradle.internal.operations.DefaultBuildOperati onRunner$3.execute(DefaultBuildOperationRunner.jav a:75)
    at org.gradle.internal.operations.DefaultBuildOperati onRunner$3.execute(DefaultBuildOperationRunner.jav a:68)
    at org.gradle.internal.operations.DefaultBuildOperati onRunner.execute(DefaultBuildOperationRunner.java: 153)
    at org.gradle.internal.operations.DefaultBuildOperati onRunner.execute(DefaultBuildOperationRunner.java: 68)
    at org.gradle.internal.operations.DefaultBuildOperati onRunner.run(DefaultBuildOperationRunner.java:56)
    at org.gradle.internal.operations.DefaultBuildOperati onExecutor.lambda$run$1(DefaultBuildOperationExecu tor.java:71)
    at org.gradle.internal.operations.UnmanagedBuildOpera tionWrapper.runWithUnmanagedSupport(UnmanagedBuild OperationWrapper.java:45)
    at org.gradle.internal.operations.DefaultBuildOperati onExecutor.run(DefaultBuildOperationExecutor.java: 71)
    at org.gradle.initialization.BuildOperationFiringSett ingsPreparer.prepareSettings(BuildOperationFiringS ettingsPreparer.java:42)
    at org.gradle.initialization.DefaultGradleLauncher.pr epareSettings(DefaultGradleLauncher.java:220)
    at org.gradle.initialization.DefaultGradleLauncher.do ClassicBuildStages(DefaultGradleLauncher.java:161)
    at org.gradle.initialization.DefaultGradleLauncher.do BuildStages(DefaultGradleLauncher.java:150)
    at org.gradle.initialization.DefaultGradleLauncher.ex ecuteTasks(DefaultGradleLauncher.java:126)
    at org.gradle.internal.invocation.GradleBuildControll er$1.create(GradleBuildController.java:72)
    at org.gradle.internal.invocation.GradleBuildControll er$1.create(GradleBuildController.java:67)
    at org.gradle.internal.work.DefaultWorkerLeaseService .withLocks(DefaultWorkerLeaseService.java:178)
    at org.gradle.internal.invocation.GradleBuildControll er.doBuild(GradleBuildController.java:67)
    at org.gradle.internal.invocation.GradleBuildControll er.run(GradleBuildController.java:56)
    at org.gradle.tooling.internal.provider.ExecuteBuildA ctionRunner.run(ExecuteBuildActionRunner.java:31)
    at org.gradle.launcher.exec.ChainingBuildActionRunner .run(ChainingBuildActionRunner.java:35)
    at org.gradle.launcher.exec.BuildOutcomeReportingBuil dActionRunner.run(BuildOutcomeReportingBuildAction Runner.java:63)
    at org.gradle.tooling.internal.provider.ValidatingBui ldActionRunner.run(ValidatingBuildActionRunner.jav a:32)
    at org.gradle.tooling.internal.provider.FileSystemWat chingBuildActionRunner.run(FileSystemWatchingBuild ActionRunner.java:67)
    at org.gradle.launcher.exec.BuildCompletionNotifyingB uildActionRunner.run(BuildCompletionNotifyingBuild ActionRunner.java:41)
    at org.gradle.launcher.exec.RunAsBuildOperationBuildA ctionRunner$3.call(RunAsBuildOperationBuildActionR unner.java:49)
    at org.gradle.launcher.exec.RunAsBuildOperationBuildA ctionRunner$3.call(RunAsBuildOperationBuildActionR unner.java:44)
    at org.gradle.internal.operations.DefaultBuildOperati onRunner$CallableBuildOperationWorker.execute(Defa ultBuildOperationRunner.java:200)
    at org.gradle.internal.operations.DefaultBuildOperati onRunner$CallableBuildOperationWorker.execute(Defa ultBuildOperationRunner.java:195)
    at org.gradle.internal.operations.DefaultBuildOperati onRunner$3.execute(DefaultBuildOperationRunner.jav a:75)
    at org.gradle.internal.operations.DefaultBuildOperati onRunner$3.execute(DefaultBuildOperationRunner.jav a:68)
    at org.gradle.internal.operations.DefaultBuildOperati onRunner.execute(DefaultBuildOperationRunner.java: 153)
    at org.gradle.internal.operations.DefaultBuildOperati onRunner.execute(DefaultBuildOperationRunner.java: 68)
    at org.gradle.internal.operations.DefaultBuildOperati onRunner.call(DefaultBuildOperationRunner.java:62)
    at org.gradle.internal.operations.DefaultBuildOperati onExecutor.lambda$call$2(DefaultBuildOperationExec utor.java:76)
    at org.gradle.internal.operations.UnmanagedBuildOpera tionWrapper.callWithUnmanagedSupport(UnmanagedBuil dOperationWrapper.java:54)
    at org.gradle.internal.operations.DefaultBuildOperati onExecutor.call(DefaultBuildOperationExecutor.java :76)
    at org.gradle.launcher.exec.RunAsBuildOperationBuildA ctionRunner.run(RunAsBuildOperationBuildActionRunn er.java:44)
    at org.gradle.launcher.exec.InProcessBuildActionExecu ter.lambda$execute$0(InProcessBuildActionExecuter. java:54)
    at org.gradle.composite.internal.DefaultRootBuildStat e.run(DefaultRootBuildState.java:87)
    at org.gradle.launcher.exec.InProcessBuildActionExecu ter.execute(InProcessBuildActionExecuter.java:53)
    at org.gradle.launcher.exec.InProcessBuildActionExecu ter.execute(InProcessBuildActionExecuter.java:29)
    at org.gradle.launcher.exec.BuildTreeScopeLifecycleBu ildActionExecuter.lambda$execute$0(BuildTreeScopeL ifecycleBuildActionExecuter.java:33)
    at org.gradle.internal.buildtree.BuildTreeState.run(B uildTreeState.java:49)
    at org.gradle.launcher.exec.BuildTreeScopeLifecycleBu ildActionExecuter.execute(BuildTreeScopeLifecycleB uildActionExecuter.java:32)
    at org.gradle.launcher.exec.BuildTreeScopeLifecycleBu ildActionExecuter.execute(BuildTreeScopeLifecycleB uildActionExecuter.java:27)
    at org.gradle.tooling.internal.provider.ContinuousBui ldActionExecuter.execute(ContinuousBuildActionExec uter.java:104)
    at org.gradle.tooling.internal.provider.ContinuousBui ldActionExecuter.execute(ContinuousBuildActionExec uter.java:55)
    at org.gradle.tooling.internal.provider.SubscribableB uildActionExecuter.execute(SubscribableBuildAction Executer.java:64)
    at org.gradle.tooling.internal.provider.SubscribableB uildActionExecuter.execute(SubscribableBuildAction Executer.java:37)
    at org.gradle.tooling.internal.provider.SessionScopeL ifecycleBuildActionExecuter.lambda$execute$0(Sessi onScopeLifecycleBuildActionExecuter.java:54)
    at org.gradle.internal.session.BuildSessionState.run( BuildSessionState.java:67)
    at org.gradle.tooling.internal.provider.SessionScopeL ifecycleBuildActionExecuter.execute(SessionScopeLi fecycleBuildActionExecuter.java:50)
    at org.gradle.tooling.internal.provider.SessionScopeL ifecycleBuildActionExecuter.execute(SessionScopeLi fecycleBuildActionExecuter.java:36)
    at org.gradle.tooling.internal.provider.GradleThreadB uildActionExecuter.execute(GradleThreadBuildAction Executer.java:36)
    at org.gradle.tooling.internal.provider.GradleThreadB uildActionExecuter.execute(GradleThreadBuildAction Executer.java:25)
    at org.gradle.tooling.internal.provider.StartParamsVa lidatingActionExecuter.execute(StartParamsValidati ngActionExecuter.java:59)
    at org.gradle.tooling.internal.provider.StartParamsVa lidatingActionExecuter.execute(StartParamsValidati ngActionExecuter.java:31)
    at org.gradle.tooling.internal.provider.SessionFailur eReportingActionExecuter.execute(SessionFailureRep ortingActionExecuter.java:55)
    at org.gradle.tooling.internal.provider.SessionFailur eReportingActionExecuter.execute(SessionFailureRep ortingActionExecuter.java:41)
    at org.gradle.tooling.internal.provider.SetupLoggingA ctionExecuter.execute(SetupLoggingActionExecuter.j ava:47)
    at org.gradle.tooling.internal.provider.SetupLoggingA ctionExecuter.execute(SetupLoggingActionExecuter.j ava:31)
    at org.gradle.launcher.daemon.server.exec.ExecuteBuil d.doBuild(ExecuteBuild.java:65)
    at org.gradle.launcher.daemon.server.exec.BuildComman dOnly.execute(BuildCommandOnly.java:37)
    at org.gradle.launcher.daemon.server.api.DaemonComman dExecution.proceed(DaemonCommandExecution.java:104 )
    at org.gradle.launcher.daemon.server.exec.WatchForDis connection.execute(WatchForDisconnection.java:39)
    at org.gradle.launcher.daemon.server.api.DaemonComman dExecution.proceed(DaemonCommandExecution.java:104 )
    at org.gradle.launcher.daemon.server.exec.ResetDeprec ationLogger.execute(ResetDeprecationLogger.java:29 )
    at org.gradle.launcher.daemon.server.api.DaemonComman dExecution.proceed(DaemonCommandExecution.java:104 )
    at org.gradle.launcher.daemon.server.exec.RequestStop IfSingleUsedDaemon.execute(RequestStopIfSingleUsed Daemon.java:35)
    at org.gradle.launcher.daemon.server.api.DaemonComman dExecution.proceed(DaemonCommandExecution.java:104 )
    at org.gradle.launcher.daemon.server.exec.ForwardClie ntInput$2.create(ForwardClientInput.java:78)
    at org.gradle.launcher.daemon.server.exec.ForwardClie ntInput$2.create(ForwardClientInput.java:75)
    at org.gradle.util.Swapper.swap(Swapper.java:38)
    at org.gradle.launcher.daemon.server.exec.ForwardClie ntInput.execute(ForwardClientInput.java:75)
    at org.gradle.launcher.daemon.server.api.DaemonComman dExecution.proceed(DaemonCommandExecution.java:104 )
    at org.gradle.launcher.daemon.server.exec.LogAndCheck Health.execute(LogAndCheckHealth.java:55)
    at org.gradle.launcher.daemon.server.api.DaemonComman dExecution.proceed(DaemonCommandExecution.java:104 )
    at org.gradle.launcher.daemon.server.exec.LogToClient .doBuild(LogToClient.java:63)
    at org.gradle.launcher.daemon.server.exec.BuildComman dOnly.execute(BuildCommandOnly.java:37)
    at org.gradle.launcher.daemon.server.api.DaemonComman dExecution.proceed(DaemonCommandExecution.java:104 )
    at org.gradle.launcher.daemon.server.exec.EstablishBu ildEnvironment.doBuild(EstablishBuildEnvironment.j ava:84)
    at org.gradle.launcher.daemon.server.exec.BuildComman dOnly.execute(BuildCommandOnly.java:37)
    at org.gradle.launcher.daemon.server.api.DaemonComman dExecution.proceed(DaemonCommandExecution.java:104 )
    at org.gradle.launcher.daemon.server.exec.StartBuildO rRespondWithBusy$1.run(StartBuildOrRespondWithBusy .java:52)
    at org.gradle.launcher.daemon.server.DaemonStateCoord inator$1.run(DaemonStateCoordinator.java:297)
    at org.gradle.internal.concurrent.ExecutorPolicy$Catc hAndRecordFailures.onExecute(ExecutorPolicy.java:6 4)
    at org.gradle.internal.concurrent.ManagedExecutorImpl $1.run(ManagedExecutorImpl.java:48)
    at java.base/java.util.concurrent.ThreadPoolExecutor.runWorker( ThreadPoolExecutor.java:1130)
    at java.base/java.util.concurrent.ThreadPoolExecutor$Worker.run (ThreadPoolExecutor.java:630)
    at org.gradle.internal.concurrent.ThreadFactoryImpl$M anagedThreadRunnable.run(ThreadFactoryImpl.java:56 )
    at java.base/java.lang.Thread.run(Thread.java:831)

    1 error


    * Try:
    Run with --stacktrace option to get the stack trace. Run with --info or --debug option to get more log output. Run with --scan to get full insights.

    * Get more help at https://help.gradle.org

    BUILD FAILED in 778ms

Similar Threads

  1. What about text to speech on Android?
    By evi1ove in forum Android Export Module 2.5
    Replies: 0
    Last Post: 14th March 2020, 04:46 PM
  2. Developer needed (Paid Request): Android text to Speech extension
    By ratty in forum Android Export Module 2.5
    Replies: 7
    Last Post: 13th December 2019, 02:27 PM
  3. Text to Speech extension for PC?
    By 4_and_a_half_star_games in forum Fusion 2.5
    Replies: 5
    Last Post: 1st May 2016, 01:03 PM
  4. Text To Speech Extension Help
    By JLC in forum Multimedia Fusion 2 - Technical Support
    Replies: 1
    Last Post: 16th January 2010, 03:50 AM
  5. text to speech extension request
    By cel in forum Extension Development
    Replies: 13
    Last Post: 24th September 2006, 06:55 PM

Posting Permissions

  • You may not post new threads
  • You may not post replies
  • You may not post attachments
  • You may not edit your posts
  •