User Tag List

Page 1 of 2 1 2 LastLast
Results 1 to 10 of 13

Thread: Doesn't export api 31 and 32

  1. #1
    Clicker Fusion 2.5 (Steam)Fusion 2.5 Developer (Steam)Fusion 2.5+ DLC (Steam)Android Export Module (Steam)HTML5 Export Module (Steam)iOS Export Module (Steam)Mac Export Module (Steam)

    Join Date
    Jan 2021
    Posts
    9
    Mentioned
    0 Post(s)
    Tagged
    0 Thread(s)

    Doesn't export api 31 and 32

    Version 293.10
    I downloaded all api in android studio
    I can export android 12 with 30 api, but it causes a crash on android 12, when i set it to 31 or above, it just give me this error:
    > Task :app:preBuild UP-TO-DATE
    > Task :app:preReleaseBuild UP-TO-DATE
    > Task :app:writeReleaseApplicationId
    > Task :app:analyticsRecordingRelease
    > Task :app:compileReleaseRenderscript NO-SOURCE
    > Task :app:generateReleaseResValues
    > Task :app:generateReleaseResources
    > Task :app:createReleaseCompatibleScreenManifests
    > Task :app:extractDeepLinksRelease
    > Task :app:processReleaseMainManifest
    > Task :app:processReleaseManifest
    > Task :app:processApplicationManifestReleaseForBundle
    > Task :app:checkReleaseDuplicateClasses
    > Task :app:compileReleaseAidl NO-SOURCE
    > Task :app:generateReleaseBuildConfig
    > Task :app:javaPreCompileRelease
    > Task :app:checkReleaseAarMetadata
    > Task :app:mergeReleaseShaders
    > Task :app:compileReleaseShaders NO-SOURCE
    > Task :app:generateReleaseAssets UP-TO-DATE
    > Task :app:mergeReleaseAssets
    > Task :app:processReleaseJavaRes NO-SOURCE
    > Task :app:processReleaseManifestForPackage
    > Task :app:desugarReleaseFileDependencies
    > Task :app:mergeReleaseJniLibFolders
    > Task :app:mergeReleaseResources
    > Task :app:mergeReleaseJavaResource
    aapt2.exe W 04-25 17:22:29 2260 10588 LoadedArsc.cpp:682] Unknown chunk type '200'.

    > Task :app:bundleReleaseResources
    aapt2.exe W 04-25 17:22:29 4392 4568 LoadedArsc.cpp:682] Unknown chunk type '200'.

    > Task :app:processReleaseResources
    > Task :app:collectReleaseDependencies
    > Task :app:mergeExtDexRelease
    > Task :app:mergeReleaseNativeLibs

    > Task :app:compileReleaseJavaWithJavac FAILED
    An exception has occurred in the compiler (1.8.0_242-release). Please file a bug against the Java compiler via the Java bug reporting page (http://bugreport.java.com) after checking the Bug Database (http://bugs.java.com) for duplicates. Include your program and the following diagnostic in your report. Thank you.
    java.lang.AssertionError: annotationType(): unrecognized Attribute name MODULE (class com.sun.tools.javac.util.UnsharedNameTable$NameImp l)
    at com.sun.tools.javac.util.Assert.error(Assert.java: 133)
    at com.sun.tools.javac.code.TypeAnnotations.annotatio nType(TypeAnnotations.java:231)
    at com.sun.tools.javac.code.TypeAnnotations$TypeAnnot ationPositions.separateAnnotationsKinds(TypeAnnota tions.java:294)
    at com.sun.tools.javac.code.TypeAnnotations$TypeAnnot ationPositions.visitMethodDef(TypeAnnotations.java :1066)
    at com.sun.tools.javac.tree.JCTree$JCMethodDecl.accep t(JCTree.java:778)
    at com.sun.tools.javac.tree.TreeScanner.scan(TreeScan ner.java:49)
    at com.sun.tools.javac.code.TypeAnnotations$TypeAnnot ationPositions.scan(TypeAnnotations.java:275)
    at com.sun.tools.javac.tree.TreeScanner.scan(TreeScan ner.java:57)
    at com.sun.tools.javac.code.TypeAnnotations$TypeAnnot ationPositions.visitClassDef(TypeAnnotations.java: 1042)
    at com.sun.tools.javac.tree.JCTree$JCClassDecl.accept (JCTree.java:693)
    at com.sun.tools.javac.tree.TreeScanner.scan(TreeScan ner.java:49)
    at com.sun.tools.javac.code.TypeAnnotations$TypeAnnot ationPositions.scan(TypeAnnotations.java:275)
    at com.sun.tools.javac.code.TypeAnnotations$1.run(Typ eAnnotations.java:127)
    at com.sun.tools.javac.comp.Annotate.flush(Annotate.j ava:152)
    at com.sun.tools.javac.comp.Annotate.enterDone(Annota te.java:129)
    at com.sun.tools.javac.comp.Enter.complete(Enter.java :512)
    at com.sun.tools.javac.comp.Enter.main(Enter.java:471 )
    at com.sun.tools.javac.main.JavaCompiler.enterTrees(J avaCompiler.java:982)
    at com.sun.tools.javac.main.JavaCompiler.compile(Java Compiler.java:857)
    at com.sun.tools.javac.main.Main.compile(Main.java:52 3)
    at com.sun.tools.javac.api.JavacTaskImpl.doCall(Javac TaskImpl.java:129)
    at com.sun.tools.javac.api.JavacTaskImpl.call(JavacTa skImpl.java:138)
    at org.gradle.internal.compiler.java.IncrementalCompi leTask.call(IncrementalCompileTask.java:77)
    at org.gradle.api.internal.tasks.compile.AnnotationPr ocessingCompileTask.call(AnnotationProcessingCompi leTask.java:94)
    at org.gradle.api.internal.tasks.compile.ResourceClea ningCompilationTask.call(ResourceCleaningCompilati onTask.java:57)
    at org.gradle.api.internal.tasks.compile.JdkJavaCompi ler.execute(JdkJavaCompiler.java:55)
    at org.gradle.api.internal.tasks.compile.JdkJavaCompi ler.execute(JdkJavaCompiler.java:40)
    at org.gradle.api.internal.tasks.compile.NormalizingJ avaCompiler.delegateAndHandleErrors(NormalizingJav aCompiler.java:97)
    at org.gradle.api.internal.tasks.compile.NormalizingJ avaCompiler.execute(NormalizingJavaCompiler.java:5 1)
    at org.gradle.api.internal.tasks.compile.NormalizingJ avaCompiler.execute(NormalizingJavaCompiler.java:3 7)
    at org.gradle.api.internal.tasks.compile.AnnotationPr ocessorDiscoveringCompiler.execute(AnnotationProce ssorDiscoveringCompiler.java:51)
    at org.gradle.api.internal.tasks.compile.AnnotationPr ocessorDiscoveringCompiler.execute(AnnotationProce ssorDiscoveringCompiler.java:37)
    at org.gradle.api.internal.tasks.compile.ModuleApplic ationNameWritingCompiler.execute(ModuleApplication NameWritingCompiler.java:46)
    at org.gradle.api.internal.tasks.compile.ModuleApplic ationNameWritingCompiler.execute(ModuleApplication NameWritingCompiler.java:36)
    at org.gradle.jvm.toolchain.internal.DefaultToolchain JavaCompiler.execute(DefaultToolchainJavaCompiler. java:57)
    at org.gradle.api.tasks.compile.JavaCompile.lambda$cr eateToolchainCompiler$1(JavaCompile.java:251)
    at org.gradle.api.internal.tasks.compile.CleaningJava Compiler.execute(CleaningJavaCompiler.java:53)
    at org.gradle.api.internal.tasks.compile.incremental. IncrementalCompilerFactory.lambda$createRebuildAll Compiler$0(IncrementalCompilerFactory.java:98)
    at org.gradle.api.internal.tasks.compile.incremental. IncrementalResultStoringCompiler.execute(Increment alResultStoringCompiler.java:61)
    at org.gradle.api.internal.tasks.compile.incremental. IncrementalResultStoringCompiler.execute(Increment alResultStoringCompiler.java:45)
    at org.gradle.api.internal.tasks.compile.CompileJavaB uildOperationReportingCompiler$2.call(CompileJavaB uildOperationReportingCompiler.java:59)
    at org.gradle.api.internal.tasks.compile.CompileJavaB uildOperationReportingCompiler$2.call(CompileJavaB uildOperationReportingCompiler.java:51)
    at org.gradle.internal.operations.DefaultBuildOperati onRunner$CallableBuildOperationWorker.execute(Defa ultBuildOperationRunner.java:200)
    at org.gradle.internal.operations.DefaultBuildOperati onRunner$CallableBuildOperationWorker.execute(Defa ultBuildOperationRunner.java:195)
    at org.gradle.internal.operations.DefaultBuildOperati onRunner$3.execute(DefaultBuildOperationRunner.jav a:75)
    at org.gradle.internal.operations.DefaultBuildOperati onRunner$3.execute(DefaultBuildOperationRunner.jav a:68)
    at org.gradle.internal.operations.DefaultBuildOperati onRunner.execute(DefaultBuildOperationRunner.java: 153)
    at org.gradle.internal.operations.DefaultBuildOperati onRunner.execute(DefaultBuildOperationRunner.java: 68)
    at org.gradle.internal.operations.DefaultBuildOperati onRunner.call(DefaultBuildOperationRunner.java:62)
    at org.gradle.internal.operations.DefaultBuildOperati onExecutor.lambda$call$2(DefaultBuildOperationExec utor.java:76)
    at org.gradle.internal.operations.UnmanagedBuildOpera tionWrapper.callWithUnmanagedSupport(UnmanagedBuil dOperationWrapper.java:54)
    at org.gradle.internal.operations.DefaultBuildOperati onExecutor.call(DefaultBuildOperationExecutor.java :76)
    at org.gradle.api.internal.tasks.compile.CompileJavaB uildOperationReportingCompiler.execute(CompileJava BuildOperationReportingCompiler.java:51)
    at org.gradle.api.tasks.compile.JavaCompile.performCo mpilation(JavaCompile.java:300)
    at org.gradle.api.tasks.compile.JavaCompile.performIn crementalCompilation(JavaCompile.java:179)
    at org.gradle.api.tasks.compile.JavaCompile.compile(J avaCompile.java:152)
    at sun.reflect.NativeMethodAccessorImpl.invoke0(Nativ e Method)
    at sun.reflect.NativeMethodAccessorImpl.invoke(Native MethodAccessorImpl.java:62)
    at sun.reflect.DelegatingMethodAccessorImpl.invoke(De legatingMethodAccessorImpl.java:43)
    at java.lang.reflect.Method.invoke(Method.java:498)
    at org.gradle.internal.reflect.JavaMethod.invoke(Java Method.java:104)
    at org.gradle.api.internal.project.taskfactory.Increm entalInputsTaskAction.doExecute(IncrementalInputsT askAction.java:32)
    at org.gradle.api.internal.project.taskfactory.Standa rdTaskAction.execute(StandardTaskAction.java:51)
    at org.gradle.api.internal.project.taskfactory.Abstra ctIncrementalTaskAction.execute(AbstractIncrementa lTaskAction.java:25)
    at org.gradle.api.internal.project.taskfactory.Standa rdTaskAction.execute(StandardTaskAction.java:29)
    at org.gradle.api.internal.tasks.execution.ExecuteAct ionsTaskExecuter$2.run(ExecuteActionsTaskExecuter. java:498)
    at org.gradle.internal.operations.DefaultBuildOperati onRunner$1.execute(DefaultBuildOperationRunner.jav a:29)
    at org.gradle.internal.operations.DefaultBuildOperati onRunner$1.execute(DefaultBuildOperationRunner.jav a:26)
    at org.gradle.internal.operations.DefaultBuildOperati onRunner$3.execute(DefaultBuildOperationRunner.jav a:75)
    at org.gradle.internal.operations.DefaultBuildOperati onRunner$3.execute(DefaultBuildOperationRunner.jav a:68)
    at org.gradle.internal.operations.DefaultBuildOperati onRunner.execute(DefaultBuildOperationRunner.java: 153)
    at org.gradle.internal.operations.DefaultBuildOperati onRunner.execute(DefaultBuildOperationRunner.java: 68)
    at org.gradle.internal.operations.DefaultBuildOperati onRunner.run(DefaultBuildOperationRunner.java:56)
    at org.gradle.internal.operations.DefaultBuildOperati onExecutor.lambda$run$1(DefaultBuildOperationExecu tor.java:71)
    at org.gradle.internal.operations.UnmanagedBuildOpera tionWrapper.runWithUnmanagedSupport(UnmanagedBuild OperationWrapper.java:45)
    at org.gradle.internal.operations.DefaultBuildOperati onExecutor.run(DefaultBuildOperationExecutor.java: 71)
    at org.gradle.api.internal.tasks.execution.ExecuteAct ionsTaskExecuter.executeAction(ExecuteActionsTaskE xecuter.java:483)
    at org.gradle.api.internal.tasks.execution.ExecuteAct ionsTaskExecuter.executeActions(ExecuteActionsTask Executer.java:466)
    at org.gradle.api.internal.tasks.execution.ExecuteAct ionsTaskExecuter.access$300(ExecuteActionsTaskExec uter.java:105)
    at org.gradle.api.internal.tasks.execution.ExecuteAct ionsTaskExecuter$TaskExecution.executeWithPrevious OutputFiles(ExecuteActionsTaskExecuter.java:270)
    at org.gradle.api.internal.tasks.execution.ExecuteAct ionsTaskExecuter$TaskExecution.execute(ExecuteActi onsTaskExecuter.java:248)
    at org.gradle.internal.execution.steps.ExecuteStep.ex ecuteInternal(ExecuteStep.java:83)
    at org.gradle.internal.execution.steps.ExecuteStep.ac cess$000(ExecuteStep.java:37)
    at org.gradle.internal.execution.steps.ExecuteStep$1. call(ExecuteStep.java:50)
    at org.gradle.internal.execution.steps.ExecuteStep$1. call(ExecuteStep.java:47)
    at org.gradle.internal.operations.DefaultBuildOperati onRunner$CallableBuildOperationWorker.execute(Defa ultBuildOperationRunner.java:200)
    at org.gradle.internal.operations.DefaultBuildOperati onRunner$CallableBuildOperationWorker.execute(Defa ultBuildOperationRunner.java:195)
    at org.gradle.internal.operations.DefaultBuildOperati onRunner$3.execute(DefaultBuildOperationRunner.jav a:75)
    at org.gradle.internal.operations.DefaultBuildOperati onRunner$3.execute(DefaultBuildOperationRunner.jav a:68)
    at org.gradle.internal.operations.DefaultBuildOperati onRunner.execute(DefaultBuildOperationRunner.java: 153)
    at org.gradle.internal.operations.DefaultBuildOperati onRunner.execute(DefaultBuildOperationRunner.java: 68)
    at org.gradle.internal.operations.DefaultBuildOperati onRunner.call(DefaultBuildOperationRunner.java:62)
    at org.gradle.internal.operations.DefaultBuildOperati onExecutor.lambda$call$2(DefaultBuildOperationExec utor.java:76)
    at org.gradle.internal.operations.UnmanagedBuildOpera tionWrapper.callWithUnmanagedSupport(UnmanagedBuil dOperationWrapper.java:54)
    at org.gradle.internal.operations.DefaultBuildOperati onExecutor.call(DefaultBuildOperationExecutor.java :76)
    at org.gradle.internal.execution.steps.ExecuteStep.ex ecute(ExecuteStep.java:47)
    at org.gradle.internal.execution.steps.ExecuteStep.ex ecute(ExecuteStep.java:37)
    at org.gradle.internal.execution.steps.RemovePrevious OutputsStep.execute(RemovePreviousOutputsStep.java :68)
    at org.gradle.internal.execution.steps.RemovePrevious OutputsStep.execute(RemovePreviousOutputsStep.java :38)
    at org.gradle.internal.execution.steps.ResolveInputCh angesStep.execute(ResolveInputChangesStep.java:50)
    at org.gradle.internal.execution.steps.ResolveInputCh angesStep.execute(ResolveInputChangesStep.java:36)
    at org.gradle.internal.execution.steps.CancelExecutio nStep.execute(CancelExecutionStep.java:41)
    at org.gradle.internal.execution.steps.TimeoutStep.ex ecuteWithoutTimeout(TimeoutStep.java:74)
    at org.gradle.internal.execution.steps.TimeoutStep.ex ecute(TimeoutStep.java:55)
    at org.gradle.internal.execution.steps.CreateOutputsS tep.execute(CreateOutputsStep.java:51)
    at org.gradle.internal.execution.steps.CreateOutputsS tep.execute(CreateOutputsStep.java:29)
    at org.gradle.internal.execution.steps.CaptureStateAf terExecutionStep.execute(CaptureStateAfterExecutio nStep.java:54)
    at org.gradle.internal.execution.steps.CaptureStateAf terExecutionStep.execute(CaptureStateAfterExecutio nStep.java:35)
    at org.gradle.internal.execution.steps.BroadcastChang ingOutputsStep.execute(BroadcastChangingOutputsSte p.java:60)
    at org.gradle.internal.execution.steps.BroadcastChang ingOutputsStep.execute(BroadcastChangingOutputsSte p.java:27)
    at org.gradle.internal.execution.steps.BuildCacheStep .executeWithoutCache(BuildCacheStep.java:174)
    at org.gradle.internal.execution.steps.BuildCacheStep .execute(BuildCacheStep.java:74)
    at org.gradle.internal.execution.steps.BuildCacheStep .execute(BuildCacheStep.java:45)
    at org.gradle.internal.execution.steps.StoreExecution StateStep.execute(StoreExecutionStateStep.java:40)
    at org.gradle.internal.execution.steps.StoreExecution StateStep.execute(StoreExecutionStateStep.java:29)
    at org.gradle.internal.execution.steps.RecordOutputsS tep.execute(RecordOutputsStep.java:36)
    at org.gradle.internal.execution.steps.RecordOutputsS tep.execute(RecordOutputsStep.java:22)
    at org.gradle.internal.execution.steps.SkipUpToDateSt ep.executeBecause(SkipUpToDateStep.java:99)
    at org.gradle.internal.execution.steps.SkipUpToDateSt ep.lambda$execute$0(SkipUpToDateStep.java:92)
    at java.util.Optional.map(Optional.java:215)
    at org.gradle.internal.execution.steps.SkipUpToDateSt ep.execute(SkipUpToDateStep.java:52)
    at org.gradle.internal.execution.steps.SkipUpToDateSt ep.execute(SkipUpToDateStep.java:36)
    at org.gradle.internal.execution.steps.ResolveChanges Step.execute(ResolveChangesStep.java:84)
    at org.gradle.internal.execution.steps.ResolveChanges Step.execute(ResolveChangesStep.java:41)
    at org.gradle.internal.execution.steps.legacy.MarkSna pshottingInputsFinishedStep.execute(MarkSnapshotti ngInputsFinishedStep.java:37)
    at org.gradle.internal.execution.steps.legacy.MarkSna pshottingInputsFinishedStep.execute(MarkSnapshotti ngInputsFinishedStep.java:27)
    at org.gradle.internal.execution.steps.ResolveCaching StateStep.execute(ResolveCachingStateStep.java:91)
    at org.gradle.internal.execution.steps.ResolveCaching StateStep.execute(ResolveCachingStateStep.java:49)
    at org.gradle.internal.execution.steps.CaptureStateBe foreExecutionStep.execute(CaptureStateBeforeExecut ionStep.java:78)
    at org.gradle.internal.execution.steps.CaptureStateBe foreExecutionStep.execute(CaptureStateBeforeExecut ionStep.java:49)
    at org.gradle.internal.execution.steps.ValidateStep.e xecute(ValidateStep.java:105)
    at org.gradle.internal.execution.steps.ValidateStep.e xecute(ValidateStep.java:50)
    at org.gradle.internal.execution.steps.SkipEmptyWorkS tep.lambda$execute$2(SkipEmptyWorkStep.java:86)
    at java.util.Optional.orElseGet(Optional.java:267)
    at org.gradle.internal.execution.steps.SkipEmptyWorkS tep.execute(SkipEmptyWorkStep.java:86)
    at org.gradle.internal.execution.steps.SkipEmptyWorkS tep.execute(SkipEmptyWorkStep.java:32)
    at org.gradle.internal.execution.steps.legacy.MarkSna pshottingInputsStartedStep.execute(MarkSnapshottin gInputsStartedStep.java:38)
    at org.gradle.internal.execution.steps.LoadExecutionS tateStep.execute(LoadExecutionStateStep.java:43)
    at org.gradle.internal.execution.steps.LoadExecutionS tateStep.execute(LoadExecutionStateStep.java:31)
    at org.gradle.internal.execution.steps.AssignWorkspac eStep.lambda$execute$0(AssignWorkspaceStep.java:40 )
    at org.gradle.api.internal.tasks.execution.ExecuteAct ionsTaskExecuter$TaskExecution$2.withWorkspace(Exe cuteActionsTaskExecuter.java:283)
    at org.gradle.internal.execution.steps.AssignWorkspac eStep.execute(AssignWorkspaceStep.java:40)
    at org.gradle.internal.execution.steps.AssignWorkspac eStep.execute(AssignWorkspaceStep.java:30)
    at org.gradle.internal.execution.steps.IdentityCacheS tep.execute(IdentityCacheStep.java:37)
    at org.gradle.internal.execution.steps.IdentityCacheS tep.execute(IdentityCacheStep.java:27)
    at org.gradle.internal.execution.steps.IdentifyStep.e xecute(IdentifyStep.java:49)
    at org.gradle.internal.execution.steps.IdentifyStep.e xecute(IdentifyStep.java:35)
    at org.gradle.internal.execution.impl.DefaultExecutio nEngine$1.execute(DefaultExecutionEngine.java:76)
    at org.gradle.api.internal.tasks.execution.ExecuteAct ionsTaskExecuter.executeIfValid(ExecuteActionsTask Executer.java:184)
    at org.gradle.api.internal.tasks.execution.ExecuteAct ionsTaskExecuter.execute(ExecuteActionsTaskExecute r.java:173)
    at org.gradle.api.internal.tasks.execution.CleanupSta leOutputsExecuter.execute(CleanupStaleOutputsExecu ter.java:109)
    at org.gradle.api.internal.tasks.execution.FinalizePr opertiesTaskExecuter.execute(FinalizePropertiesTas kExecuter.java:46)
    at org.gradle.api.internal.tasks.execution.ResolveTas kExecutionModeExecuter.execute(ResolveTaskExecutio nModeExecuter.java:51)
    at org.gradle.api.internal.tasks.execution.SkipTaskWi thNoActionsExecuter.execute(SkipTaskWithNoActionsE xecuter.java:57)
    at org.gradle.api.internal.tasks.execution.SkipOnlyIf TaskExecuter.execute(SkipOnlyIfTaskExecuter.java:5 6)
    at org.gradle.api.internal.tasks.execution.CatchExcep tionTaskExecuter.execute(CatchExceptionTaskExecute r.java:36)
    at org.gradle.api.internal.tasks.execution.EventFirin gTaskExecuter$1.executeTask(EventFiringTaskExecute r.java:77)
    at org.gradle.api.internal.tasks.execution.EventFirin gTaskExecuter$1.call(EventFiringTaskExecuter.java: 55)
    at org.gradle.api.internal.tasks.execution.EventFirin gTaskExecuter$1.call(EventFiringTaskExecuter.java: 52)
    at org.gradle.internal.operations.DefaultBuildOperati onRunner$CallableBuildOperationWorker.execute(Defa ultBuildOperationRunner.java:200)
    at org.gradle.internal.operations.DefaultBuildOperati onRunner$CallableBuildOperationWorker.execute(Defa ultBuildOperationRunner.java:195)
    at org.gradle.internal.operations.DefaultBuildOperati onRunner$3.execute(DefaultBuildOperationRunner.jav a:75)
    at org.gradle.internal.operations.DefaultBuildOperati onRunner$3.execute(DefaultBuildOperationRunner.jav a:68)
    at org.gradle.internal.operations.DefaultBuildOperati onRunner.execute(DefaultBuildOperationRunner.java: 153)
    at org.gradle.internal.operations.DefaultBuildOperati onRunner.execute(DefaultBuildOperationRunner.java: 68)
    at org.gradle.internal.operations.DefaultBuildOperati onRunner.call(DefaultBuildOperationRunner.java:62)
    at org.gradle.internal.operations.DefaultBuildOperati onExecutor.lambda$call$2(DefaultBuildOperationExec utor.java:76)
    at org.gradle.internal.operations.UnmanagedBuildOpera tionWrapper.callWithUnmanagedSupport(UnmanagedBuil dOperationWrapper.java:54)
    at org.gradle.internal.operations.DefaultBuildOperati onExecutor.call(DefaultBuildOperationExecutor.java :76)
    at org.gradle.api.internal.tasks.execution.EventFirin gTaskExecuter.execute(EventFiringTaskExecuter.java :52)
    at org.gradle.execution.plan.LocalTaskNodeExecutor.ex ecute(LocalTaskNodeExecutor.java:74)
    at org.gradle.execution.taskgraph.DefaultTaskExecutio nGraph$InvokeNodeExecutorsAction.execute(DefaultTa skExecutionGraph.java:408)
    at org.gradle.execution.taskgraph.DefaultTaskExecutio nGraph$InvokeNodeExecutorsAction.execute(DefaultTa skExecutionGraph.java:395)
    at org.gradle.execution.taskgraph.DefaultTaskExecutio nGraph$BuildOperationAwareExecutionAction.execute( DefaultTaskExecutionGraph.java:388)
    at org.gradle.execution.taskgraph.DefaultTaskExecutio nGraph$BuildOperationAwareExecutionAction.execute( DefaultTaskExecutionGraph.java:374)
    at org.gradle.execution.plan.DefaultPlanExecutor$Exec utorWorker.lambda$run$0(DefaultPlanExecutor.java:1 27)
    at org.gradle.execution.plan.DefaultPlanExecutor$Exec utorWorker.execute(DefaultPlanExecutor.java:191)
    at org.gradle.execution.plan.DefaultPlanExecutor$Exec utorWorker.executeNextNode(DefaultPlanExecutor.jav a:182)
    at org.gradle.execution.plan.DefaultPlanExecutor$Exec utorWorker.run(DefaultPlanExecutor.java:124)
    at org.gradle.internal.concurrent.ExecutorPolicy$Catc hAndRecordFailures.onExecute(ExecutorPolicy.java:6 4)
    at org.gradle.internal.concurrent.ManagedExecutorImpl $1.run(ManagedExecutorImpl.java:48)
    at java.util.concurrent.ThreadPoolExecutor.runWorker( ThreadPoolExecutor.java:1149)
    at java.util.concurrent.ThreadPoolExecutor$Worker.run (ThreadPoolExecutor.java:624)
    at org.gradle.internal.concurrent.ThreadFactoryImpl$M anagedThreadRunnable.run(ThreadFactoryImpl.java:56 )
    at java.lang.Thread.run(Thread.java:748)

    FAILURE: Build failed with an exception.

    * What went wrong:
    Execution failed for task ':app:compileReleaseJavaWithJavac'.
    > Compilation failed; see the compiler error output for details.

    * Try:
    Run with --stacktrace option to get the stack trace. Run with --info or --debug option to get more log output. Run with --scan to get full insights.

    * Get more help at https://help.gradle.org

    BUILD FAILED in 5s
    25 actionable tasks: 25 executed

  2. #2
    Clickteam Clickteam
    Fernando's Avatar
    Join Date
    Dec 2006
    Posts
    7,295
    Mentioned
    298 Post(s)
    Tagged
    4 Thread(s)
    It is not easy to see what is going on at your side, seems something wrong with the updates, but building 12 with API 31 should not be a problem.

    can you show an image of your platform tools/ sdk-tools you have installed

    =============================


    Seems that this may occur randomly. There is a report in OpenJDK, but no conclusion and is close.

    https://bugs.openjdk.java.net/browse/JDK-8282599
    Regards,


    Fernando Vivolo

    ... new things are coming ...

  3. #3
    Clicker Fusion 2.5 (Steam)Fusion 2.5 Developer (Steam)Fusion 2.5+ DLC (Steam)Android Export Module (Steam)HTML5 Export Module (Steam)iOS Export Module (Steam)Mac Export Module (Steam)

    Join Date
    Jan 2021
    Posts
    9
    Mentioned
    0 Post(s)
    Tagged
    0 Thread(s)
    platform tools/ sdk-tools?

  4. #4
    Clickteam Clickteam
    Fernando's Avatar
    Join Date
    Dec 2006
    Posts
    7,295
    Mentioned
    298 Post(s)
    Tagged
    4 Thread(s)
    don't understand your question, sorry, can you explain more?
    Regards,


    Fernando Vivolo

    ... new things are coming ...

  5. #5
    Clicker Fusion 2.5 (Steam)Fusion 2.5 Developer (Steam)Fusion 2.5+ DLC (Steam)Android Export Module (Steam)HTML5 Export Module (Steam)iOS Export Module (Steam)Mac Export Module (Steam)

    Join Date
    Jan 2021
    Posts
    9
    Mentioned
    0 Post(s)
    Tagged
    0 Thread(s)
    Where i can find platform tools/ sdk-tools?

  6. #6
    Clickteam Clickteam
    Fernando's Avatar
    Join Date
    Dec 2006
    Posts
    7,295
    Mentioned
    298 Post(s)
    Tagged
    4 Thread(s)
    Hi, you mentioned this in your first post

    I downloaded all api in android studio
    I can export android 12 with 30 api, but it causes a crash on android 12, when i set it to 31 or above, it just give me this error:
    According to your post, you are using android studio, so the image in question is the list of them inside android studio.

    Tools--> SDK Manager and check the list in both tabs, more information https://developer.android.com/studio/intro/update#sdk-manager, and please check for package details, so you can see all list


    Regards,


    Fernando Vivolo

    ... new things are coming ...

  7. #7
    Clicker Fusion 2.5 (Steam)Fusion 2.5 Developer (Steam)Fusion 2.5+ DLC (Steam)Android Export Module (Steam)HTML5 Export Module (Steam)iOS Export Module (Steam)Mac Export Module (Steam)

    Join Date
    Jan 2021
    Posts
    9
    Mentioned
    0 Post(s)
    Tagged
    0 Thread(s)
    There is it!1.png 2.png

  8. #8
    Clickteam Clickteam
    Fernando's Avatar
    Join Date
    Dec 2006
    Posts
    7,295
    Mentioned
    298 Post(s)
    Tagged
    4 Thread(s)
    can you show me the sdk tool installed , BTW Min API to build now with Google is 30, maybe you need to keep API 21 if you are building for 1st geeration amazon, but the rest is just not needed.

    Oppose you only show me build tool api 33, show package details click over 33 to show the rest
    Regards,


    Fernando Vivolo

    ... new things are coming ...

  9. #9
    Clicker Fusion 2.5 DeveloperAndroid Export ModuleHTML5 Export ModuleiOS Export ModuleSWF Export Module
    Fusion 2.5 (Steam)Fusion 2.5 Developer (Steam)Android Export Module (Steam)HTML5 Export Module (Steam)iOS Export Module (Steam)Universal Windows Platform Export Module (Steam)
    bluroman's Avatar
    Join Date
    Aug 2015
    Location
    South Korea
    Posts
    29
    Mentioned
    0 Post(s)
    Tagged
    0 Thread(s)
    https://stackoverflow.com/questions/...-sharednametab

    Android 12 seems to need JDK 11 +

  10. #10
    Clicker Fusion 2.5 (Steam)Fusion 2.5 Developer (Steam)Fusion 2.5+ DLC (Steam)Android Export Module (Steam)HTML5 Export Module (Steam)iOS Export Module (Steam)Mac Export Module (Steam)

    Join Date
    Jan 2021
    Posts
    9
    Mentioned
    0 Post(s)
    Tagged
    0 Thread(s)
    I am using 18.0.1

Page 1 of 2 1 2 LastLast

Similar Threads

  1. Android doesn't export to apk error.
    By ClickTeamMan in forum Android Export Module 2.5
    Replies: 25
    Last Post: 8th August 2016, 04:57 PM
  2. Game Doesn't Export and I don't understand why.
    By VoyVivika in forum Android Export Module 2.5
    Replies: 6
    Last Post: 4th January 2016, 01:24 PM
  3. EXE export works fine, but Flash export buggy (scrolling issue)
    By alxmrg in forum Multimedia Fusion 2 - Technical Support
    Replies: 2
    Last Post: 6th July 2014, 12:58 PM
  4. box2d extension doesn't export to xcode?
    By waderain in forum iOS Export Module Version 2.0
    Replies: 1
    Last Post: 2nd January 2014, 01:48 AM
  5. Export configuration (toolbar) doesn't work
    By iOSC in forum Multimedia Fusion 2 - Technical Support
    Replies: 0
    Last Post: 19th November 2013, 05:41 PM

Posting Permissions

  • You may not post new threads
  • You may not post replies
  • You may not post attachments
  • You may not edit your posts
  •