User Tag List

Page 1 of 2 1 2 LastLast
Results 1 to 10 of 18

Thread: Error while building app bundle

  1. #1
    Clicker Fusion 2.5 (Steam)Fusion 2.5 Developer (Steam)HTML5 Export Module (Steam)

    Join Date
    May 2019
    Posts
    54
    Mentioned
    1 Post(s)
    Tagged
    0 Thread(s)

    Exclamation Error while building app bundle

    Hello. I'm trying to build my game for Android. Google Play requires a signed .aab file. I've created a .keystore file and put all info in the "release mode" properties. However, the build process stops with an error. This error does not repeat if I try to build .apk or .aab without .keystore file (so I ques the problem is with keystore, but I'm not sure how to fix it). Keystore was created from keystore.exe (according to the official keystore post on the clickteam forum). Please help. Thanks.

    Error log:

    Starting a Gradle Daemon (subsequent builds will be faster)
    WARNING:: Please remove usages of `jcenter()` Maven repository from your build scripts and migrate your build to other Maven repositories.
    This repository is deprecated and it will be shut down in the future.
    See http://developer.android.com/r/tools...end-of-service for more information.
    Currently detected usages in: root project 'And27B0.tmp', project ':app'
    Warning: Mapping new ns http://schemas.android.com/repository/android/common/02 to old ns http://schemas.android.com/repository/android/common/01
    Warning: Mapping new ns http://schemas.android.com/repositor...oid/generic/02 to old ns http://schemas.android.com/repositor...oid/generic/01
    Warning: Mapping new ns http://schemas.android.com/sdk/android/repo/addon2/02 to old ns http://schemas.android.com/sdk/android/repo/addon2/01
    Warning: Mapping new ns http://schemas.android.com/sdk/andro...repository2/02 to old ns http://schemas.android.com/sdk/andro...repository2/01
    Warning: Mapping new ns http://schemas.android.com/sdk/android/repo/sys-img2/02 to old ns http://schemas.android.com/sdk/android/repo/sys-img2/01
    > Task :app:preBuild UP-TO-DATE
    > Task :app:preReleaseBuild UP-TO-DATE
    > Task :app:writeReleaseApplicationId
    > Task :app:analyticsRecordingRelease
    > Task :app:compileReleaseRenderscript NO-SOURCE
    > Task :app:generateReleaseResValues
    > Task :app:generateReleaseResources
    > Task :app:createReleaseCompatibleScreenManifests
    > Task :app:extractDeepLinksRelease
    > Task :app:processReleaseMainManifest
    > Task :app:processReleaseManifest
    > Task :app:processApplicationManifestReleaseForBundle
    > Task :app:compileReleaseAidl NO-SOURCE
    > Task :app:checkReleaseDuplicateClasses
    > Task :app:generateReleaseBuildConfig
    > Task :app:javaPreCompileRelease
    > Task :app:mergeReleaseResources
    > Task :app:checkReleaseAarMetadata
    > Task :app:mergeReleaseShaders
    > Task :app:compileReleaseShaders NO-SOURCE
    > Task :app:generateReleaseAssets UP-TO-DATE
    > Task :app:mergeReleaseAssets
    > Task :app:processReleaseJavaRes NO-SOURCE
    > Task :app:mergeReleaseJniLibFolders
    > Task :app:collectReleaseDependencies
    > Task :app:configureReleaseDependencies
    > Task :app:parseReleaseIntegrityConfig
    > Task :app:writeReleaseAppMetadata
    > Task :app:validateSigningRelease
    > Task :app:processReleaseManifestForPackage
    > Task :app:mergeReleaseJavaResource
    > Task :app:mergeReleaseNativeLibs

    > Task :app:stripReleaseDebugSymbols
    Unable to strip the following libraries, packaging them as they are: libES1Renderer.so, libES2Renderer.so, libES3Renderer.so, libRuntimeNative.so, libgdx.so.

    > Task :app:extractReleaseNativeSymbolTables
    Unable to extract native debug metadata from C:\Users\Andrew\AppData\Local\Temp\And27B0.tmp\app \build\intermediates\merged_native_libs\release\ou t\lib\arm64-v8a\libES1Renderer.so because unable to locate the objcopy executable for the arm64-v8a ABI.
    Unable to extract native debug metadata from C:\Users\Andrew\AppData\Local\Temp\And27B0.tmp\app \build\intermediates\merged_native_libs\release\ou t\lib\arm64-v8a\libES2Renderer.so because unable to locate the objcopy executable for the arm64-v8a ABI.
    Unable to extract native debug metadata from C:\Users\Andrew\AppData\Local\Temp\And27B0.tmp\app \build\intermediates\merged_native_libs\release\ou t\lib\arm64-v8a\libES3Renderer.so because unable to locate the objcopy executable for the arm64-v8a ABI.
    Unable to extract native debug metadata from C:\Users\Andrew\AppData\Local\Temp\And27B0.tmp\app \build\intermediates\merged_native_libs\release\ou t\lib\arm64-v8a\libgdx.so because unable to locate the objcopy executable for the arm64-v8a ABI.
    Unable to extract native debug metadata from C:\Users\Andrew\AppData\Local\Temp\And27B0.tmp\app \build\intermediates\merged_native_libs\release\ou t\lib\arm64-v8a\libRuntimeNative.so because unable to locate the objcopy executable for the arm64-v8a ABI.
    Unable to extract native debug metadata from C:\Users\Andrew\AppData\Local\Temp\And27B0.tmp\app \build\intermediates\merged_native_libs\release\ou t\lib\armeabi-v7a\libES1Renderer.so because unable to locate the objcopy executable for the armeabi-v7a ABI.
    Unable to extract native debug metadata from C:\Users\Andrew\AppData\Local\Temp\And27B0.tmp\app \build\intermediates\merged_native_libs\release\ou t\lib\armeabi-v7a\libES2Renderer.so because unable to locate the objcopy executable for the armeabi-v7a ABI.
    Unable to extract native debug metadata from C:\Users\Andrew\AppData\Local\Temp\And27B0.tmp\app \build\intermediates\merged_native_libs\release\ou t\lib\armeabi-v7a\libES3Renderer.so because unable to locate the objcopy executable for the armeabi-v7a ABI.
    Unable to extract native debug metadata from C:\Users\Andrew\AppData\Local\Temp\And27B0.tmp\app \build\intermediates\merged_native_libs\release\ou t\lib\armeabi-v7a\libgdx.so because unable to locate the objcopy executable for the armeabi-v7a ABI.
    Unable to extract native debug metadata from C:\Users\Andrew\AppData\Local\Temp\And27B0.tmp\app \build\intermediates\merged_native_libs\release\ou t\lib\armeabi-v7a\libRuntimeNative.so because unable to locate the objcopy executable for the armeabi-v7a ABI.
    Unable to extract native debug metadata from C:\Users\Andrew\AppData\Local\Temp\And27B0.tmp\app \build\intermediates\merged_native_libs\release\ou t\lib\x86\libES1Renderer.so because unable to locate the objcopy executable for the x86 ABI.
    Unable to extract native debug metadata from C:\Users\Andrew\AppData\Local\Temp\And27B0.tmp\app \build\intermediates\merged_native_libs\release\ou t\lib\x86\libES2Renderer.so because unable to locate the objcopy executable for the x86 ABI.
    Unable to extract native debug metadata from C:\Users\Andrew\AppData\Local\Temp\And27B0.tmp\app \build\intermediates\merged_native_libs\release\ou t\lib\x86\libES3Renderer.so because unable to locate the objcopy executable for the x86 ABI.
    Unable to extract native debug metadata from C:\Users\Andrew\AppData\Local\Temp\And27B0.tmp\app \build\intermediates\merged_native_libs\release\ou t\lib\x86\libgdx.so because unable to locate the objcopy executable for the x86 ABI.
    Unable to extract native debug metadata from C:\Users\Andrew\AppData\Local\Temp\And27B0.tmp\app \build\intermediates\merged_native_libs\release\ou t\lib\x86\libRuntimeNative.so because unable to locate the objcopy executable for the x86 ABI.
    Unable to extract native debug metadata from C:\Users\Andrew\AppData\Local\Temp\And27B0.tmp\app \build\intermediates\merged_native_libs\release\ou t\lib\x86_64\libES1Renderer.so because unable to locate the objcopy executable for the x86_64 ABI.
    Unable to extract native debug metadata from C:\Users\Andrew\AppData\Local\Temp\And27B0.tmp\app \build\intermediates\merged_native_libs\release\ou t\lib\x86_64\libES2Renderer.so because unable to locate the objcopy executable for the x86_64 ABI.
    Unable to extract native debug metadata from C:\Users\Andrew\AppData\Local\Temp\And27B0.tmp\app \build\intermediates\merged_native_libs\release\ou t\lib\x86_64\libES3Renderer.so because unable to locate the objcopy executable for the x86_64 ABI.
    Unable to extract native debug metadata from C:\Users\Andrew\AppData\Local\Temp\And27B0.tmp\app \build\intermediates\merged_native_libs\release\ou t\lib\x86_64\libgdx.so because unable to locate the objcopy executable for the x86_64 ABI.
    Unable to extract native debug metadata from C:\Users\Andrew\AppData\Local\Temp\And27B0.tmp\app \build\intermediates\merged_native_libs\release\ou t\lib\x86_64\libRuntimeNative.so because unable to locate the objcopy executable for the x86_64 ABI.

    > Task :app:desugarReleaseFileDependencies
    > Task :app:mergeExtDexRelease
    > Task :app:bundleReleaseResources
    > Task :app:processReleaseResources

    > Task :app:compileReleaseJavaWithJavac
    Note: Some input files use or override a deprecated API.
    Note: Recompile with -Xlint:deprecation for details.
    Note: Some input files use unchecked or unsafe operations.
    Note: Recompile with -Xlint:unchecked for details.

    > Task :app:dexBuilderRelease
    > Task :app:mergeDexRelease
    > Task :app:buildReleasePreBundle
    > Task :app:packageReleaseBundle
    > Task :app:signReleaseBundle FAILED

    FAILURE: Build failed with an exception.

    * What went wrong:
    Execution failed for task ':app:signReleaseBundle'.
    > A failure occurred while executing com.android.build.gradle.internal.tasks.FinalizeBu ndleTask$BundleToolRunnable
    > Java heap space

    * Try:
    Run with --stacktrace option to get the stack trace. Run with --info or --debug option to get more log output. Run with --scan to get full insights.

    * Get more help at https://help.gradle.org

    BUILD FAILED in 27s
    36 actionable tasks: 36 executed

  2. #2
    Clicker Fusion 2.5 (Steam)Fusion 2.5 Developer (Steam)HTML5 Export Module (Steam)

    Join Date
    May 2019
    Posts
    54
    Mentioned
    1 Post(s)
    Tagged
    0 Thread(s)
    UPD:

    I've updated everything it asked me to at Android Studio (and downloaded all Android SDK versions from 2.1 to 12.0). The error still occurs, but this time the error log file seems to have changed a bit. Any suggestions on what to do next?

    Error log2:

    Starting a Gradle Daemon (subsequent builds will be faster)
    WARNING:: Please remove usages of `jcenter()` Maven repository from your build scripts and migrate your build to other Maven repositories.
    This repository is deprecated and it will be shut down in the future.
    See http://developer.android.com/r/tools...end-of-service for more information.
    Currently detected usages in: root project 'And27B0.tmp', project ':app'
    Warning: Mapping new ns http://schemas.android.com/repository/android/common/02 to old ns http://schemas.android.com/repository/android/common/01
    Warning: Mapping new ns http://schemas.android.com/repositor...oid/generic/02 to old ns http://schemas.android.com/repositor...oid/generic/01
    Warning: Mapping new ns http://schemas.android.com/sdk/android/repo/addon2/02 to old ns http://schemas.android.com/sdk/android/repo/addon2/01
    Warning: Mapping new ns http://schemas.android.com/sdk/andro...repository2/02 to old ns http://schemas.android.com/sdk/andro...repository2/01
    Warning: Mapping new ns http://schemas.android.com/sdk/android/repo/sys-img2/02 to old ns http://schemas.android.com/sdk/android/repo/sys-img2/01
    > Task :app:preBuild UP-TO-DATE
    > Task :app:preReleaseBuild UP-TO-DATE
    > Task :app:writeReleaseApplicationId
    > Task :app:analyticsRecordingRelease
    > Task :app:compileReleaseRenderscript NO-SOURCE
    > Task :app:generateReleaseResValues
    > Task :app:generateReleaseResources
    > Task :app:createReleaseCompatibleScreenManifests
    > Task :app:extractDeepLinksRelease
    > Task :app:processReleaseMainManifest
    > Task :app:processReleaseManifest
    > Task :app:processApplicationManifestReleaseForBundle
    > Task :app:compileReleaseAidl NO-SOURCE
    > Task :app:checkReleaseDuplicateClasses
    > Task :app:generateReleaseBuildConfig
    > Task :app:javaPreCompileRelease
    > Task :app:mergeReleaseResources
    > Task :app:checkReleaseAarMetadata
    > Task :app:mergeReleaseShaders
    > Task :app:compileReleaseShaders NO-SOURCE
    > Task :app:generateReleaseAssets UP-TO-DATE
    > Task :app:mergeReleaseAssets
    > Task :app:processReleaseJavaRes NO-SOURCE
    > Task :app:mergeReleaseJniLibFolders
    > Task :app:collectReleaseDependencies
    > Task :app:configureReleaseDependencies
    > Task :app:parseReleaseIntegrityConfig
    > Task :app:writeReleaseAppMetadata
    > Task :app:validateSigningRelease
    > Task :app:processReleaseManifestForPackage
    > Task :app:mergeReleaseJavaResource
    > Task :app:mergeReleaseNativeLibs

    > Task :app:stripReleaseDebugSymbols
    Unable to strip the following libraries, packaging them as they are: libES1Renderer.so, libES2Renderer.so, libES3Renderer.so, libRuntimeNative.so, libgdx.so.

    > Task :app:extractReleaseNativeSymbolTables
    Unable to extract native debug metadata from C:\Users\Andrew\AppData\Local\Temp\And27B0.tmp\app \build\intermediates\merged_native_libs\release\ou t\lib\arm64-v8a\libES1Renderer.so because unable to locate the objcopy executable for the arm64-v8a ABI.
    Unable to extract native debug metadata from C:\Users\Andrew\AppData\Local\Temp\And27B0.tmp\app \build\intermediates\merged_native_libs\release\ou t\lib\arm64-v8a\libES2Renderer.so because unable to locate the objcopy executable for the arm64-v8a ABI.
    Unable to extract native debug metadata from C:\Users\Andrew\AppData\Local\Temp\And27B0.tmp\app \build\intermediates\merged_native_libs\release\ou t\lib\arm64-v8a\libES3Renderer.so because unable to locate the objcopy executable for the arm64-v8a ABI.
    Unable to extract native debug metadata from C:\Users\Andrew\AppData\Local\Temp\And27B0.tmp\app \build\intermediates\merged_native_libs\release\ou t\lib\arm64-v8a\libgdx.so because unable to locate the objcopy executable for the arm64-v8a ABI.
    Unable to extract native debug metadata from C:\Users\Andrew\AppData\Local\Temp\And27B0.tmp\app \build\intermediates\merged_native_libs\release\ou t\lib\arm64-v8a\libRuntimeNative.so because unable to locate the objcopy executable for the arm64-v8a ABI.
    Unable to extract native debug metadata from C:\Users\Andrew\AppData\Local\Temp\And27B0.tmp\app \build\intermediates\merged_native_libs\release\ou t\lib\armeabi-v7a\libES1Renderer.so because unable to locate the objcopy executable for the armeabi-v7a ABI.
    Unable to extract native debug metadata from C:\Users\Andrew\AppData\Local\Temp\And27B0.tmp\app \build\intermediates\merged_native_libs\release\ou t\lib\armeabi-v7a\libES2Renderer.so because unable to locate the objcopy executable for the armeabi-v7a ABI.
    Unable to extract native debug metadata from C:\Users\Andrew\AppData\Local\Temp\And27B0.tmp\app \build\intermediates\merged_native_libs\release\ou t\lib\armeabi-v7a\libES3Renderer.so because unable to locate the objcopy executable for the armeabi-v7a ABI.
    Unable to extract native debug metadata from C:\Users\Andrew\AppData\Local\Temp\And27B0.tmp\app \build\intermediates\merged_native_libs\release\ou t\lib\armeabi-v7a\libgdx.so because unable to locate the objcopy executable for the armeabi-v7a ABI.
    Unable to extract native debug metadata from C:\Users\Andrew\AppData\Local\Temp\And27B0.tmp\app \build\intermediates\merged_native_libs\release\ou t\lib\armeabi-v7a\libRuntimeNative.so because unable to locate the objcopy executable for the armeabi-v7a ABI.
    Unable to extract native debug metadata from C:\Users\Andrew\AppData\Local\Temp\And27B0.tmp\app \build\intermediates\merged_native_libs\release\ou t\lib\x86\libES1Renderer.so because unable to locate the objcopy executable for the x86 ABI.
    Unable to extract native debug metadata from C:\Users\Andrew\AppData\Local\Temp\And27B0.tmp\app \build\intermediates\merged_native_libs\release\ou t\lib\x86\libES2Renderer.so because unable to locate the objcopy executable for the x86 ABI.
    Unable to extract native debug metadata from C:\Users\Andrew\AppData\Local\Temp\And27B0.tmp\app \build\intermediates\merged_native_libs\release\ou t\lib\x86\libES3Renderer.so because unable to locate the objcopy executable for the x86 ABI.
    Unable to extract native debug metadata from C:\Users\Andrew\AppData\Local\Temp\And27B0.tmp\app \build\intermediates\merged_native_libs\release\ou t\lib\x86\libgdx.so because unable to locate the objcopy executable for the x86 ABI.
    Unable to extract native debug metadata from C:\Users\Andrew\AppData\Local\Temp\And27B0.tmp\app \build\intermediates\merged_native_libs\release\ou t\lib\x86\libRuntimeNative.so because unable to locate the objcopy executable for the x86 ABI.
    Unable to extract native debug metadata from C:\Users\Andrew\AppData\Local\Temp\And27B0.tmp\app \build\intermediates\merged_native_libs\release\ou t\lib\x86_64\libES1Renderer.so because unable to locate the objcopy executable for the x86_64 ABI.
    Unable to extract native debug metadata from C:\Users\Andrew\AppData\Local\Temp\And27B0.tmp\app \build\intermediates\merged_native_libs\release\ou t\lib\x86_64\libES2Renderer.so because unable to locate the objcopy executable for the x86_64 ABI.
    Unable to extract native debug metadata from C:\Users\Andrew\AppData\Local\Temp\And27B0.tmp\app \build\intermediates\merged_native_libs\release\ou t\lib\x86_64\libES3Renderer.so because unable to locate the objcopy executable for the x86_64 ABI.
    Unable to extract native debug metadata from C:\Users\Andrew\AppData\Local\Temp\And27B0.tmp\app \build\intermediates\merged_native_libs\release\ou t\lib\x86_64\libgdx.so because unable to locate the objcopy executable for the x86_64 ABI.
    Unable to extract native debug metadata from C:\Users\Andrew\AppData\Local\Temp\And27B0.tmp\app \build\intermediates\merged_native_libs\release\ou t\lib\x86_64\libRuntimeNative.so because unable to locate the objcopy executable for the x86_64 ABI.

    > Task :app:desugarReleaseFileDependencies
    > Task :app:mergeExtDexRelease
    > Task :app:bundleReleaseResources
    > Task :app:processReleaseResources

    > Task :app:compileReleaseJavaWithJavac
    Note: Some input files use or override a deprecated API.
    Note: Recompile with -Xlint:deprecation for details.
    Note: Some input files use unchecked or unsafe operations.
    Note: Recompile with -Xlint:unchecked for details.

    > Task :app:dexBuilderRelease
    > Task :app:mergeDexRelease
    > Task :app:buildReleasePreBundle
    > Task :app:packageReleaseBundle
    > Task :app:signReleaseBundle FAILED

    FAILURE: Build failed with an exception.

    * What went wrong:
    Execution failed for task ':app:signReleaseBundle'.
    > A failure occurred while executing com.android.build.gradle.internal.tasks.FinalizeBu ndleTask$BundleToolRunnable
    > Java heap space

    * Try:
    Run with --stacktrace option to get the stack trace. Run with --info or --debug option to get more log output. Run with --scan to get full insights.

    * Get more help at https://help.gradle.org

    BUILD FAILED in 27s
    36 actionable tasks: 36 executed

  3. #3
    Forum Moderator Fusion 2.5 MacFusion 2.5 DeveloperAndroid Export ModuleHTML5 Export ModuleiOS Export Module
    Fusion 2.5 (Steam)Fusion 2.5 Developer (Steam)Fusion 2.5+ DLC (Steam)Android Export Module (Steam)HTML5 Export Module (Steam)iOS Export Module (Steam)Universal Windows Platform Export Module (Steam)Firefly 3D Module (Steam)
    NaitorStudios's Avatar
    Join Date
    May 2010
    Location
    Brazil
    Posts
    761
    Mentioned
    9 Post(s)
    Tagged
    0 Thread(s)
    Are you using the JDK included with Android Studio?

  4. #4
    Clicker Fusion 2.5 (Steam)Fusion 2.5 Developer (Steam)HTML5 Export Module (Steam)

    Join Date
    May 2019
    Posts
    54
    Mentioned
    1 Post(s)
    Tagged
    0 Thread(s)
    Quote Originally Posted by NaitorStudios View Post
    Are you using the JDK included with Android Studio?
    Yes. Is there a problem with that? Do I need to install the JDK from some other source?

  5. #5
    Forum Moderator Fusion 2.5 MacFusion 2.5 DeveloperAndroid Export ModuleHTML5 Export ModuleiOS Export Module
    Fusion 2.5 (Steam)Fusion 2.5 Developer (Steam)Fusion 2.5+ DLC (Steam)Android Export Module (Steam)HTML5 Export Module (Steam)iOS Export Module (Steam)Universal Windows Platform Export Module (Steam)Firefly 3D Module (Steam)
    NaitorStudios's Avatar
    Join Date
    May 2010
    Location
    Brazil
    Posts
    761
    Mentioned
    9 Post(s)
    Tagged
    0 Thread(s)
    No, that should work.
    What extensions are you using?

    I've noticed that having too many unnecessary stuff installed on Android Studio can also make it fail to build (for example NDK will cause it to fail), so here's everything I got on mine:


    SDK Platforms:
    - Android 11.0 (R) - API Level 30
    (31 is the latest one, but it may fail, use it only if you need to)


    SDK Tools:
    - Android SDK Build-Tools
    - Android SDK Command Line Tools
    - Android Emulator
    - Android SDK Platform-Tools
    - Google USB Driver
    - Intel x86 Emulator Accelerator (HAXM Installer)

  6. #6
    Clicker Fusion 2.5 (Steam)Fusion 2.5 Developer (Steam)HTML5 Export Module (Steam)

    Join Date
    May 2019
    Posts
    54
    Mentioned
    1 Post(s)
    Tagged
    0 Thread(s)
    Quote Originally Posted by NaitorStudios View Post
    No, that should work.
    What extensions are you using?

    I've noticed that having too many unnecessary stuff installed on Android Studio can also make it fail to build (for example NDK will cause it to fail), so here's everything I got on mine:


    SDK Platforms:
    - Android 11.0 (R) - API Level 30
    (31 is the latest one, but it may fail, use it only if you need to)


    SDK Tools:
    - Android SDK Build-Tools
    - Android SDK Command Line Tools
    - Android Emulator
    - Android SDK Platform-Tools
    - Google USB Driver
    - Intel x86 Emulator Accelerator (HAXM Installer)
    Do you mean extensions for Clickteam? I use several but not all of them are used in the building process for Android (I click ignore when building on Android, it does allow to build successfully while making apk). I really hope that problem lies not within the extensions. Here is a list of extensions I have (that were not included in base Clickteam Fusion 2.5 Developer):
    - Android font packer
    - Font Embed Object
    - ini
    - Registry 2
    - Ultimate Fullscreen
    - Window control
    - Steamworks
    - Vitalize! Plug-in

    That's all, it seems. I thought that clickteam simply ignore these extensions if the target platform (android in this case) does not support them.

    Do you recommend removing some of my SDK stuff?

    SDK Platforms:
    - All Android platforms from 2.1 (API level 7) to 12.0 (API level 31). I've downloaded them after the first build error occurred - trying to find if something was missing maybe in SDK files.

    SDK Tools installed:
    - Android SDK Build-Tools 31
    - Android Emulator v30.8.4
    - Android SDK platform-Tools v31.0.3
    - Android SDK tools v26.1.1

  7. #7
    Forum Moderator Fusion 2.5 MacFusion 2.5 DeveloperAndroid Export ModuleHTML5 Export ModuleiOS Export Module
    Fusion 2.5 (Steam)Fusion 2.5 Developer (Steam)Fusion 2.5+ DLC (Steam)Android Export Module (Steam)HTML5 Export Module (Steam)iOS Export Module (Steam)Universal Windows Platform Export Module (Steam)Firefly 3D Module (Steam)
    NaitorStudios's Avatar
    Join Date
    May 2010
    Location
    Brazil
    Posts
    761
    Mentioned
    9 Post(s)
    Tagged
    0 Thread(s)
    Hmm, I'm not sure.
    Do you have a particular antivirus? For example Avast

  8. #8
    Clicker Fusion 2.5 (Steam)Fusion 2.5 Developer (Steam)HTML5 Export Module (Steam)

    Join Date
    May 2019
    Posts
    54
    Mentioned
    1 Post(s)
    Tagged
    0 Thread(s)
    Quote Originally Posted by NaitorStudios View Post
    Hmm, I'm not sure.
    Do you have a particular antivirus? For example Avast
    No, only windows security. And I'm running steam as an administrator, so there should not be problems with permission.

  9. #9
    Forum Moderator Fusion 2.5 MacFusion 2.5 DeveloperAndroid Export ModuleHTML5 Export ModuleiOS Export Module
    Fusion 2.5 (Steam)Fusion 2.5 Developer (Steam)Fusion 2.5+ DLC (Steam)Android Export Module (Steam)HTML5 Export Module (Steam)iOS Export Module (Steam)Universal Windows Platform Export Module (Steam)Firefly 3D Module (Steam)
    NaitorStudios's Avatar
    Join Date
    May 2010
    Location
    Brazil
    Posts
    761
    Mentioned
    9 Post(s)
    Tagged
    0 Thread(s)
    Actually running stuff as administrator can make some folders inaccessible.
    Well, do you need to use this specific keystore or could you create a new one?

    Also, you don't need every single API version, just keep the 30 and at max 31 as well.

    Another thing, check if the Target Android version is blank on Fusion's Android properties, if it is, set it to 11.0, you can also try setting the Minimum Android version to something like Android 6 or a bit older...

  10. #10
    Clicker Fusion 2.5 (Steam)Fusion 2.5 Developer (Steam)HTML5 Export Module (Steam)

    Join Date
    May 2019
    Posts
    54
    Mentioned
    1 Post(s)
    Tagged
    0 Thread(s)
    Quote Originally Posted by NaitorStudios View Post
    Actually running stuff as administrator can make some folders inaccessible.
    Well, do you need to use this specific keystore or could you create a new one?

    Also, you don't need every single API version, just keep the 30 and at max 31 as well.

    Another thing, check if the Target Android version is blank on Fusion's Android properties, if it is, set it to 11.0, you can also try setting the Minimum Android version to something like Android 6 or a bit older...
    Yes, I can make another keystore. But, as I've said previously, I've tried it - it doesn't change anything. Maybe I'm making a mistake while making it or putting information in Clickteam?

    Ok, I've erased all API's except 30 and 31. But I don't think this will change a thing

    Do I understand correctly that in clickteam:
    1) keystore name = position of where .keystore file is (like /C:...)?
    2) keystore password = store password from KeyStore Generation Tool?
    3) key name = ALIAS from KeyStore Generation Tool?
    4) key password = key password from KeyStore Generation Tool?

Page 1 of 2 1 2 LastLast

Similar Threads

  1. Error building app
    By DJEmergency in forum Android Export Module 2.5
    Replies: 2
    Last Post: 26th February 2014, 03:24 PM
  2. Building Error
    By Arnax in forum Multimedia Fusion 2 - Technical Support
    Replies: 9
    Last Post: 1st October 2008, 07:39 PM

Posting Permissions

  • You may not post new threads
  • You may not post replies
  • You may not post attachments
  • You may not edit your posts
  •