User Tag List

Page 2 of 2 FirstFirst 1 2
Results 11 to 18 of 18

Thread: Can't build aab file - log attached + extensions list

  1. #11
    Clickteam Clickteam

    Join Date
    Jun 2006
    Location
    France
    Posts
    14,172
    Mentioned
    279 Post(s)
    Tagged
    3 Thread(s)
    I took a look at the MFA. The problem is that a Group.Obstacles shortcut in the global event editor is associated with this object. You can see 2 instances of Group.Obstacles in the global event editor, the second one is associated with the 9 Slices Object extension.

    How is this possible? Did you rename a 9 Slices Object object to Group.Obstacles at some point? O_o

    Anyway, to fix it, use Edit / Find Object on Group.Obstacles in the Global Event editor to find the first Group.Obstacles object and then press F3 to find the second one. Select this second object, you'll see there is a Is Overlapping condition associated with this object. Delete this action, this will remove the reference to the object.

  2. #12
    Clicker Fusion 2.5 (Steam)Fusion 2.5 Developer (Steam)Fusion 2.5+ DLC (Steam)Android Export Module (Steam)

    Join Date
    Jul 2019
    Posts
    105
    Mentioned
    1 Post(s)
    Tagged
    0 Thread(s)
    I cannot send Pm's, it seems like the option is gone?
    Did you forward the mfa to Yves?

    I went thru all the frames and I couldn't find any 9 slice objects...
    Please advise how to solve this matter so I can continue this project...

  3. #13
    Clicker Fusion 2.5 (Steam)Fusion 2.5 Developer (Steam)Fusion 2.5+ DLC (Steam)Android Export Module (Steam)

    Join Date
    Jul 2019
    Posts
    105
    Mentioned
    1 Post(s)
    Tagged
    0 Thread(s)
    Thanks I will try it right away and let you know.

    No, I did not rename it, it's something that happend automatically (now I also understand why collisions with 9 slice objects that I qualified as obstacles were not detected).

  4. #14
    Clicker Fusion 2.5 (Steam)Fusion 2.5 Developer (Steam)Fusion 2.5+ DLC (Steam)Android Export Module (Steam)

    Join Date
    Jul 2019
    Posts
    105
    Mentioned
    1 Post(s)
    Tagged
    0 Thread(s)
    It worked.
    We have a build :-D

    I think it's like counters / strings are given seperate qualifiers in the event editor then actives.
    If you give an active, a counter and a string the same qualifier, it will create 3 objects in the event editor.
    Anyway, I will have to create the 9 slice on a different mfa, then create an active out of it, and copy it to my mfa, for evey solid platform in the game :-X

  5. #15
    Clicker Fusion 2.5 (Steam)Fusion 2.5 Developer (Steam)Fusion 2.5+ DLC (Steam)Android Export Module (Steam)

    Join Date
    Jul 2019
    Posts
    105
    Mentioned
    1 Post(s)
    Tagged
    0 Thread(s)
    BTW it does not build with API 31, only 30, so one can assume issues and trouble in the future, I suppose... :-X





    With API 31:

    > Task :app:preBuild UP-TO-DATE
    > Task :app:preReleaseBuild UP-TO-DATE
    > Task :app:writeReleaseApplicationId
    > Task :app:analyticsRecordingRelease
    > Task :app:compileReleaseRenderscript NO-SOURCE
    > Task :app:generateReleaseResValues
    > Task :app:generateReleaseResources
    > Task :app:createReleaseCompatibleScreenManifests
    > Task :app:extractDeepLinksRelease
    > Task :app:processReleaseMainManifest
    > Task :app:processReleaseManifest
    > Task :app:processApplicationManifestReleaseForBundle
    > Task :app:checkReleaseDuplicateClasses
    > Task :app:compileReleaseAidl NO-SOURCE
    > Task :app:generateReleaseBuildConfig
    > Task :app:javaPreCompileRelease
    > Task :app:checkReleaseAarMetadata
    > Task :app:mergeReleaseShaders
    > Task :app:compileReleaseShaders NO-SOURCE
    > Task :app:generateReleaseAssets UP-TO-DATE
    > Task :app:mergeReleaseAssets
    > Task :app:processReleaseJavaRes NO-SOURCE
    > Task :app:desugarReleaseFileDependencies
    > Task :app:mergeReleaseJniLibFolders
    > Task :app:collectReleaseDependencies
    > Task :app:configureReleaseDependencies
    > Task :app:parseReleaseIntegrityConfig
    > Task :app:writeReleaseAppMetadata
    > Task :app:mergeReleaseResources
    > Task :app:validateSigningRelease
    > Task :app:processReleaseManifestForPackage
    > Task :app:mergeReleaseJavaResource
    > Task :app:mergeReleaseNativeLibs

    > Task :app:stripReleaseDebugSymbols
    Unable to strip the following libraries, packaging them as they are: libES1Renderer.so, libES2Renderer.so, libES3Renderer.so, libRuntimeNative.so, libgdx.so.

    > Task :app:extractReleaseNativeSymbolTables
    Unable to extract native debug metadata from C:\Users\Yaron\AppData\Local\Temp\And45DA.tmp\app\ build\intermediates\merged_native_libs\release\out \lib\arm64-v8a\libES1Renderer.so because unable to locate the objcopy executable for the arm64-v8a ABI.
    Unable to extract native debug metadata from C:\Users\Yaron\AppData\Local\Temp\And45DA.tmp\app\ build\intermediates\merged_native_libs\release\out \lib\arm64-v8a\libES2Renderer.so because unable to locate the objcopy executable for the arm64-v8a ABI.
    Unable to extract native debug metadata from C:\Users\Yaron\AppData\Local\Temp\And45DA.tmp\app\ build\intermediates\merged_native_libs\release\out \lib\arm64-v8a\libES3Renderer.so because unable to locate the objcopy executable for the arm64-v8a ABI.
    Unable to extract native debug metadata from C:\Users\Yaron\AppData\Local\Temp\And45DA.tmp\app\ build\intermediates\merged_native_libs\release\out \lib\arm64-v8a\libgdx.so because unable to locate the objcopy executable for the arm64-v8a ABI.
    Unable to extract native debug metadata from C:\Users\Yaron\AppData\Local\Temp\And45DA.tmp\app\ build\intermediates\merged_native_libs\release\out \lib\arm64-v8a\libRuntimeNative.so because unable to locate the objcopy executable for the arm64-v8a ABI.
    Unable to extract native debug metadata from C:\Users\Yaron\AppData\Local\Temp\And45DA.tmp\app\ build\intermediates\merged_native_libs\release\out \lib\armeabi-v7a\libES1Renderer.so because unable to locate the objcopy executable for the armeabi-v7a ABI.
    Unable to extract native debug metadata from C:\Users\Yaron\AppData\Local\Temp\And45DA.tmp\app\ build\intermediates\merged_native_libs\release\out \lib\armeabi-v7a\libES2Renderer.so because unable to locate the objcopy executable for the armeabi-v7a ABI.
    Unable to extract native debug metadata from C:\Users\Yaron\AppData\Local\Temp\And45DA.tmp\app\ build\intermediates\merged_native_libs\release\out \lib\armeabi-v7a\libES3Renderer.so because unable to locate the objcopy executable for the armeabi-v7a ABI.
    Unable to extract native debug metadata from C:\Users\Yaron\AppData\Local\Temp\And45DA.tmp\app\ build\intermediates\merged_native_libs\release\out \lib\armeabi-v7a\libgdx.so because unable to locate the objcopy executable for the armeabi-v7a ABI.
    Unable to extract native debug metadata from C:\Users\Yaron\AppData\Local\Temp\And45DA.tmp\app\ build\intermediates\merged_native_libs\release\out \lib\armeabi-v7a\libRuntimeNative.so because unable to locate the objcopy executable for the armeabi-v7a ABI.
    Unable to extract native debug metadata from C:\Users\Yaron\AppData\Local\Temp\And45DA.tmp\app\ build\intermediates\merged_native_libs\release\out \lib\x86\libES1Renderer.so because unable to locate the objcopy executable for the x86 ABI.
    Unable to extract native debug metadata from C:\Users\Yaron\AppData\Local\Temp\And45DA.tmp\app\ build\intermediates\merged_native_libs\release\out \lib\x86\libES2Renderer.so because unable to locate the objcopy executable for the x86 ABI.
    Unable to extract native debug metadata from C:\Users\Yaron\AppData\Local\Temp\And45DA.tmp\app\ build\intermediates\merged_native_libs\release\out \lib\x86\libES3Renderer.so because unable to locate the objcopy executable for the x86 ABI.
    Unable to extract native debug metadata from C:\Users\Yaron\AppData\Local\Temp\And45DA.tmp\app\ build\intermediates\merged_native_libs\release\out \lib\x86\libgdx.so because unable to locate the objcopy executable for the x86 ABI.
    Unable to extract native debug metadata from C:\Users\Yaron\AppData\Local\Temp\And45DA.tmp\app\ build\intermediates\merged_native_libs\release\out \lib\x86\libRuntimeNative.so because unable to locate the objcopy executable for the x86 ABI.
    Unable to extract native debug metadata from C:\Users\Yaron\AppData\Local\Temp\And45DA.tmp\app\ build\intermediates\merged_native_libs\release\out \lib\x86_64\libES1Renderer.so because unable to locate the objcopy executable for the x86_64 ABI.
    Unable to extract native debug metadata from C:\Users\Yaron\AppData\Local\Temp\And45DA.tmp\app\ build\intermediates\merged_native_libs\release\out \lib\x86_64\libES2Renderer.so because unable to locate the objcopy executable for the x86_64 ABI.
    Unable to extract native debug metadata from C:\Users\Yaron\AppData\Local\Temp\And45DA.tmp\app\ build\intermediates\merged_native_libs\release\out \lib\x86_64\libES3Renderer.so because unable to locate the objcopy executable for the x86_64 ABI.
    Unable to extract native debug metadata from C:\Users\Yaron\AppData\Local\Temp\And45DA.tmp\app\ build\intermediates\merged_native_libs\release\out \lib\x86_64\libgdx.so because unable to locate the objcopy executable for the x86_64 ABI.
    Unable to extract native debug metadata from C:\Users\Yaron\AppData\Local\Temp\And45DA.tmp\app\ build\intermediates\merged_native_libs\release\out \lib\x86_64\libRuntimeNative.so because unable to locate the objcopy executable for the x86_64 ABI.

    > Task :app:mergeExtDexRelease
    > Task :app:bundleReleaseResources
    > Task :app:processReleaseResources

    > Task :app:compileReleaseJavaWithJavac FAILED
    An exception has occurred in the compiler (1.8.0_282). Please file a bug against the Java compiler via the Java bug reporting page (http://bugreport.java.com) after checking the Bug Database (http://bugs.java.com) for duplicates. Include your program and the following diagnostic in your report. Thank you.
    java.lang.AssertionError: annotationType(): unrecognized Attribute name MODULE (class com.sun.tools.javac.util.UnsharedNameTable$NameImp l)
    at com.sun.tools.javac.util.Assert.error(Assert.java: 133)
    at com.sun.tools.javac.code.TypeAnnotations.annotatio nType(TypeAnnotations.java:231)
    at com.sun.tools.javac.code.TypeAnnotations$TypeAnnot ationPositions.separateAnnotationsKinds(TypeAnnota tions.java:294)
    at com.sun.tools.javac.code.TypeAnnotations$TypeAnnot ationPositions.visitMethodDef(TypeAnnotations.java :1066)
    at com.sun.tools.javac.tree.JCTree$JCMethodDecl.accep t(JCTree.java:778)
    at com.sun.tools.javac.tree.TreeScanner.scan(TreeScan ner.java:49)
    at com.sun.tools.javac.code.TypeAnnotations$TypeAnnot ationPositions.scan(TypeAnnotations.java:275)
    at com.sun.tools.javac.tree.TreeScanner.scan(TreeScan ner.java:57)
    at com.sun.tools.javac.code.TypeAnnotations$TypeAnnot ationPositions.visitClassDef(TypeAnnotations.java: 1042)
    at com.sun.tools.javac.tree.JCTree$JCClassDecl.accept (JCTree.java:693)
    at com.sun.tools.javac.tree.TreeScanner.scan(TreeScan ner.java:49)
    at com.sun.tools.javac.code.TypeAnnotations$TypeAnnot ationPositions.scan(TypeAnnotations.java:275)
    at com.sun.tools.javac.code.TypeAnnotations$1.run(Typ eAnnotations.java:127)
    at com.sun.tools.javac.comp.Annotate.flush(Annotate.j ava:152)
    at com.sun.tools.javac.comp.Annotate.enterDone(Annota te.java:129)
    at com.sun.tools.javac.comp.Enter.complete(Enter.java :512)
    at com.sun.tools.javac.comp.Enter.main(Enter.java:471 )
    at com.sun.tools.javac.main.JavaCompiler.enterTrees(J avaCompiler.java:982)
    at com.sun.tools.javac.main.JavaCompiler.compile(Java Compiler.java:857)
    at com.sun.tools.javac.main.Main.compile(Main.java:52 3)
    at com.sun.tools.javac.api.JavacTaskImpl.doCall(Javac TaskImpl.java:129)
    at com.sun.tools.javac.api.JavacTaskImpl.call(JavacTa skImpl.java:138)
    at org.gradle.internal.compiler.java.IncrementalCompi leTask.call(IncrementalCompileTask.java:77)
    at org.gradle.api.internal.tasks.compile.AnnotationPr ocessingCompileTask.call(AnnotationProcessingCompi leTask.java:94)
    at org.gradle.api.internal.tasks.compile.ResourceClea ningCompilationTask.call(ResourceCleaningCompilati onTask.java:57)
    at org.gradle.api.internal.tasks.compile.JdkJavaCompi ler.execute(JdkJavaCompiler.java:55)
    at org.gradle.api.internal.tasks.compile.JdkJavaCompi ler.execute(JdkJavaCompiler.java:40)
    at org.gradle.api.internal.tasks.compile.NormalizingJ avaCompiler.delegateAndHandleErrors(NormalizingJav aCompiler.java:97)
    at org.gradle.api.internal.tasks.compile.NormalizingJ avaCompiler.execute(NormalizingJavaCompiler.java:5 1)
    at org.gradle.api.internal.tasks.compile.NormalizingJ avaCompiler.execute(NormalizingJavaCompiler.java:3 7)
    at org.gradle.api.internal.tasks.compile.AnnotationPr ocessorDiscoveringCompiler.execute(AnnotationProce ssorDiscoveringCompiler.java:51)
    at org.gradle.api.internal.tasks.compile.AnnotationPr ocessorDiscoveringCompiler.execute(AnnotationProce ssorDiscoveringCompiler.java:37)
    at org.gradle.api.internal.tasks.compile.ModuleApplic ationNameWritingCompiler.execute(ModuleApplication NameWritingCompiler.java:46)
    at org.gradle.api.internal.tasks.compile.ModuleApplic ationNameWritingCompiler.execute(ModuleApplication NameWritingCompiler.java:36)
    at org.gradle.jvm.toolchain.internal.DefaultToolchain JavaCompiler.execute(DefaultToolchainJavaCompiler. java:57)
    at org.gradle.api.tasks.compile.JavaCompile.lambda$cr eateToolchainCompiler$1(JavaCompile.java:251)
    at org.gradle.api.internal.tasks.compile.CleaningJava Compiler.execute(CleaningJavaCompiler.java:53)
    at org.gradle.api.internal.tasks.compile.incremental. IncrementalCompilerFactory.lambda$createRebuildAll Compiler$0(IncrementalCompilerFactory.java:98)
    at org.gradle.api.internal.tasks.compile.incremental. IncrementalResultStoringCompiler.execute(Increment alResultStoringCompiler.java:61)
    at org.gradle.api.internal.tasks.compile.incremental. IncrementalResultStoringCompiler.execute(Increment alResultStoringCompiler.java:45)
    at org.gradle.api.internal.tasks.compile.CompileJavaB uildOperationReportingCompiler$2.call(CompileJavaB uildOperationReportingCompiler.java:59)
    at org.gradle.api.internal.tasks.compile.CompileJavaB uildOperationReportingCompiler$2.call(CompileJavaB uildOperationReportingCompiler.java:51)
    at org.gradle.internal.operations.DefaultBuildOperati onRunner$CallableBuildOperationWorker.execute(Defa ultBuildOperationRunner.java:200)
    at org.gradle.internal.operations.DefaultBuildOperati onRunner$CallableBuildOperationWorker.execute(Defa ultBuildOperationRunner.java:195)
    at org.gradle.internal.operations.DefaultBuildOperati onRunner$3.execute(DefaultBuildOperationRunner.jav a:75)
    at org.gradle.internal.operations.DefaultBuildOperati onRunner$3.execute(DefaultBuildOperationRunner.jav a:68)
    at org.gradle.internal.operations.DefaultBuildOperati onRunner.execute(DefaultBuildOperationRunner.java: 153)
    at org.gradle.internal.operations.DefaultBuildOperati onRunner.execute(DefaultBuildOperationRunner.java: 68)
    at org.gradle.internal.operations.DefaultBuildOperati onRunner.call(DefaultBuildOperationRunner.java:62)
    at org.gradle.internal.operations.DefaultBuildOperati onExecutor.lambda$call$2(DefaultBuildOperationExec utor.java:76)
    at org.gradle.internal.operations.UnmanagedBuildOpera tionWrapper.callWithUnmanagedSupport(UnmanagedBuil dOperationWrapper.java:54)
    at org.gradle.internal.operations.DefaultBuildOperati onExecutor.call(DefaultBuildOperationExecutor.java :76)
    at org.gradle.api.internal.tasks.compile.CompileJavaB uildOperationReportingCompiler.execute(CompileJava BuildOperationReportingCompiler.java:51)
    at org.gradle.api.tasks.compile.JavaCompile.performCo mpilation(JavaCompile.java:300)
    at org.gradle.api.tasks.compile.JavaCompile.performIn crementalCompilation(JavaCompile.java:179)
    at org.gradle.api.tasks.compile.JavaCompile.compile(J avaCompile.java:152)
    at sun.reflect.NativeMethodAccessorImpl.invoke0(Nativ e Method)
    at sun.reflect.NativeMethodAccessorImpl.invoke(Native MethodAccessorImpl.java:62)
    at sun.reflect.DelegatingMethodAccessorImpl.invoke(De legatingMethodAccessorImpl.java:43)
    at java.lang.reflect.Method.invoke(Method.java:498)
    at org.gradle.internal.reflect.JavaMethod.invoke(Java Method.java:104)
    at org.gradle.api.internal.project.taskfactory.Increm entalInputsTaskAction.doExecute(IncrementalInputsT askAction.java:32)
    at org.gradle.api.internal.project.taskfactory.Standa rdTaskAction.execute(StandardTaskAction.java:51)
    at org.gradle.api.internal.project.taskfactory.Abstra ctIncrementalTaskAction.execute(AbstractIncrementa lTaskAction.java:25)
    at org.gradle.api.internal.project.taskfactory.Standa rdTaskAction.execute(StandardTaskAction.java:29)
    at org.gradle.api.internal.tasks.execution.ExecuteAct ionsTaskExecuter$2.run(ExecuteActionsTaskExecuter. java:498)
    at org.gradle.internal.operations.DefaultBuildOperati onRunner$1.execute(DefaultBuildOperationRunner.jav a:29)
    at org.gradle.internal.operations.DefaultBuildOperati onRunner$1.execute(DefaultBuildOperationRunner.jav a:26)
    at org.gradle.internal.operations.DefaultBuildOperati onRunner$3.execute(DefaultBuildOperationRunner.jav a:75)
    at org.gradle.internal.operations.DefaultBuildOperati onRunner$3.execute(DefaultBuildOperationRunner.jav a:68)
    at org.gradle.internal.operations.DefaultBuildOperati onRunner.execute(DefaultBuildOperationRunner.java: 153)
    at org.gradle.internal.operations.DefaultBuildOperati onRunner.execute(DefaultBuildOperationRunner.java: 68)
    at org.gradle.internal.operations.DefaultBuildOperati onRunner.run(DefaultBuildOperationRunner.java:56)
    at org.gradle.internal.operations.DefaultBuildOperati onExecutor.lambda$run$1(DefaultBuildOperationExecu tor.java:71)
    at org.gradle.internal.operations.UnmanagedBuildOpera tionWrapper.runWithUnmanagedSupport(UnmanagedBuild OperationWrapper.java:45)
    at org.gradle.internal.operations.DefaultBuildOperati onExecutor.run(DefaultBuildOperationExecutor.java: 71)
    at org.gradle.api.internal.tasks.execution.ExecuteAct ionsTaskExecuter.executeAction(ExecuteActionsTaskE xecuter.java:483)
    at org.gradle.api.internal.tasks.execution.ExecuteAct ionsTaskExecuter.executeActions(ExecuteActionsTask Executer.java:466)
    at org.gradle.api.internal.tasks.execution.ExecuteAct ionsTaskExecuter.access$300(ExecuteActionsTaskExec uter.java:105)
    at org.gradle.api.internal.tasks.execution.ExecuteAct ionsTaskExecuter$TaskExecution.executeWithPrevious OutputFiles(ExecuteActionsTaskExecuter.java:270)
    at org.gradle.api.internal.tasks.execution.ExecuteAct ionsTaskExecuter$TaskExecution.execute(ExecuteActi onsTaskExecuter.java:248)
    at org.gradle.internal.execution.steps.ExecuteStep.ex ecuteInternal(ExecuteStep.java:83)
    at org.gradle.internal.execution.steps.ExecuteStep.ac cess$000(ExecuteStep.java:37)
    at org.gradle.internal.execution.steps.ExecuteStep$1. call(ExecuteStep.java:50)
    at org.gradle.internal.execution.steps.ExecuteStep$1. call(ExecuteStep.java:47)
    at org.gradle.internal.operations.DefaultBuildOperati onRunner$CallableBuildOperationWorker.execute(Defa ultBuildOperationRunner.java:200)
    at org.gradle.internal.operations.DefaultBuildOperati onRunner$CallableBuildOperationWorker.execute(Defa ultBuildOperationRunner.java:195)
    at org.gradle.internal.operations.DefaultBuildOperati onRunner$3.execute(DefaultBuildOperationRunner.jav a:75)
    at org.gradle.internal.operations.DefaultBuildOperati onRunner$3.execute(DefaultBuildOperationRunner.jav a:68)
    at org.gradle.internal.operations.DefaultBuildOperati onRunner.execute(DefaultBuildOperationRunner.java: 153)
    at org.gradle.internal.operations.DefaultBuildOperati onRunner.execute(DefaultBuildOperationRunner.java: 68)
    at org.gradle.internal.operations.DefaultBuildOperati onRunner.call(DefaultBuildOperationRunner.java:62)
    at org.gradle.internal.operations.DefaultBuildOperati onExecutor.lambda$call$2(DefaultBuildOperationExec utor.java:76)
    at org.gradle.internal.operations.UnmanagedBuildOpera tionWrapper.callWithUnmanagedSupport(UnmanagedBuil dOperationWrapper.java:54)
    at org.gradle.internal.operations.DefaultBuildOperati onExecutor.call(DefaultBuildOperationExecutor.java :76)
    at org.gradle.internal.execution.steps.ExecuteStep.ex ecute(ExecuteStep.java:47)
    at org.gradle.internal.execution.steps.ExecuteStep.ex ecute(ExecuteStep.java:37)
    at org.gradle.internal.execution.steps.RemovePrevious OutputsStep.execute(RemovePreviousOutputsStep.java :68)
    at org.gradle.internal.execution.steps.RemovePrevious OutputsStep.execute(RemovePreviousOutputsStep.java :38)
    at org.gradle.internal.execution.steps.ResolveInputCh angesStep.execute(ResolveInputChangesStep.java:50)
    at org.gradle.internal.execution.steps.ResolveInputCh angesStep.execute(ResolveInputChangesStep.java:36)
    at org.gradle.internal.execution.steps.CancelExecutio nStep.execute(CancelExecutionStep.java:41)
    at org.gradle.internal.execution.steps.TimeoutStep.ex ecuteWithoutTimeout(TimeoutStep.java:74)
    at org.gradle.internal.execution.steps.TimeoutStep.ex ecute(TimeoutStep.java:55)
    at org.gradle.internal.execution.steps.CreateOutputsS tep.execute(CreateOutputsStep.java:51)
    at org.gradle.internal.execution.steps.CreateOutputsS tep.execute(CreateOutputsStep.java:29)
    at org.gradle.internal.execution.steps.CaptureStateAf terExecutionStep.execute(CaptureStateAfterExecutio nStep.java:54)
    at org.gradle.internal.execution.steps.CaptureStateAf terExecutionStep.execute(CaptureStateAfterExecutio nStep.java:35)
    at org.gradle.internal.execution.steps.BroadcastChang ingOutputsStep.execute(BroadcastChangingOutputsSte p.java:60)
    at org.gradle.internal.execution.steps.BroadcastChang ingOutputsStep.execute(BroadcastChangingOutputsSte p.java:27)
    at org.gradle.internal.execution.steps.BuildCacheStep .executeWithoutCache(BuildCacheStep.java:174)
    at org.gradle.internal.execution.steps.BuildCacheStep .execute(BuildCacheStep.java:74)
    at org.gradle.internal.execution.steps.BuildCacheStep .execute(BuildCacheStep.java:45)
    at org.gradle.internal.execution.steps.StoreExecution StateStep.execute(StoreExecutionStateStep.java:40)
    at org.gradle.internal.execution.steps.StoreExecution StateStep.execute(StoreExecutionStateStep.java:29)
    at org.gradle.internal.execution.steps.RecordOutputsS tep.execute(RecordOutputsStep.java:36)
    at org.gradle.internal.execution.steps.RecordOutputsS tep.execute(RecordOutputsStep.java:22)
    at org.gradle.internal.execution.steps.SkipUpToDateSt ep.executeBecause(SkipUpToDateStep.java:99)
    at org.gradle.internal.execution.steps.SkipUpToDateSt ep.lambda$execute$0(SkipUpToDateStep.java:92)
    at java.util.Optional.map(Optional.java:215)
    at org.gradle.internal.execution.steps.SkipUpToDateSt ep.execute(SkipUpToDateStep.java:52)
    at org.gradle.internal.execution.steps.SkipUpToDateSt ep.execute(SkipUpToDateStep.java:36)
    at org.gradle.internal.execution.steps.ResolveChanges Step.execute(ResolveChangesStep.java:84)
    at org.gradle.internal.execution.steps.ResolveChanges Step.execute(ResolveChangesStep.java:41)
    at org.gradle.internal.execution.steps.legacy.MarkSna pshottingInputsFinishedStep.execute(MarkSnapshotti ngInputsFinishedStep.java:37)
    at org.gradle.internal.execution.steps.legacy.MarkSna pshottingInputsFinishedStep.execute(MarkSnapshotti ngInputsFinishedStep.java:27)
    at org.gradle.internal.execution.steps.ResolveCaching StateStep.execute(ResolveCachingStateStep.java:91)
    at org.gradle.internal.execution.steps.ResolveCaching StateStep.execute(ResolveCachingStateStep.java:49)
    at org.gradle.internal.execution.steps.CaptureStateBe foreExecutionStep.execute(CaptureStateBeforeExecut ionStep.java:78)
    at org.gradle.internal.execution.steps.CaptureStateBe foreExecutionStep.execute(CaptureStateBeforeExecut ionStep.java:49)
    at org.gradle.internal.execution.steps.ValidateStep.e xecute(ValidateStep.java:105)
    at org.gradle.internal.execution.steps.ValidateStep.e xecute(ValidateStep.java:50)
    at org.gradle.internal.execution.steps.SkipEmptyWorkS tep.lambda$execute$2(SkipEmptyWorkStep.java:86)
    at java.util.Optional.orElseGet(Optional.java:267)
    at org.gradle.internal.execution.steps.SkipEmptyWorkS tep.execute(SkipEmptyWorkStep.java:86)
    at org.gradle.internal.execution.steps.SkipEmptyWorkS tep.execute(SkipEmptyWorkStep.java:32)
    at org.gradle.internal.execution.steps.legacy.MarkSna pshottingInputsStartedStep.execute(MarkSnapshottin gInputsStartedStep.java:38)
    at org.gradle.internal.execution.steps.LoadExecutionS tateStep.execute(LoadExecutionStateStep.java:43)
    at org.gradle.internal.execution.steps.LoadExecutionS tateStep.execute(LoadExecutionStateStep.java:31)
    at org.gradle.internal.execution.steps.AssignWorkspac eStep.lambda$execute$0(AssignWorkspaceStep.java:40 )
    at org.gradle.api.internal.tasks.execution.ExecuteAct ionsTaskExecuter$TaskExecution$2.withWorkspace(Exe cuteActionsTaskExecuter.java:283)
    at org.gradle.internal.execution.steps.AssignWorkspac eStep.execute(AssignWorkspaceStep.java:40)
    at org.gradle.internal.execution.steps.AssignWorkspac eStep.execute(AssignWorkspaceStep.java:30)
    at org.gradle.internal.execution.steps.IdentityCacheS tep.execute(IdentityCacheStep.java:37)
    at org.gradle.internal.execution.steps.IdentityCacheS tep.execute(IdentityCacheStep.java:27)
    at org.gradle.internal.execution.steps.IdentifyStep.e xecute(IdentifyStep.java:49)
    at org.gradle.internal.execution.steps.IdentifyStep.e xecute(IdentifyStep.java:35)
    at org.gradle.internal.execution.impl.DefaultExecutio nEngine$1.execute(DefaultExecutionEngine.java:76)
    at org.gradle.api.internal.tasks.execution.ExecuteAct ionsTaskExecuter.executeIfValid(ExecuteActionsTask Executer.java:184)
    at org.gradle.api.internal.tasks.execution.ExecuteAct ionsTaskExecuter.execute(ExecuteActionsTaskExecute r.java:173)
    at org.gradle.api.internal.tasks.execution.CleanupSta leOutputsExecuter.execute(CleanupStaleOutputsExecu ter.java:109)
    at org.gradle.api.internal.tasks.execution.FinalizePr opertiesTaskExecuter.execute(FinalizePropertiesTas kExecuter.java:46)
    at org.gradle.api.internal.tasks.execution.ResolveTas kExecutionModeExecuter.execute(ResolveTaskExecutio nModeExecuter.java:51)
    at org.gradle.api.internal.tasks.execution.SkipTaskWi thNoActionsExecuter.execute(SkipTaskWithNoActionsE xecuter.java:57)
    at org.gradle.api.internal.tasks.execution.SkipOnlyIf TaskExecuter.execute(SkipOnlyIfTaskExecuter.java:5 6)
    at org.gradle.api.internal.tasks.execution.CatchExcep tionTaskExecuter.execute(CatchExceptionTaskExecute r.java:36)
    at org.gradle.api.internal.tasks.execution.EventFirin gTaskExecuter$1.executeTask(EventFiringTaskExecute r.java:77)
    at org.gradle.api.internal.tasks.execution.EventFirin gTaskExecuter$1.call(EventFiringTaskExecuter.java: 55)
    at org.gradle.api.internal.tasks.execution.EventFirin gTaskExecuter$1.call(EventFiringTaskExecuter.java: 52)
    at org.gradle.internal.operations.DefaultBuildOperati onRunner$CallableBuildOperationWorker.execute(Defa ultBuildOperationRunner.java:200)
    at org.gradle.internal.operations.DefaultBuildOperati onRunner$CallableBuildOperationWorker.execute(Defa ultBuildOperationRunner.java:195)
    at org.gradle.internal.operations.DefaultBuildOperati onRunner$3.execute(DefaultBuildOperationRunner.jav a:75)
    at org.gradle.internal.operations.DefaultBuildOperati onRunner$3.execute(DefaultBuildOperationRunner.jav a:68)
    at org.gradle.internal.operations.DefaultBuildOperati onRunner.execute(DefaultBuildOperationRunner.java: 153)
    at org.gradle.internal.operations.DefaultBuildOperati onRunner.execute(DefaultBuildOperationRunner.java: 68)
    at org.gradle.internal.operations.DefaultBuildOperati onRunner.call(DefaultBuildOperationRunner.java:62)
    at org.gradle.internal.operations.DefaultBuildOperati onExecutor.lambda$call$2(DefaultBuildOperationExec utor.java:76)
    at org.gradle.internal.operations.UnmanagedBuildOpera tionWrapper.callWithUnmanagedSupport(UnmanagedBuil dOperationWrapper.java:54)
    at org.gradle.internal.operations.DefaultBuildOperati onExecutor.call(DefaultBuildOperationExecutor.java :76)
    at org.gradle.api.internal.tasks.execution.EventFirin gTaskExecuter.execute(EventFiringTaskExecuter.java :52)
    at org.gradle.execution.plan.LocalTaskNodeExecutor.ex ecute(LocalTaskNodeExecutor.java:74)
    at org.gradle.execution.taskgraph.DefaultTaskExecutio nGraph$InvokeNodeExecutorsAction.execute(DefaultTa skExecutionGraph.java:408)
    at org.gradle.execution.taskgraph.DefaultTaskExecutio nGraph$InvokeNodeExecutorsAction.execute(DefaultTa skExecutionGraph.java:395)
    at org.gradle.execution.taskgraph.DefaultTaskExecutio nGraph$BuildOperationAwareExecutionAction.execute( DefaultTaskExecutionGraph.java:388)
    at org.gradle.execution.taskgraph.DefaultTaskExecutio nGraph$BuildOperationAwareExecutionAction.execute( DefaultTaskExecutionGraph.java:374)
    at org.gradle.execution.plan.DefaultPlanExecutor$Exec utorWorker.lambda$run$0(DefaultPlanExecutor.java:1 27)
    at org.gradle.execution.plan.DefaultPlanExecutor$Exec utorWorker.execute(DefaultPlanExecutor.java:191)
    at org.gradle.execution.plan.DefaultPlanExecutor$Exec utorWorker.executeNextNode(DefaultPlanExecutor.jav a:182)
    at org.gradle.execution.plan.DefaultPlanExecutor$Exec utorWorker.run(DefaultPlanExecutor.java:124)
    at org.gradle.internal.concurrent.ExecutorPolicy$Catc hAndRecordFailures.onExecute(ExecutorPolicy.java:6 4)
    at org.gradle.internal.concurrent.ManagedExecutorImpl $1.run(ManagedExecutorImpl.java:48)
    at java.util.concurrent.ThreadPoolExecutor.runWorker( ThreadPoolExecutor.java:1149)
    at java.util.concurrent.ThreadPoolExecutor$Worker.run (ThreadPoolExecutor.java:624)
    at org.gradle.internal.concurrent.ThreadFactoryImpl$M anagedThreadRunnable.run(ThreadFactoryImpl.java:56 )
    at java.lang.Thread.run(Thread.java:748)

    FAILURE: Build failed with an exception.

    * What went wrong:
    Execution failed for task ':app:compileReleaseJavaWithJavac'.
    > Compilation failed; see the compiler error output for details.

    * Try:
    Run with --stacktrace option to get the stack trace. Run with --info or --debug option to get more log output. Run with --scan to get full insights.

    * Get more help at https://help.gradle.org

    BUILD FAILED in 5s
    31 actionable tasks: 31 executed

  6. #16
    Clickteam Clickteam

    Join Date
    Jun 2006
    Location
    France
    Posts
    14,172
    Mentioned
    279 Post(s)
    Tagged
    3 Thread(s)
    What version of the Java SDK do you use? do you use the one provided with Android Studio in its jre sub-folder? (this is the one that is recommended, C:\Program Files\Android\Android Studio\jre)

  7. #17
    Clickteam Clickteam

    Join Date
    Jun 2006
    Location
    France
    Posts
    14,172
    Mentioned
    279 Post(s)
    Tagged
    3 Thread(s)
    Quote Originally Posted by CrazyFrezi View Post
    It worked.
    If you give an active, a counter and a string the same qualifier, it will create 3 objects in the event editor.
    For info you should not use the same qualifier for different object types (e.g. active and strings) as this is causing known issues inn the global event editor (you can use them in local frame events, but not in the global event editor).

  8. #18
    Clicker Fusion 2.5 (Steam)Fusion 2.5 Developer (Steam)Fusion 2.5+ DLC (Steam)Android Export Module (Steam)

    Join Date
    Jul 2019
    Posts
    105
    Mentioned
    1 Post(s)
    Tagged
    0 Thread(s)
    Quote Originally Posted by Yves View Post
    What version of the Java SDK do you use? do you use the one provided with Android Studio in its jre sub-folder? (this is the one that is recommended, C:\Program Files\Android\Android Studio\jre)
    I was not :-X
    I've changed the Java SDK folder to Android Studio\jre and it builds with API 31 ! :-D

    Thanks =]

Page 2 of 2 FirstFirst 1 2

Similar Threads

  1. Replies: 11
    Last Post: 7th November 2019, 07:40 PM
  2. Replies: 0
    Last Post: 22nd June 2017, 02:00 AM
  3. Replies: 3
    Last Post: 1st July 2015, 05:46 AM
  4. Binary attached file
    By Evoxe in forum Multimedia Fusion 2 - Technical Support
    Replies: 13
    Last Post: 17th July 2009, 08:22 AM
  5. MooGame Help Needed Please (FILE ATTACHED)
    By YAS in forum File Archive
    Replies: 4
    Last Post: 25th September 2006, 10:55 PM

Posting Permissions

  • You may not post new threads
  • You may not post replies
  • You may not post attachments
  • You may not edit your posts
  •