User Tag List

Page 1 of 2 1 2 LastLast
Results 1 to 10 of 18

Thread: Can't build aab file - log attached + extensions list

  1. #1
    Clicker Fusion 2.5 (Steam)Fusion 2.5 Developer (Steam)Fusion 2.5+ DLC (Steam)Android Export Module (Steam)

    Join Date
    Jul 2019
    Posts
    105
    Mentioned
    1 Post(s)
    Tagged
    0 Thread(s)

    Question Can't build aab file - log attached + extensions list

    Extension 9 slice is not used on the app, deleted all objects (can I chack there are no left overs?), but it's still on the list.


    Starting a Gradle Daemon (subsequent builds will be faster)
    WARNING:: Please remove usages of `jcenter()` Maven repository from your build scripts and migrate your build to other Maven repositories.
    This repository is deprecated and it will be shut down in the future.
    See http://developer.android.com/r/tools...end-of-service for more information.
    Currently detected usages in: root project 'And5BB9.tmp', project ':app'
    > Task :app:preBuild UP-TO-DATE
    > Task :app:preReleaseBuild UP-TO-DATE
    > Task :app:writeReleaseApplicationId
    > Task :app:analyticsRecordingRelease
    > Task :app:compileReleaseRenderscript NO-SOURCE
    > Task :app:generateReleaseResValues
    > Task :app:generateReleaseResources
    > Task :app:createReleaseCompatibleScreenManifests
    > Task :app:extractDeepLinksRelease
    > Task :app:processReleaseMainManifest
    > Task :app:processReleaseManifest
    > Task :app:processApplicationManifestReleaseForBundle
    > Task :app:mergeReleaseResources
    > Task :app:checkReleaseDuplicateClasses
    > Task :app:compileReleaseAidl NO-SOURCE
    > Task :app:generateReleaseBuildConfig
    > Task :app:javaPreCompileRelease
    > Task :app:checkReleaseAarMetadata
    > Task :app:mergeReleaseShaders
    > Task :app:compileReleaseShaders NO-SOURCE
    > Task :app:generateReleaseAssets UP-TO-DATE
    > Task :app:mergeReleaseAssets
    > Task :app:processReleaseManifestForPackage
    > Task :app:processReleaseJavaRes NO-SOURCE
    > Task :app:mergeReleaseJniLibFolders
    > Task :app:collectReleaseDependencies
    > Task :app:configureReleaseDependencies
    > Task :app:parseReleaseIntegrityConfig
    > Task :app:writeReleaseAppMetadata
    > Task :app:validateSigningRelease
    > Task :app:desugarReleaseFileDependencies
    > Task :app:mergeReleaseNativeLibs
    > Task :app:mergeReleaseJavaResource

    > Task :app:stripReleaseDebugSymbols
    Unable to strip the following libraries, packaging them as they are: libES1Renderer.so, libES2Renderer.so, libES3Renderer.so, libRuntimeNative.so, libgdx.so.

    > Task :app:extractReleaseNativeSymbolTables
    Unable to extract native debug metadata from C:\Users\Yaron\AppData\Local\Temp\And5BB9.tmp\app\ build\intermediates\merged_native_libs\release\out \lib\arm64-v8a\libES1Renderer.so because unable to locate the objcopy executable for the arm64-v8a ABI.
    Unable to extract native debug metadata from C:\Users\Yaron\AppData\Local\Temp\And5BB9.tmp\app\ build\intermediates\merged_native_libs\release\out \lib\arm64-v8a\libES2Renderer.so because unable to locate the objcopy executable for the arm64-v8a ABI.
    Unable to extract native debug metadata from C:\Users\Yaron\AppData\Local\Temp\And5BB9.tmp\app\ build\intermediates\merged_native_libs\release\out \lib\arm64-v8a\libES3Renderer.so because unable to locate the objcopy executable for the arm64-v8a ABI.
    Unable to extract native debug metadata from C:\Users\Yaron\AppData\Local\Temp\And5BB9.tmp\app\ build\intermediates\merged_native_libs\release\out \lib\arm64-v8a\libgdx.so because unable to locate the objcopy executable for the arm64-v8a ABI.
    Unable to extract native debug metadata from C:\Users\Yaron\AppData\Local\Temp\And5BB9.tmp\app\ build\intermediates\merged_native_libs\release\out \lib\arm64-v8a\libRuntimeNative.so because unable to locate the objcopy executable for the arm64-v8a ABI.
    Unable to extract native debug metadata from C:\Users\Yaron\AppData\Local\Temp\And5BB9.tmp\app\ build\intermediates\merged_native_libs\release\out \lib\armeabi-v7a\libES1Renderer.so because unable to locate the objcopy executable for the armeabi-v7a ABI.
    Unable to extract native debug metadata from C:\Users\Yaron\AppData\Local\Temp\And5BB9.tmp\app\ build\intermediates\merged_native_libs\release\out \lib\armeabi-v7a\libES2Renderer.so because unable to locate the objcopy executable for the armeabi-v7a ABI.
    Unable to extract native debug metadata from C:\Users\Yaron\AppData\Local\Temp\And5BB9.tmp\app\ build\intermediates\merged_native_libs\release\out \lib\armeabi-v7a\libES3Renderer.so because unable to locate the objcopy executable for the armeabi-v7a ABI.
    Unable to extract native debug metadata from C:\Users\Yaron\AppData\Local\Temp\And5BB9.tmp\app\ build\intermediates\merged_native_libs\release\out \lib\armeabi-v7a\libgdx.so because unable to locate the objcopy executable for the armeabi-v7a ABI.
    Unable to extract native debug metadata from C:\Users\Yaron\AppData\Local\Temp\And5BB9.tmp\app\ build\intermediates\merged_native_libs\release\out \lib\armeabi-v7a\libRuntimeNative.so because unable to locate the objcopy executable for the armeabi-v7a ABI.
    Unable to extract native debug metadata from C:\Users\Yaron\AppData\Local\Temp\And5BB9.tmp\app\ build\intermediates\merged_native_libs\release\out \lib\x86\libES1Renderer.so because unable to locate the objcopy executable for the x86 ABI.
    Unable to extract native debug metadata from C:\Users\Yaron\AppData\Local\Temp\And5BB9.tmp\app\ build\intermediates\merged_native_libs\release\out \lib\x86\libES2Renderer.so because unable to locate the objcopy executable for the x86 ABI.
    Unable to extract native debug metadata from C:\Users\Yaron\AppData\Local\Temp\And5BB9.tmp\app\ build\intermediates\merged_native_libs\release\out \lib\x86\libES3Renderer.so because unable to locate the objcopy executable for the x86 ABI.
    Unable to extract native debug metadata from C:\Users\Yaron\AppData\Local\Temp\And5BB9.tmp\app\ build\intermediates\merged_native_libs\release\out \lib\x86\libgdx.so because unable to locate the objcopy executable for the x86 ABI.
    Unable to extract native debug metadata from C:\Users\Yaron\AppData\Local\Temp\And5BB9.tmp\app\ build\intermediates\merged_native_libs\release\out \lib\x86\libRuntimeNative.so because unable to locate the objcopy executable for the x86 ABI.
    Unable to extract native debug metadata from C:\Users\Yaron\AppData\Local\Temp\And5BB9.tmp\app\ build\intermediates\merged_native_libs\release\out \lib\x86_64\libES1Renderer.so because unable to locate the objcopy executable for the x86_64 ABI.
    Unable to extract native debug metadata from C:\Users\Yaron\AppData\Local\Temp\And5BB9.tmp\app\ build\intermediates\merged_native_libs\release\out \lib\x86_64\libES2Renderer.so because unable to locate the objcopy executable for the x86_64 ABI.
    Unable to extract native debug metadata from C:\Users\Yaron\AppData\Local\Temp\And5BB9.tmp\app\ build\intermediates\merged_native_libs\release\out \lib\x86_64\libES3Renderer.so because unable to locate the objcopy executable for the x86_64 ABI.
    Unable to extract native debug metadata from C:\Users\Yaron\AppData\Local\Temp\And5BB9.tmp\app\ build\intermediates\merged_native_libs\release\out \lib\x86_64\libgdx.so because unable to locate the objcopy executable for the x86_64 ABI.
    Unable to extract native debug metadata from C:\Users\Yaron\AppData\Local\Temp\And5BB9.tmp\app\ build\intermediates\merged_native_libs\release\out \lib\x86_64\libRuntimeNative.so because unable to locate the objcopy executable for the x86_64 ABI.

    > Task :app:mergeExtDexRelease
    > Task :app:bundleReleaseResources
    > Task :app:processReleaseResources

    > Task :app:compileReleaseJavaWithJavac FAILED
    An exception has occurred in the compiler (1.8.0_282). Please file a bug against the Java compiler via the Java bug reporting page (http://bugreport.java.com) after checking the Bug Database (http://bugs.java.com) for duplicates. Include your program and the following diagnostic in your report. Thank you.
    java.lang.AssertionError: annotationType(): unrecognized Attribute name MODULE (class com.sun.tools.javac.util.UnsharedNameTable$NameImp l)
    at com.sun.tools.javac.util.Assert.error(Assert.java: 133)
    at com.sun.tools.javac.code.TypeAnnotations.annotatio nType(TypeAnnotations.java:231)
    at com.sun.tools.javac.code.TypeAnnotations$TypeAnnot ationPositions.separateAnnotationsKinds(TypeAnnota tions.java:294)
    at com.sun.tools.javac.code.TypeAnnotations$TypeAnnot ationPositions.visitMethodDef(TypeAnnotations.java :1066)
    at com.sun.tools.javac.tree.JCTree$JCMethodDecl.accep t(JCTree.java:778)
    at com.sun.tools.javac.tree.TreeScanner.scan(TreeScan ner.java:49)
    at com.sun.tools.javac.code.TypeAnnotations$TypeAnnot ationPositions.scan(TypeAnnotations.java:275)
    at com.sun.tools.javac.tree.TreeScanner.scan(TreeScan ner.java:57)
    at com.sun.tools.javac.code.TypeAnnotations$TypeAnnot ationPositions.visitClassDef(TypeAnnotations.java: 1042)
    at com.sun.tools.javac.tree.JCTree$JCClassDecl.accept (JCTree.java:693)
    at com.sun.tools.javac.tree.TreeScanner.scan(TreeScan ner.java:49)
    at com.sun.tools.javac.code.TypeAnnotations$TypeAnnot ationPositions.scan(TypeAnnotations.java:275)
    at com.sun.tools.javac.code.TypeAnnotations$1.run(Typ eAnnotations.java:127)
    at com.sun.tools.javac.comp.Annotate.flush(Annotate.j ava:152)
    at com.sun.tools.javac.comp.Annotate.enterDone(Annota te.java:129)
    at com.sun.tools.javac.comp.Enter.complete(Enter.java :512)
    at com.sun.tools.javac.comp.Enter.main(Enter.java:471 )
    at com.sun.tools.javac.main.JavaCompiler.enterTrees(J avaCompiler.java:982)
    at com.sun.tools.javac.main.JavaCompiler.compile(Java Compiler.java:857)
    at com.sun.tools.javac.main.Main.compile(Main.java:52 3)
    at com.sun.tools.javac.api.JavacTaskImpl.doCall(Javac TaskImpl.java:129)
    at com.sun.tools.javac.api.JavacTaskImpl.call(JavacTa skImpl.java:138)
    at org.gradle.internal.compiler.java.IncrementalCompi leTask.call(IncrementalCompileTask.java:74)
    at org.gradle.api.internal.tasks.compile.AnnotationPr ocessingCompileTask.call(AnnotationProcessingCompi leTask.java:94)
    at org.gradle.api.internal.tasks.compile.ResourceClea ningCompilationTask.call(ResourceCleaningCompilati onTask.java:57)
    at org.gradle.api.internal.tasks.compile.JdkJavaCompi ler.execute(JdkJavaCompiler.java:55)
    at org.gradle.api.internal.tasks.compile.JdkJavaCompi ler.execute(JdkJavaCompiler.java:40)
    at org.gradle.api.internal.tasks.compile.NormalizingJ avaCompiler.delegateAndHandleErrors(NormalizingJav aCompiler.java:97)
    at org.gradle.api.internal.tasks.compile.NormalizingJ avaCompiler.execute(NormalizingJavaCompiler.java:5 1)
    at org.gradle.api.internal.tasks.compile.NormalizingJ avaCompiler.execute(NormalizingJavaCompiler.java:3 7)
    at org.gradle.api.internal.tasks.compile.AnnotationPr ocessorDiscoveringCompiler.execute(AnnotationProce ssorDiscoveringCompiler.java:51)
    at org.gradle.api.internal.tasks.compile.AnnotationPr ocessorDiscoveringCompiler.execute(AnnotationProce ssorDiscoveringCompiler.java:37)
    at org.gradle.api.internal.tasks.compile.ModuleApplic ationNameWritingCompiler.execute(ModuleApplication NameWritingCompiler.java:46)
    at org.gradle.api.internal.tasks.compile.ModuleApplic ationNameWritingCompiler.execute(ModuleApplication NameWritingCompiler.java:36)
    at org.gradle.api.internal.tasks.compile.CleaningJava Compiler.execute(CleaningJavaCompiler.java:53)
    at org.gradle.api.internal.tasks.compile.incremental. IncrementalCompilerFactory.lambda$createRebuildAll Compiler$0(IncrementalCompilerFactory.java:98)
    at org.gradle.api.internal.tasks.compile.incremental. IncrementalResultStoringCompiler.execute(Increment alResultStoringCompiler.java:61)
    at org.gradle.api.internal.tasks.compile.incremental. IncrementalResultStoringCompiler.execute(Increment alResultStoringCompiler.java:45)
    at org.gradle.api.internal.tasks.compile.CompileJavaB uildOperationReportingCompiler$2.call(CompileJavaB uildOperationReportingCompiler.java:59)
    at org.gradle.api.internal.tasks.compile.CompileJavaB uildOperationReportingCompiler$2.call(CompileJavaB uildOperationReportingCompiler.java:51)
    at org.gradle.internal.operations.DefaultBuildOperati onRunner$CallableBuildOperationWorker.execute(Defa ultBuildOperationRunner.java:200)
    at org.gradle.internal.operations.DefaultBuildOperati onRunner$CallableBuildOperationWorker.execute(Defa ultBuildOperationRunner.java:195)
    at org.gradle.internal.operations.DefaultBuildOperati onRunner$3.execute(DefaultBuildOperationRunner.jav a:75)
    at org.gradle.internal.operations.DefaultBuildOperati onRunner$3.execute(DefaultBuildOperationRunner.jav a:68)
    at org.gradle.internal.operations.DefaultBuildOperati onRunner.execute(DefaultBuildOperationRunner.java: 153)
    at org.gradle.internal.operations.DefaultBuildOperati onRunner.execute(DefaultBuildOperationRunner.java: 68)
    at org.gradle.internal.operations.DefaultBuildOperati onRunner.call(DefaultBuildOperationRunner.java:62)
    at org.gradle.internal.operations.DefaultBuildOperati onExecutor.lambda$call$2(DefaultBuildOperationExec utor.java:76)
    at org.gradle.internal.operations.UnmanagedBuildOpera tionWrapper.callWithUnmanagedSupport(UnmanagedBuil dOperationWrapper.java:54)
    at org.gradle.internal.operations.DefaultBuildOperati onExecutor.call(DefaultBuildOperationExecutor.java :76)
    at org.gradle.api.internal.tasks.compile.CompileJavaB uildOperationReportingCompiler.execute(CompileJava BuildOperationReportingCompiler.java:51)
    at org.gradle.api.tasks.compile.JavaCompile.performCo mpilation(JavaCompile.java:343)
    at org.gradle.api.tasks.compile.JavaCompile.performIn crementalCompilation(JavaCompile.java:237)
    at org.gradle.api.tasks.compile.JavaCompile.compile(J avaCompile.java:209)
    at sun.reflect.NativeMethodAccessorImpl.invoke0(Nativ e Method)
    at sun.reflect.NativeMethodAccessorImpl.invoke(Native MethodAccessorImpl.java:62)
    at sun.reflect.DelegatingMethodAccessorImpl.invoke(De legatingMethodAccessorImpl.java:43)
    at java.lang.reflect.Method.invoke(Method.java:498)
    at org.gradle.internal.reflect.JavaMethod.invoke(Java Method.java:104)
    at org.gradle.api.internal.project.taskfactory.Increm entalInputsTaskAction.doExecute(IncrementalInputsT askAction.java:32)
    at org.gradle.api.internal.project.taskfactory.Standa rdTaskAction.execute(StandardTaskAction.java:51)
    at org.gradle.api.internal.project.taskfactory.Abstra ctIncrementalTaskAction.execute(AbstractIncrementa lTaskAction.java:25)
    at org.gradle.api.internal.project.taskfactory.Standa rdTaskAction.execute(StandardTaskAction.java:29)
    at org.gradle.api.internal.tasks.execution.ExecuteAct ionsTaskExecuter$3.run(ExecuteActionsTaskExecuter. java:555)
    at org.gradle.internal.operations.DefaultBuildOperati onRunner$1.execute(DefaultBuildOperationRunner.jav a:29)
    at org.gradle.internal.operations.DefaultBuildOperati onRunner$1.execute(DefaultBuildOperationRunner.jav a:26)
    at org.gradle.internal.operations.DefaultBuildOperati onRunner$3.execute(DefaultBuildOperationRunner.jav a:75)
    at org.gradle.internal.operations.DefaultBuildOperati onRunner$3.execute(DefaultBuildOperationRunner.jav a:68)
    at org.gradle.internal.operations.DefaultBuildOperati onRunner.execute(DefaultBuildOperationRunner.java: 153)
    at org.gradle.internal.operations.DefaultBuildOperati onRunner.execute(DefaultBuildOperationRunner.java: 68)
    at org.gradle.internal.operations.DefaultBuildOperati onRunner.run(DefaultBuildOperationRunner.java:56)
    at org.gradle.internal.operations.DefaultBuildOperati onExecutor.lambda$run$1(DefaultBuildOperationExecu tor.java:71)
    at org.gradle.internal.operations.UnmanagedBuildOpera tionWrapper.runWithUnmanagedSupport(UnmanagedBuild OperationWrapper.java:45)
    at org.gradle.internal.operations.DefaultBuildOperati onExecutor.run(DefaultBuildOperationExecutor.java: 71)
    at org.gradle.api.internal.tasks.execution.ExecuteAct ionsTaskExecuter.executeAction(ExecuteActionsTaskE xecuter.java:540)
    at org.gradle.api.internal.tasks.execution.ExecuteAct ionsTaskExecuter.executeActions(ExecuteActionsTask Executer.java:523)
    at org.gradle.api.internal.tasks.execution.ExecuteAct ionsTaskExecuter.access$300(ExecuteActionsTaskExec uter.java:108)
    at org.gradle.api.internal.tasks.execution.ExecuteAct ionsTaskExecuter$TaskExecution.executeWithPrevious OutputFiles(ExecuteActionsTaskExecuter.java:271)
    at org.gradle.api.internal.tasks.execution.ExecuteAct ionsTaskExecuter$TaskExecution.execute(ExecuteActi onsTaskExecuter.java:260)
    at org.gradle.internal.execution.steps.ExecuteStep.la mbda$execute$0(ExecuteStep.java:33)
    at java.util.Optional.map(Optional.java:215)
    at org.gradle.internal.execution.steps.ExecuteStep.ex ecute(ExecuteStep.java:33)
    at org.gradle.internal.execution.steps.ExecuteStep.ex ecute(ExecuteStep.java:26)
    at org.gradle.internal.execution.steps.CleanupOutputs Step.execute(CleanupOutputsStep.java:67)
    at org.gradle.internal.execution.steps.CleanupOutputs Step.execute(CleanupOutputsStep.java:36)
    at org.gradle.internal.execution.steps.ResolveInputCh angesStep.execute(ResolveInputChangesStep.java:49)
    at org.gradle.internal.execution.steps.ResolveInputCh angesStep.execute(ResolveInputChangesStep.java:34)
    at org.gradle.internal.execution.steps.CancelExecutio nStep.execute(CancelExecutionStep.java:43)
    at org.gradle.internal.execution.steps.TimeoutStep.ex ecuteWithoutTimeout(TimeoutStep.java:73)
    at org.gradle.internal.execution.steps.TimeoutStep.ex ecute(TimeoutStep.java:54)
    at org.gradle.internal.execution.steps.CreateOutputsS tep.execute(CreateOutputsStep.java:44)
    at org.gradle.internal.execution.steps.SnapshotOutput sStep.execute(SnapshotOutputsStep.java:54)
    at org.gradle.internal.execution.steps.SnapshotOutput sStep.execute(SnapshotOutputsStep.java:38)
    at org.gradle.internal.execution.steps.BroadcastChang ingOutputsStep.execute(BroadcastChangingOutputsSte p.java:42)
    at org.gradle.internal.execution.steps.CacheStep.exec uteWithoutCache(CacheStep.java:159)
    at org.gradle.internal.execution.steps.CacheStep.exec ute(CacheStep.java:72)
    at org.gradle.internal.execution.steps.CacheStep.exec ute(CacheStep.java:43)
    at org.gradle.internal.execution.steps.StoreExecution StateStep.execute(StoreExecutionStateStep.java:44)
    at org.gradle.internal.execution.steps.StoreExecution StateStep.execute(StoreExecutionStateStep.java:33)
    at org.gradle.internal.execution.steps.RecordOutputsS tep.execute(RecordOutputsStep.java:38)
    at org.gradle.internal.execution.steps.RecordOutputsS tep.execute(RecordOutputsStep.java:24)
    at org.gradle.internal.execution.steps.SkipUpToDateSt ep.executeBecause(SkipUpToDateStep.java:92)
    at org.gradle.internal.execution.steps.SkipUpToDateSt ep.lambda$execute$0(SkipUpToDateStep.java:85)
    at java.util.Optional.map(Optional.java:215)
    at org.gradle.internal.execution.steps.SkipUpToDateSt ep.execute(SkipUpToDateStep.java:55)
    at org.gradle.internal.execution.steps.SkipUpToDateSt ep.execute(SkipUpToDateStep.java:39)
    at org.gradle.internal.execution.steps.ResolveChanges Step.execute(ResolveChangesStep.java:76)
    at org.gradle.internal.execution.steps.ResolveChanges Step.execute(ResolveChangesStep.java:37)
    at org.gradle.internal.execution.steps.legacy.MarkSna pshottingInputsFinishedStep.execute(MarkSnapshotti ngInputsFinishedStep.java:36)
    at org.gradle.internal.execution.steps.legacy.MarkSna pshottingInputsFinishedStep.execute(MarkSnapshotti ngInputsFinishedStep.java:26)
    at org.gradle.internal.execution.steps.ResolveCaching StateStep.execute(ResolveCachingStateStep.java:94)
    at org.gradle.internal.execution.steps.ResolveCaching StateStep.execute(ResolveCachingStateStep.java:49)
    at org.gradle.internal.execution.steps.CaptureStateBe foreExecutionStep.execute(CaptureStateBeforeExecut ionStep.java:79)
    at org.gradle.internal.execution.steps.CaptureStateBe foreExecutionStep.execute(CaptureStateBeforeExecut ionStep.java:53)
    at org.gradle.internal.execution.steps.ValidateStep.e xecute(ValidateStep.java:74)
    at org.gradle.internal.execution.steps.SkipEmptyWorkS tep.lambda$execute$2(SkipEmptyWorkStep.java:78)
    at java.util.Optional.orElseGet(Optional.java:267)
    at org.gradle.internal.execution.steps.SkipEmptyWorkS tep.execute(SkipEmptyWorkStep.java:78)
    at org.gradle.internal.execution.steps.SkipEmptyWorkS tep.execute(SkipEmptyWorkStep.java:34)
    at org.gradle.internal.execution.steps.legacy.MarkSna pshottingInputsStartedStep.execute(MarkSnapshottin gInputsStartedStep.java:39)
    at org.gradle.internal.execution.steps.LoadExecutionS tateStep.execute(LoadExecutionStateStep.java:40)
    at org.gradle.internal.execution.steps.LoadExecutionS tateStep.execute(LoadExecutionStateStep.java:28)
    at org.gradle.internal.execution.impl.DefaultWorkExec utor.execute(DefaultWorkExecutor.java:33)
    at org.gradle.api.internal.tasks.execution.ExecuteAct ionsTaskExecuter.executeIfValid(ExecuteActionsTask Executer.java:187)
    at org.gradle.api.internal.tasks.execution.ExecuteAct ionsTaskExecuter.execute(ExecuteActionsTaskExecute r.java:179)
    at org.gradle.api.internal.tasks.execution.CleanupSta leOutputsExecuter.execute(CleanupStaleOutputsExecu ter.java:109)
    at org.gradle.api.internal.tasks.execution.FinalizePr opertiesTaskExecuter.execute(FinalizePropertiesTas kExecuter.java:46)
    at org.gradle.api.internal.tasks.execution.ResolveTas kExecutionModeExecuter.execute(ResolveTaskExecutio nModeExecuter.java:62)
    at org.gradle.api.internal.tasks.execution.SkipTaskWi thNoActionsExecuter.execute(SkipTaskWithNoActionsE xecuter.java:57)
    at org.gradle.api.internal.tasks.execution.SkipOnlyIf TaskExecuter.execute(SkipOnlyIfTaskExecuter.java:5 6)
    at org.gradle.api.internal.tasks.execution.CatchExcep tionTaskExecuter.execute(CatchExceptionTaskExecute r.java:36)
    at org.gradle.api.internal.tasks.execution.EventFirin gTaskExecuter$1.executeTask(EventFiringTaskExecute r.java:77)
    at org.gradle.api.internal.tasks.execution.EventFirin gTaskExecuter$1.call(EventFiringTaskExecuter.java: 55)
    at org.gradle.api.internal.tasks.execution.EventFirin gTaskExecuter$1.call(EventFiringTaskExecuter.java: 52)
    at org.gradle.internal.operations.DefaultBuildOperati onRunner$CallableBuildOperationWorker.execute(Defa ultBuildOperationRunner.java:200)
    at org.gradle.internal.operations.DefaultBuildOperati onRunner$CallableBuildOperationWorker.execute(Defa ultBuildOperationRunner.java:195)
    at org.gradle.internal.operations.DefaultBuildOperati onRunner$3.execute(DefaultBuildOperationRunner.jav a:75)
    at org.gradle.internal.operations.DefaultBuildOperati onRunner$3.execute(DefaultBuildOperationRunner.jav a:68)
    at org.gradle.internal.operations.DefaultBuildOperati onRunner.execute(DefaultBuildOperationRunner.java: 153)
    at org.gradle.internal.operations.DefaultBuildOperati onRunner.execute(DefaultBuildOperationRunner.java: 68)
    at org.gradle.internal.operations.DefaultBuildOperati onRunner.call(DefaultBuildOperationRunner.java:62)
    at org.gradle.internal.operations.DefaultBuildOperati onExecutor.lambda$call$2(DefaultBuildOperationExec utor.java:76)
    at org.gradle.internal.operations.UnmanagedBuildOpera tionWrapper.callWithUnmanagedSupport(UnmanagedBuil dOperationWrapper.java:54)
    at org.gradle.internal.operations.DefaultBuildOperati onExecutor.call(DefaultBuildOperationExecutor.java :76)
    at org.gradle.api.internal.tasks.execution.EventFirin gTaskExecuter.execute(EventFiringTaskExecuter.java :52)
    at org.gradle.execution.plan.LocalTaskNodeExecutor.ex ecute(LocalTaskNodeExecutor.java:41)
    at org.gradle.execution.taskgraph.DefaultTaskExecutio nGraph$InvokeNodeExecutorsAction.execute(DefaultTa skExecutionGraph.java:372)
    at org.gradle.execution.taskgraph.DefaultTaskExecutio nGraph$InvokeNodeExecutorsAction.execute(DefaultTa skExecutionGraph.java:359)
    at org.gradle.execution.taskgraph.DefaultTaskExecutio nGraph$BuildOperationAwareExecutionAction.execute( DefaultTaskExecutionGraph.java:352)
    at org.gradle.execution.taskgraph.DefaultTaskExecutio nGraph$BuildOperationAwareExecutionAction.execute( DefaultTaskExecutionGraph.java:338)
    at org.gradle.execution.plan.DefaultPlanExecutor$Exec utorWorker.lambda$run$0(DefaultPlanExecutor.java:1 27)
    at org.gradle.execution.plan.DefaultPlanExecutor$Exec utorWorker.execute(DefaultPlanExecutor.java:191)
    at org.gradle.execution.plan.DefaultPlanExecutor$Exec utorWorker.executeNextNode(DefaultPlanExecutor.jav a:182)
    at org.gradle.execution.plan.DefaultPlanExecutor$Exec utorWorker.run(DefaultPlanExecutor.java:124)
    at org.gradle.internal.concurrent.ExecutorPolicy$Catc hAndRecordFailures.onExecute(ExecutorPolicy.java:6 4)
    at org.gradle.internal.concurrent.ManagedExecutorImpl $1.run(ManagedExecutorImpl.java:48)
    at java.util.concurrent.ThreadPoolExecutor.runWorker( ThreadPoolExecutor.java:1149)
    at java.util.concurrent.ThreadPoolExecutor$Worker.run (ThreadPoolExecutor.java:624)
    at org.gradle.internal.concurrent.ThreadFactoryImpl$M anagedThreadRunnable.run(ThreadFactoryImpl.java:56 )
    at java.lang.Thread.run(Thread.java:748)

    FAILURE: Build failed with an exception.

    * What went wrong:
    Execution failed for task ':app:compileReleaseJavaWithJavac'.
    > Compilation failed; see the compiler error output for details.

    * Try:
    Run with --stacktrace option to get the stack trace. Run with --info or --debug option to get more log output. Run with --scan to get full insights.

    * Get more help at https://help.gradle.org

    BUILD FAILED in 16s
    31 actionable tasks: 31 executed
    Images attachées Images attachées

  2. #2
    Clickteam Clickteam
    Fernando's Avatar
    Join Date
    Dec 2006
    Posts
    7,057
    Mentioned
    298 Post(s)
    Tagged
    4 Thread(s)
    can you explain more, what is the API target , API to build and what java sdk are you using?
    Regards,


    Fernando Vivolo

    ... new things are coming ...

  3. #3
    Clicker Fusion 2.5 (Steam)Fusion 2.5 Developer (Steam)Fusion 2.5+ DLC (Steam)Android Export Module (Steam)

    Join Date
    Jul 2019
    Posts
    105
    Mentioned
    1 Post(s)
    Tagged
    0 Thread(s)
    123.png
    Sorry, here.

    Also important to know, a different object of mine builds with the same properties, so it's something in this specific project, probably one (or more) of the extensions.

  4. #4
    Clickteam Clickteam
    Fernando's Avatar
    Join Date
    Dec 2006
    Posts
    7,057
    Mentioned
    298 Post(s)
    Tagged
    4 Thread(s)
    oh this problem is because runtime 293.6 was not prepare to build with api 31, you should be ok now with version 293.7

    ================

    forgot to say you can build with api 30 and target 11
    Regards,


    Fernando Vivolo

    ... new things are coming ...

  5. #5
    Clicker Fusion 2.5 (Steam)Fusion 2.5 Developer (Steam)Fusion 2.5+ DLC (Steam)Android Export Module (Steam)

    Join Date
    Jul 2019
    Posts
    105
    Mentioned
    1 Post(s)
    Tagged
    0 Thread(s)
    How do I update?
    This is a steam copy.

  6. #6
    Clicker Fusion 2.5 (Steam)Fusion 2.5 Developer (Steam)Fusion 2.5+ DLC (Steam)Android Export Module (Steam)

    Join Date
    Jul 2019
    Posts
    105
    Mentioned
    1 Post(s)
    Tagged
    0 Thread(s)
    API 30 and Target 11 doesn't build as well.


    Starting a Gradle Daemon (subsequent builds will be faster)
    WARNING:: Please remove usages of `jcenter()` Maven repository from your build scripts and migrate your build to other Maven repositories.
    This repository is deprecated and it will be shut down in the future.
    See http://developer.android.com/r/tools...end-of-service for more information.
    Currently detected usages in: root project 'And982E.tmp', project ':app'
    > Task :app:preBuild UP-TO-DATE
    > Task :app:preReleaseBuild UP-TO-DATE
    > Task :app:writeReleaseApplicationId
    > Task :app:analyticsRecordingRelease
    > Task :app:compileReleaseRenderscript NO-SOURCE
    > Task :app:generateReleaseResValues
    > Task :app:generateReleaseResources
    > Task :app:createReleaseCompatibleScreenManifests
    > Task :app:extractDeepLinksRelease
    > Task :app:processReleaseMainManifest
    > Task :app:processReleaseManifest
    > Task :app:processApplicationManifestReleaseForBundle
    > Task :app:mergeReleaseResources
    > Task :app:checkReleaseDuplicateClasses
    > Task :app:compileReleaseAidl NO-SOURCE
    > Task :app:generateReleaseBuildConfig
    > Task :app:javaPreCompileRelease
    > Task :app:checkReleaseAarMetadata
    > Task :app:mergeReleaseShaders
    > Task :app:compileReleaseShaders NO-SOURCE
    > Task :app:generateReleaseAssets UP-TO-DATE
    > Task :app:mergeReleaseAssets
    > Task :app:processReleaseJavaRes NO-SOURCE
    > Task :app:mergeReleaseJniLibFolders
    > Task :app:processReleaseManifestForPackage
    > Task :app:collectReleaseDependencies
    > Task :app:configureReleaseDependencies
    > Task :app:parseReleaseIntegrityConfig
    > Task :app:writeReleaseAppMetadata
    > Task :app:validateSigningRelease
    > Task :app:desugarReleaseFileDependencies
    > Task :app:mergeReleaseNativeLibs
    > Task :app:mergeReleaseJavaResource
    > Task :app:bundleReleaseResources
    > Task :app:processReleaseResources
    > Task :app:mergeExtDexRelease

    > Task :app:compileReleaseJavaWithJavac
    C:\Users\Yaron\AppData\Local\Temp\And982E.tmp\app\ src\main\java\Extensions\CRun9SlicesObject.java:14 6: error: method renderImage in class GLRenderer cannot be applied to given types;
    GLRenderer.inst.renderImage(this.finalSurf, x, y, this.oSlices.getWidth(), this.oSlices.getHeight(), 0, 0);
    ^
    required: ITexture,boolean,int,int,int,int,int,int
    found: CRun9SlicesObject.CSurface,int,int,int,int,int,int
    reason: actual and formal argument lists differ in length
    Note: Some input files use or override a deprecated API.
    Note: Recompile with -Xlint:deprecation for details.
    Note: Some input files use unchecked or unsafe operations.
    Note: Recompile with -Xlint:unchecked for details.
    1 error

    > Task :app:compileReleaseJavaWithJavac FAILED

    FAILURE: Build failed with an exception.

    * What went wrong:
    Execution failed for task ':app:compileReleaseJavaWithJavac'.
    > Compilation failed; see the compiler error output for details.

    * Try:
    Run with --stacktrace option to get the stack trace. Run with --info or --debug option to get more log output. Run with --scan to get full insights.

    * Get more help at https://help.gradle.org

    BUILD FAILED in 27s
    29 actionable tasks: 29 executed

  7. #7
    Clickteam Clickteam
    Fernando's Avatar
    Join Date
    Dec 2006
    Posts
    7,057
    Mentioned
    298 Post(s)
    Tagged
    4 Thread(s)
    Good it is clearly mention that there is an error in 9Slice extension that is wrong, if you delete all object, did you make any reference of it in global events or in behaviors?

    only way to check what is happening please send your mfa to Yves for him to check.
    Regards,


    Fernando Vivolo

    ... new things are coming ...

  8. #8
    Clicker Fusion 2.5 (Steam)Fusion 2.5 Developer (Steam)Fusion 2.5+ DLC (Steam)Android Export Module (Steam)

    Join Date
    Jul 2019
    Posts
    105
    Mentioned
    1 Post(s)
    Tagged
    0 Thread(s)
    I deleted manually all 9 slice but I might have missed some. I couldn't find an option to delete all extension objects or locate all extension objects, and it still appears in Data elements.
    I had two mentions in global events, deleted them already.

    I will send you the mfa on a private message, please forward it to Yves.

  9. #9
    Clicker Fusion 2.5 (Steam)Fusion 2.5 Developer (Steam)Fusion 2.5+ DLC (Steam)Android Export Module (Steam)

    Join Date
    Jul 2019
    Posts
    105
    Mentioned
    1 Post(s)
    Tagged
    0 Thread(s)
    @Yves

    Please send this link to the mfa to Yves

    https://www.dropbox.com/s/3ernvb4t0q...fter1.mfa?dl=0

  10. #10
    Clickteam Clickteam
    Fernando's Avatar
    Join Date
    Dec 2006
    Posts
    7,057
    Mentioned
    298 Post(s)
    Tagged
    4 Thread(s)
    i will need a copy of this extension by PM

    =======

    Not need it anymore
    Regards,


    Fernando Vivolo

    ... new things are coming ...

Page 1 of 2 1 2 LastLast

Similar Threads

  1. Replies: 11
    Last Post: 7th November 2019, 07:40 PM
  2. Replies: 0
    Last Post: 22nd June 2017, 02:00 AM
  3. Replies: 3
    Last Post: 1st July 2015, 05:46 AM
  4. Binary attached file
    By Evoxe in forum Multimedia Fusion 2 - Technical Support
    Replies: 13
    Last Post: 17th July 2009, 08:22 AM
  5. MooGame Help Needed Please (FILE ATTACHED)
    By YAS in forum File Archive
    Replies: 4
    Last Post: 25th September 2006, 10:55 PM

Posting Permissions

  • You may not post new threads
  • You may not post replies
  • You may not post attachments
  • You may not edit your posts
  •