User Tag List

Page 1 of 2 1 2 LastLast
Results 1 to 10 of 13

Thread: Android Error Unable to start the daemon process. help

  1. #1
    Clicker Fusion 2.5 (Steam)Fusion 2.5 Developer (Steam)Android Export Module (Steam)HTML5 Export Module (Steam)iOS Export Module (Steam)Universal Windows Platform Export Module (Steam)
    mrknd94's Avatar
    Join Date
    Jun 2017
    Location
    United Kingdom
    Posts
    49
    Mentioned
    0 Post(s)
    Tagged
    0 Thread(s)

    Exclamation Android Error Unable to start the daemon process. help

    FAILURE: Build failed with an exception.

    * What went wrong:
    Unable to start the daemon process.
    This problem might be caused by incorrect configuration of the daemon.
    For example, an unrecognized jvm option is used.
    Please refer to the User Manual chapter on the daemon at https://docs.gradle.org/7.0.2/usergu...le_daemon.html
    Process command line: C:\Program Files\Java\jdk1.8.0_172\bin\java.exe -Xmx4096m -Dfile.encoding=windows-1252 -Duser.country=GB -Duser.language=en -Duser.variant -cp C:\Users\Josh\.gradle\wrapper\dists\gradle-7.0.2-all\7era6s5ay7zsbhuvl0oc9g94s\gradle-7.0.2\lib\gradle-launcher-7.0.2.jar org.gradle.launcher.daemon.bootstrap.GradleDaemon 7.0.2
    Please read the following process output to find out more:
    -----------------------
    Error: Could not create the Java Virtual Machine.
    Error: A fatal exception has occurred. Program will exit.
    Invalid maximum heap size: -Xmx4096m
    The specified size exceeds the maximum representable size.


    * Try:
    Run with --stacktrace option to get the stack trace. Run with --info or --debug option to get more log output. Run with --scan to get full insights.

    * Get more help at https://help.gradle.org

    Please help.

  2. #2
    Clicker Fusion 2.5 (Steam)Fusion 2.5 Developer (Steam)Android Export Module (Steam)HTML5 Export Module (Steam)iOS Export Module (Steam)Universal Windows Platform Export Module (Steam)
    mrknd94's Avatar
    Join Date
    Jun 2017
    Location
    United Kingdom
    Posts
    49
    Mentioned
    0 Post(s)
    Tagged
    0 Thread(s)
    I have changed the directory of the JDK to the newer Android Studio. This happened:

    Starting a Gradle Daemon, 1 incompatible Daemon could not be reused, use --status for details

    FAILURE: Build failed with an exception.

    * Where:
    Settings file 'C:\Users\Josh\AppData\Local\Temp\AndCADE.tmp\sett ings.gradle'

    * What went wrong:
    Could not compile settings file 'C:\Users\Josh\AppData\Local\Temp\AndCADE.tmp\sett ings.gradle'.
    > startup failed:
    General error during conversion: Unsupported class file major version 61

    java.lang.IllegalArgumentException: Unsupported class file major version 61
    at groovyjarjarasm.asm.ClassReader.<init>(ClassReader .java:189)
    at groovyjarjarasm.asm.ClassReader.<init>(ClassReader .java:170)
    at groovyjarjarasm.asm.ClassReader.<init>(ClassReader .java:156)
    at groovyjarjarasm.asm.ClassReader.<init>(ClassReader .java:277)
    at org.codehaus.groovy.ast.decompiled.AsmDecompiler.p arseClass(AsmDecompiler.java:81)
    at org.codehaus.groovy.control.ClassNodeResolver.find Decompiled(ClassNodeResolver.java:251)
    at org.codehaus.groovy.control.ClassNodeResolver.tryA sLoaderClassOrScript(ClassNodeResolver.java:189)
    at org.codehaus.groovy.control.ClassNodeResolver.find ClassNode(ClassNodeResolver.java:169)
    at org.codehaus.groovy.control.ClassNodeResolver.reso lveName(ClassNodeResolver.java:125)
    at org.codehaus.groovy.ast.decompiled.AsmReferenceRes olver.resolveClassNullable(AsmReferenceResolver.ja va:57)
    at org.codehaus.groovy.ast.decompiled.AsmReferenceRes olver.resolveClass(AsmReferenceResolver.java:44)
    at org.codehaus.groovy.ast.decompiled.AsmReferenceRes olver.resolveNonArrayType(AsmReferenceResolver.jav a:79)
    at org.codehaus.groovy.ast.decompiled.AsmReferenceRes olver.resolveType(AsmReferenceResolver.java:70)
    at org.codehaus.groovy.ast.decompiled.MemberSignature Parser.createMethodNode(MemberSignatureParser.java :57)
    at org.codehaus.groovy.ast.decompiled.DecompiledClass Node.lambda$createMethodNode$1(DecompiledClassNode .java:230)
    at org.codehaus.groovy.ast.decompiled.DecompiledClass Node.createMethodNode(DecompiledClassNode.java:236 )
    at org.codehaus.groovy.ast.decompiled.DecompiledClass Node.lazyInitMembers(DecompiledClassNode.java:203)
    at org.codehaus.groovy.ast.decompiled.DecompiledClass Node.getDeclaredMethods(DecompiledClassNode.java:1 22)
    at org.codehaus.groovy.ast.ClassNode.tryFindPossibleM ethod(ClassNode.java:1283)
    at org.codehaus.groovy.control.StaticImportVisitor.tr ansformMethodCallExpression(StaticImportVisitor.ja va:251)
    at org.codehaus.groovy.control.StaticImportVisitor.tr ansform(StaticImportVisitor.java:133)
    at org.codehaus.groovy.ast.ClassCodeExpressionTransfo rmer.visitExpressionStatement(ClassCodeExpressionT ransformer.java:108)
    at org.codehaus.groovy.ast.stmt.ExpressionStatement.v isit(ExpressionStatement.java:40)
    at org.codehaus.groovy.ast.ClassCodeVisitorSupport.vi sitClassCodeContainer(ClassCodeVisitorSupport.java :138)
    at org.codehaus.groovy.ast.ClassCodeVisitorSupport.vi sitConstructorOrMethod(ClassCodeVisitorSupport.jav a:111)
    at org.codehaus.groovy.ast.ClassCodeExpressionTransfo rmer.visitConstructorOrMethod(ClassCodeExpressionT ransformer.java:66)
    at org.codehaus.groovy.control.StaticImportVisitor.vi sitConstructorOrMethod(StaticImportVisitor.java:10 8)
    at org.codehaus.groovy.ast.ClassCodeVisitorSupport.vi sitConstructor(ClassCodeVisitorSupport.java:101)
    at org.codehaus.groovy.ast.ClassNode.visitContents(Cl assNode.java:1089)
    at org.codehaus.groovy.ast.ClassCodeVisitorSupport.vi sitClass(ClassCodeVisitorSupport.java:52)
    at org.codehaus.groovy.control.CompilationUnit.lambda $addPhaseOperations$3(CompilationUnit.java:209)
    at org.codehaus.groovy.control.CompilationUnit$IPrima ryClassNodeOperation.doPhaseOperation(CompilationU nit.java:942)
    at org.codehaus.groovy.control.CompilationUnit.proces sPhaseOperations(CompilationUnit.java:671)
    at org.codehaus.groovy.control.CompilationUnit.compil e(CompilationUnit.java:635)
    at groovy.lang.GroovyClassLoader.doParseClass(GroovyC lassLoader.java:389)
    at groovy.lang.GroovyClassLoader.lambda$parseClass$3( GroovyClassLoader.java:332)
    at org.codehaus.groovy.runtime.memoize.StampedCommonC ache.compute(StampedCommonCache.java:163)
    at org.codehaus.groovy.runtime.memoize.StampedCommonC ache.getAndPut(StampedCommonCache.java:154)
    at groovy.lang.GroovyClassLoader.parseClass(GroovyCla ssLoader.java:330)
    at org.gradle.groovy.scripts.internal.DefaultScriptCo mpilationHandler.compileScript(DefaultScriptCompil ationHandler.java:139)
    at org.gradle.groovy.scripts.internal.DefaultScriptCo mpilationHandler.compileToDir(DefaultScriptCompila tionHandler.java:95)
    at org.gradle.groovy.scripts.internal.BuildOperationB ackedScriptCompilationHandler$2.run(BuildOperation BackedScriptCompilationHandler.java:54)
    at org.gradle.internal.operations.DefaultBuildOperati onRunner$1.execute(DefaultBuildOperationRunner.jav a:29)
    at org.gradle.internal.operations.DefaultBuildOperati onRunner$1.execute(DefaultBuildOperationRunner.jav a:26)
    at org.gradle.internal.operations.DefaultBuildOperati onRunner$3.execute(DefaultBuildOperationRunner.jav a:75)
    at org.gradle.internal.operations.DefaultBuildOperati onRunner$3.execute(DefaultBuildOperationRunner.jav a:68)
    at org.gradle.internal.operations.DefaultBuildOperati onRunner.execute(DefaultBuildOperationRunner.java: 153)
    at org.gradle.internal.operations.DefaultBuildOperati onRunner.execute(DefaultBuildOperationRunner.java: 68)
    at org.gradle.internal.operations.DefaultBuildOperati onRunner.run(DefaultBuildOperationRunner.java:56)
    at org.gradle.internal.operations.DefaultBuildOperati onExecutor.lambda$run$1(DefaultBuildOperationExecu tor.java:71)
    at org.gradle.internal.operations.UnmanagedBuildOpera tionWrapper.runWithUnmanagedSupport(UnmanagedBuild OperationWrapper.java:45)
    at org.gradle.internal.operations.DefaultBuildOperati onExecutor.run(DefaultBuildOperationExecutor.java: 71)
    at org.gradle.groovy.scripts.internal.BuildOperationB ackedScriptCompilationHandler.compileToDir(BuildOp erationBackedScriptCompilationHandler.java:51)
    at org.gradle.groovy.scripts.internal.FileCacheBacked ScriptClassCompiler$CompileToCrossBuildCacheAction .execute(FileCacheBackedScriptClassCompiler.java:1 90)
    at org.gradle.groovy.scripts.internal.FileCacheBacked ScriptClassCompiler$CompileToCrossBuildCacheAction .execute(FileCacheBackedScriptClassCompiler.java:1 70)
    at org.gradle.groovy.scripts.internal.FileCacheBacked ScriptClassCompiler$ProgressReportingInitializer.e xecute(FileCacheBackedScriptClassCompiler.java:211 )
    at org.gradle.groovy.scripts.internal.FileCacheBacked ScriptClassCompiler$ProgressReportingInitializer.e xecute(FileCacheBackedScriptClassCompiler.java:194 )
    at org.gradle.cache.internal.DefaultPersistentDirecto ryCache$Initializer.initialize(DefaultPersistentDi rectoryCache.java:100)
    at org.gradle.cache.internal.FixedSharedModeCrossProc essCacheAccess$1.run(FixedSharedModeCrossProcessCa cheAccess.java:86)
    at org.gradle.cache.internal.DefaultFileLockManager$D efaultFileLock.doWriteAction(DefaultFileLockManage r.java:216)
    at org.gradle.cache.internal.DefaultFileLockManager$D efaultFileLock.writeFile(DefaultFileLockManager.ja va:206)
    at org.gradle.cache.internal.FixedSharedModeCrossProc essCacheAccess.open(FixedSharedModeCrossProcessCac heAccess.java:83)
    at org.gradle.cache.internal.DefaultCacheAccess.open( DefaultCacheAccess.java:139)
    at org.gradle.cache.internal.DefaultPersistentDirecto ryStore.open(DefaultPersistentDirectoryStore.java: 89)
    at org.gradle.cache.internal.DefaultPersistentDirecto ryStore.open(DefaultPersistentDirectoryStore.java: 43)
    at org.gradle.cache.internal.DefaultCacheFactory.doOp en(DefaultCacheFactory.java:103)
    at org.gradle.cache.internal.DefaultCacheFactory.open (DefaultCacheFactory.java:68)
    at org.gradle.cache.internal.DefaultCacheRepository$P ersistentCacheBuilder.open(DefaultCacheRepository. java:126)
    at org.gradle.groovy.scripts.internal.FileCacheBacked ScriptClassCompiler.compile(FileCacheBackedScriptC lassCompiler.java:116)
    at org.gradle.groovy.scripts.internal.CrossBuildInMem oryCachingScriptClassCache.getOrCompile(CrossBuild InMemoryCachingScriptClassCache.java:50)
    at org.gradle.groovy.scripts.internal.BuildScopeInMem oryCachingScriptClassCompiler.compile(BuildScopeIn MemoryCachingScriptClassCompiler.java:50)
    at org.gradle.groovy.scripts.DefaultScriptCompilerFac tory$ScriptCompilerImpl.compile(DefaultScriptCompi lerFactory.java:49)
    at org.gradle.configuration.DefaultScriptPluginFactor y$ScriptPluginImpl.apply(DefaultScriptPluginFactor y.java:125)
    at org.gradle.configuration.BuildOperationScriptPlugi n$1.run(BuildOperationScriptPlugin.java:65)
    at org.gradle.internal.operations.DefaultBuildOperati onRunner$1.execute(DefaultBuildOperationRunner.jav a:29)
    at org.gradle.internal.operations.DefaultBuildOperati onRunner$1.execute(DefaultBuildOperationRunner.jav a:26)
    at org.gradle.internal.operations.DefaultBuildOperati onRunner$3.execute(DefaultBuildOperationRunner.jav a:75)
    at org.gradle.internal.operations.DefaultBuildOperati onRunner$3.execute(DefaultBuildOperationRunner.jav a:68)
    at org.gradle.internal.operations.DefaultBuildOperati onRunner.execute(DefaultBuildOperationRunner.java: 153)
    at org.gradle.internal.operations.DefaultBuildOperati onRunner.execute(DefaultBuildOperationRunner.java: 68)
    at org.gradle.internal.operations.DefaultBuildOperati onRunner.run(DefaultBuildOperationRunner.java:56)
    at org.gradle.internal.operations.DefaultBuildOperati onExecutor.lambda$run$1(DefaultBuildOperationExecu tor.java:71)
    at org.gradle.internal.operations.UnmanagedBuildOpera tionWrapper.runWithUnmanagedSupport(UnmanagedBuild OperationWrapper.java:45)
    at org.gradle.internal.operations.DefaultBuildOperati onExecutor.run(DefaultBuildOperationExecutor.java: 71)
    at org.gradle.configuration.BuildOperationScriptPlugi n.lambda$apply$0(BuildOperationScriptPlugin.java:6 2)
    at org.gradle.configuration.internal.DefaultUserCodeA pplicationContext.apply(DefaultUserCodeApplication Context.java:43)
    at org.gradle.configuration.BuildOperationScriptPlugi n.apply(BuildOperationScriptPlugin.java:62)
    at org.gradle.initialization.ScriptEvaluatingSettings Processor.applySettingsScript(ScriptEvaluatingSett ingsProcessor.java:74)
    at org.gradle.initialization.ScriptEvaluatingSettings Processor.process(ScriptEvaluatingSettingsProcesso r.java:67)
    at org.gradle.initialization.SettingsEvaluatedCallbac kFiringSettingsProcessor.process(SettingsEvaluated CallbackFiringSettingsProcessor.java:34)
    at org.gradle.initialization.RootBuildCacheController SettingsProcessor.process(RootBuildCacheController SettingsProcessor.java:47)
    at org.gradle.initialization.BuildOperationSettingsPr ocessor$2.call(BuildOperationSettingsProcessor.jav a:50)
    at org.gradle.initialization.BuildOperationSettingsPr ocessor$2.call(BuildOperationSettingsProcessor.jav a:47)
    at org.gradle.internal.operations.DefaultBuildOperati onRunner$CallableBuildOperationWorker.execute(Defa ultBuildOperationRunner.java:200)
    at org.gradle.internal.operations.DefaultBuildOperati onRunner$CallableBuildOperationWorker.execute(Defa ultBuildOperationRunner.java:195)
    at org.gradle.internal.operations.DefaultBuildOperati onRunner$3.execute(DefaultBuildOperationRunner.jav a:75)
    at org.gradle.internal.operations.DefaultBuildOperati onRunner$3.execute(DefaultBuildOperationRunner.jav a:68)
    at org.gradle.internal.operations.DefaultBuildOperati onRunner.execute(DefaultBuildOperationRunner.java: 153)
    at org.gradle.internal.operations.DefaultBuildOperati onRunner.execute(DefaultBuildOperationRunner.java: 68)
    at org.gradle.internal.operations.DefaultBuildOperati onRunner.call(DefaultBuildOperationRunner.java:62)
    at org.gradle.internal.operations.DefaultBuildOperati onExecutor.lambda$call$2(DefaultBuildOperationExec utor.java:76)
    at org.gradle.internal.operations.UnmanagedBuildOpera tionWrapper.callWithUnmanagedSupport(UnmanagedBuil dOperationWrapper.java:54)
    at org.gradle.internal.operations.DefaultBuildOperati onExecutor.call(DefaultBuildOperationExecutor.java :76)
    at org.gradle.initialization.BuildOperationSettingsPr ocessor.process(BuildOperationSettingsProcessor.ja va:47)
    at org.gradle.initialization.DefaultSettingsLoader.fi ndSettingsAndLoadIfAppropriate(DefaultSettingsLoad er.java:122)
    at org.gradle.initialization.DefaultSettingsLoader.fi ndAndLoadSettings(DefaultSettingsLoader.java:58)
    at org.gradle.initialization.SettingsAttachingSetting sLoader.findAndLoadSettings(SettingsAttachingSetti ngsLoader.java:35)
    at org.gradle.internal.composite.CommandLineIncludedB uildSettingsLoader.findAndLoadSettings(CommandLine IncludedBuildSettingsLoader.java:34)
    at org.gradle.internal.composite.ChildBuildRegisterin gSettingsLoader.findAndLoadSettings(ChildBuildRegi steringSettingsLoader.java:50)
    at org.gradle.internal.composite.CompositeBuildSettin gsLoader.findAndLoadSettings(CompositeBuildSetting sLoader.java:35)
    at org.gradle.initialization.DefaultSettingsPreparer. prepareSettings(DefaultSettingsPreparer.java:36)
    at org.gradle.initialization.BuildOperationFiringSett ingsPreparer$LoadBuild.doLoadBuild(BuildOperationF iringSettingsPreparer.java:62)
    at org.gradle.initialization.BuildOperationFiringSett ingsPreparer$LoadBuild.run(BuildOperationFiringSet tingsPreparer.java:57)
    at org.gradle.internal.operations.DefaultBuildOperati onRunner$1.execute(DefaultBuildOperationRunner.jav a:29)
    at org.gradle.internal.operations.DefaultBuildOperati onRunner$1.execute(DefaultBuildOperationRunner.jav a:26)
    at org.gradle.internal.operations.DefaultBuildOperati onRunner$3.execute(DefaultBuildOperationRunner.jav a:75)
    at org.gradle.internal.operations.DefaultBuildOperati onRunner$3.execute(DefaultBuildOperationRunner.jav a:68)
    at org.gradle.internal.operations.DefaultBuildOperati onRunner.execute(DefaultBuildOperationRunner.java: 153)
    at org.gradle.internal.operations.DefaultBuildOperati onRunner.execute(DefaultBuildOperationRunner.java: 68)
    at org.gradle.internal.operations.DefaultBuildOperati onRunner.run(DefaultBuildOperationRunner.java:56)
    at org.gradle.internal.operations.DefaultBuildOperati onExecutor.lambda$run$1(DefaultBuildOperationExecu tor.java:71)
    at org.gradle.internal.operations.UnmanagedBuildOpera tionWrapper.runWithUnmanagedSupport(UnmanagedBuild OperationWrapper.java:45)
    at org.gradle.internal.operations.DefaultBuildOperati onExecutor.run(DefaultBuildOperationExecutor.java: 71)
    at org.gradle.initialization.BuildOperationFiringSett ingsPreparer.prepareSettings(BuildOperationFiringS ettingsPreparer.java:45)
    at org.gradle.initialization.DefaultGradleLauncher.pr epareSettings(DefaultGradleLauncher.java:219)
    at org.gradle.initialization.DefaultGradleLauncher.do ClassicBuildStages(DefaultGradleLauncher.java:160)
    at org.gradle.initialization.DefaultGradleLauncher.do BuildStages(DefaultGradleLauncher.java:149)
    at org.gradle.initialization.DefaultGradleLauncher.ex ecuteTasks(DefaultGradleLauncher.java:125)
    at org.gradle.internal.invocation.GradleBuildControll er$1.create(GradleBuildController.java:71)
    at org.gradle.internal.work.DefaultWorkerLeaseService .withLocks(DefaultWorkerLeaseService.java:213)
    at org.gradle.internal.invocation.GradleBuildControll er.doBuild(GradleBuildController.java:67)
    at org.gradle.internal.invocation.GradleBuildControll er.run(GradleBuildController.java:56)
    at org.gradle.tooling.internal.provider.ExecuteBuildA ctionRunner.run(ExecuteBuildActionRunner.java:31)
    at org.gradle.launcher.exec.ChainingBuildActionRunner .run(ChainingBuildActionRunner.java:35)
    at org.gradle.launcher.exec.BuildOutcomeReportingBuil dActionRunner.run(BuildOutcomeReportingBuildAction Runner.java:66)
    at org.gradle.tooling.internal.provider.ValidatingBui ldActionRunner.run(ValidatingBuildActionRunner.jav a:32)
    at org.gradle.tooling.internal.provider.FileSystemWat chingBuildActionRunner.run(FileSystemWatchingBuild ActionRunner.java:90)
    at org.gradle.launcher.exec.BuildCompletionNotifyingB uildActionRunner.run(BuildCompletionNotifyingBuild ActionRunner.java:41)
    at org.gradle.launcher.exec.RunAsBuildOperationBuildA ctionRunner$3.call(RunAsBuildOperationBuildActionR unner.java:49)
    at org.gradle.launcher.exec.RunAsBuildOperationBuildA ctionRunner$3.call(RunAsBuildOperationBuildActionR unner.java:44)
    at org.gradle.internal.operations.DefaultBuildOperati onRunner$CallableBuildOperationWorker.execute(Defa ultBuildOperationRunner.java:200)
    at org.gradle.internal.operations.DefaultBuildOperati onRunner$CallableBuildOperationWorker.execute(Defa ultBuildOperationRunner.java:195)
    at org.gradle.internal.operations.DefaultBuildOperati onRunner$3.execute(DefaultBuildOperationRunner.jav a:75)
    at org.gradle.internal.operations.DefaultBuildOperati onRunner$3.execute(DefaultBuildOperationRunner.jav a:68)
    at org.gradle.internal.operations.DefaultBuildOperati onRunner.execute(DefaultBuildOperationRunner.java: 153)
    at org.gradle.internal.operations.DefaultBuildOperati onRunner.execute(DefaultBuildOperationRunner.java: 68)
    at org.gradle.internal.operations.DefaultBuildOperati onRunner.call(DefaultBuildOperationRunner.java:62)
    at org.gradle.internal.operations.DefaultBuildOperati onExecutor.lambda$call$2(DefaultBuildOperationExec utor.java:76)
    at org.gradle.internal.operations.UnmanagedBuildOpera tionWrapper.callWithUnmanagedSupport(UnmanagedBuil dOperationWrapper.java:54)
    at org.gradle.internal.operations.DefaultBuildOperati onExecutor.call(DefaultBuildOperationExecutor.java :76)
    at org.gradle.launcher.exec.RunAsBuildOperationBuildA ctionRunner.run(RunAsBuildOperationBuildActionRunn er.java:44)
    at org.gradle.launcher.exec.InProcessBuildActionExecu ter.lambda$execute$0(InProcessBuildActionExecuter. java:59)
    at org.gradle.composite.internal.DefaultRootBuildStat e.run(DefaultRootBuildState.java:86)
    at org.gradle.launcher.exec.InProcessBuildActionExecu ter.execute(InProcessBuildActionExecuter.java:58)
    at org.gradle.launcher.exec.InProcessBuildActionExecu ter.execute(InProcessBuildActionExecuter.java:30)
    at org.gradle.launcher.exec.BuildTreeScopeLifecycleBu ildActionExecuter.lambda$execute$0(BuildTreeScopeL ifecycleBuildActionExecuter.java:34)
    at org.gradle.internal.buildtree.BuildTreeState.run(B uildTreeState.java:53)
    at org.gradle.launcher.exec.BuildTreeScopeLifecycleBu ildActionExecuter.execute(BuildTreeScopeLifecycleB uildActionExecuter.java:33)
    at org.gradle.launcher.exec.BuildTreeScopeLifecycleBu ildActionExecuter.execute(BuildTreeScopeLifecycleB uildActionExecuter.java:28)
    at org.gradle.tooling.internal.provider.ContinuousBui ldActionExecuter.execute(ContinuousBuildActionExec uter.java:104)
    at org.gradle.tooling.internal.provider.ContinuousBui ldActionExecuter.execute(ContinuousBuildActionExec uter.java:55)
    at org.gradle.tooling.internal.provider.SubscribableB uildActionExecuter.execute(SubscribableBuildAction Executer.java:64)
    at org.gradle.tooling.internal.provider.SubscribableB uildActionExecuter.execute(SubscribableBuildAction Executer.java:37)
    at org.gradle.tooling.internal.provider.SessionScopeL ifecycleBuildActionExecuter.lambda$execute$0(Sessi onScopeLifecycleBuildActionExecuter.java:54)
    at org.gradle.internal.session.BuildSessionState.run( BuildSessionState.java:67)
    at org.gradle.tooling.internal.provider.SessionScopeL ifecycleBuildActionExecuter.execute(SessionScopeLi fecycleBuildActionExecuter.java:50)
    at org.gradle.tooling.internal.provider.SessionScopeL ifecycleBuildActionExecuter.execute(SessionScopeLi fecycleBuildActionExecuter.java:36)
    at org.gradle.tooling.internal.provider.GradleThreadB uildActionExecuter.execute(GradleThreadBuildAction Executer.java:36)
    at org.gradle.tooling.internal.provider.GradleThreadB uildActionExecuter.execute(GradleThreadBuildAction Executer.java:25)
    at org.gradle.tooling.internal.provider.StartParamsVa lidatingActionExecuter.execute(StartParamsValidati ngActionExecuter.java:59)
    at org.gradle.tooling.internal.provider.StartParamsVa lidatingActionExecuter.execute(StartParamsValidati ngActionExecuter.java:31)
    at org.gradle.tooling.internal.provider.SessionFailur eReportingActionExecuter.execute(SessionFailureRep ortingActionExecuter.java:58)
    at org.gradle.tooling.internal.provider.SessionFailur eReportingActionExecuter.execute(SessionFailureRep ortingActionExecuter.java:42)
    at org.gradle.tooling.internal.provider.SetupLoggingA ctionExecuter.execute(SetupLoggingActionExecuter.j ava:47)
    at org.gradle.tooling.internal.provider.SetupLoggingA ctionExecuter.execute(SetupLoggingActionExecuter.j ava:31)
    at org.gradle.launcher.daemon.server.exec.ExecuteBuil d.doBuild(ExecuteBuild.java:65)
    at org.gradle.launcher.daemon.server.exec.BuildComman dOnly.execute(BuildCommandOnly.java:37)
    at org.gradle.launcher.daemon.server.api.DaemonComman dExecution.proceed(DaemonCommandExecution.java:104 )
    at org.gradle.launcher.daemon.server.exec.WatchForDis connection.execute(WatchForDisconnection.java:39)
    at org.gradle.launcher.daemon.server.api.DaemonComman dExecution.proceed(DaemonCommandExecution.java:104 )
    at org.gradle.launcher.daemon.server.exec.ResetDeprec ationLogger.execute(ResetDeprecationLogger.java:29 )
    at org.gradle.launcher.daemon.server.api.DaemonComman dExecution.proceed(DaemonCommandExecution.java:104 )
    at org.gradle.launcher.daemon.server.exec.RequestStop IfSingleUsedDaemon.execute(RequestStopIfSingleUsed Daemon.java:35)
    at org.gradle.launcher.daemon.server.api.DaemonComman dExecution.proceed(DaemonCommandExecution.java:104 )
    at org.gradle.launcher.daemon.server.exec.ForwardClie ntInput$2.create(ForwardClientInput.java:78)
    at org.gradle.launcher.daemon.server.exec.ForwardClie ntInput$2.create(ForwardClientInput.java:75)
    at org.gradle.util.Swapper.swap(Swapper.java:38)
    at org.gradle.launcher.daemon.server.exec.ForwardClie ntInput.execute(ForwardClientInput.java:75)
    at org.gradle.launcher.daemon.server.api.DaemonComman dExecution.proceed(DaemonCommandExecution.java:104 )
    at org.gradle.launcher.daemon.server.exec.LogAndCheck Health.execute(LogAndCheckHealth.java:55)
    at org.gradle.launcher.daemon.server.api.DaemonComman dExecution.proceed(DaemonCommandExecution.java:104 )
    at org.gradle.launcher.daemon.server.exec.LogToClient .doBuild(LogToClient.java:63)
    at org.gradle.launcher.daemon.server.exec.BuildComman dOnly.execute(BuildCommandOnly.java:37)
    at org.gradle.launcher.daemon.server.api.DaemonComman dExecution.proceed(DaemonCommandExecution.java:104 )
    at org.gradle.launcher.daemon.server.exec.EstablishBu ildEnvironment.doBuild(EstablishBuildEnvironment.j ava:84)
    at org.gradle.launcher.daemon.server.exec.BuildComman dOnly.execute(BuildCommandOnly.java:37)
    at org.gradle.launcher.daemon.server.api.DaemonComman dExecution.proceed(DaemonCommandExecution.java:104 )
    at org.gradle.launcher.daemon.server.exec.StartBuildO rRespondWithBusy$1.run(StartBuildOrRespondWithBusy .java:52)
    at org.gradle.launcher.daemon.server.DaemonStateCoord inator$1.run(DaemonStateCoordinator.java:297)
    at org.gradle.internal.concurrent.ExecutorPolicy$Catc hAndRecordFailures.onExecute(ExecutorPolicy.java:6 4)
    at org.gradle.internal.concurrent.ManagedExecutorImpl $1.run(ManagedExecutorImpl.java:48)
    at java.base/java.util.concurrent.ThreadPoolExecutor.runWorker( ThreadPoolExecutor.java:1136)
    at java.base/java.util.concurrent.ThreadPoolExecutor$Worker.run (ThreadPoolExecutor.java:635)
    at org.gradle.internal.concurrent.ThreadFactoryImpl$M anagedThreadRunnable.run(ThreadFactoryImpl.java:56 )
    at java.base/java.lang.Thread.run(Thread.java:833)

    1 error


    * Try:
    Run with --stacktrace option to get the stack trace. Run with --info or --debug option to get more log output. Run with --scan to get full insights.

    * Get more help at https://help.gradle.org

    BUILD FAILED in 13s

    Help please.

  3. #3
    Clickteam Clickteam
    Fernando's Avatar
    Join Date
    Dec 2006
    Posts
    7,181
    Mentioned
    298 Post(s)
    Tagged
    4 Thread(s)
    Two things seems to be happening

    1. memory is not available, maybe your device is only 4 GB and keep using a lot of memory on some other process, suggestion:
    open runtimeandroid.zip in your fusion directory/data/runtime/android and look for file gradle.properties
    look for this line almost at the bottom org.gradle.jvmargs=-Xmx4096m change that 4096, for 2048

    2.- android studio maybe old and needs update, that is why version in unsupported.
    Regards,


    Fernando Vivolo

    ... new things are coming ...

  4. #4
    Clicker Fusion 2.5 (Steam)Fusion 2.5 Developer (Steam)Android Export Module (Steam)HTML5 Export Module (Steam)iOS Export Module (Steam)Universal Windows Platform Export Module (Steam)
    mrknd94's Avatar
    Join Date
    Jun 2017
    Location
    United Kingdom
    Posts
    49
    Mentioned
    0 Post(s)
    Tagged
    0 Thread(s)
    Quote Originally Posted by Fernando View Post
    Two things seems to be happening

    1. memory is not available, maybe your device is only 4 GB and keep using a lot of memory on some other process, suggestion:
    open runtimeandroid.zip in your fusion directory/data/runtime/android and look for file gradle.properties
    look for this line almost at the bottom org.gradle.jvmargs=-Xmx4096m change that 4096, for 2048

    2.- android studio maybe old and needs update, that is why version in unsupported.
    It came up with:
    Starting a Gradle Daemon (subsequent builds will be faster)

    FAILURE: Build failed with an exception.

    * Where:
    Settings file 'C:\Users\Josh\AppData\Local\Temp\AndEFB.tmp\setti ngs.gradle'

    * What went wrong:
    Could not compile settings file 'C:\Users\Josh\AppData\Local\Temp\AndEFB.tmp\setti ngs.gradle'.
    > startup failed:
    General error during conversion: Unsupported class file major version 61

    java.lang.IllegalArgumentException: Unsupported class file major version 61
    at groovyjarjarasm.asm.ClassReader.<init>(ClassReader .java:189)
    at groovyjarjarasm.asm.ClassReader.<init>(ClassReader .java:170)
    at groovyjarjarasm.asm.ClassReader.<init>(ClassReader .java:156)
    at groovyjarjarasm.asm.ClassReader.<init>(ClassReader .java:277)
    at org.codehaus.groovy.ast.decompiled.AsmDecompiler.p arseClass(AsmDecompiler.java:81)
    at org.codehaus.groovy.control.ClassNodeResolver.find Decompiled(ClassNodeResolver.java:251)
    at org.codehaus.groovy.control.ClassNodeResolver.tryA sLoaderClassOrScript(ClassNodeResolver.java:189)
    at org.codehaus.groovy.control.ClassNodeResolver.find ClassNode(ClassNodeResolver.java:169)
    at org.codehaus.groovy.control.ClassNodeResolver.reso lveName(ClassNodeResolver.java:125)
    at org.codehaus.groovy.ast.decompiled.AsmReferenceRes olver.resolveClassNullable(AsmReferenceResolver.ja va:57)
    at org.codehaus.groovy.ast.decompiled.AsmReferenceRes olver.resolveClass(AsmReferenceResolver.java:44)
    at org.codehaus.groovy.ast.decompiled.AsmReferenceRes olver.resolveNonArrayType(AsmReferenceResolver.jav a:79)
    at org.codehaus.groovy.ast.decompiled.AsmReferenceRes olver.resolveType(AsmReferenceResolver.java:70)
    at org.codehaus.groovy.ast.decompiled.MemberSignature Parser.createMethodNode(MemberSignatureParser.java :57)
    at org.codehaus.groovy.ast.decompiled.DecompiledClass Node.lambda$createMethodNode$1(DecompiledClassNode .java:230)
    at org.codehaus.groovy.ast.decompiled.DecompiledClass Node.createMethodNode(DecompiledClassNode.java:236 )
    at org.codehaus.groovy.ast.decompiled.DecompiledClass Node.lazyInitMembers(DecompiledClassNode.java:203)
    at org.codehaus.groovy.ast.decompiled.DecompiledClass Node.getDeclaredMethods(DecompiledClassNode.java:1 22)
    at org.codehaus.groovy.ast.ClassNode.tryFindPossibleM ethod(ClassNode.java:1283)
    at org.codehaus.groovy.control.StaticImportVisitor.tr ansformMethodCallExpression(StaticImportVisitor.ja va:251)
    at org.codehaus.groovy.control.StaticImportVisitor.tr ansform(StaticImportVisitor.java:133)
    at org.codehaus.groovy.ast.ClassCodeExpressionTransfo rmer.visitExpressionStatement(ClassCodeExpressionT ransformer.java:108)
    at org.codehaus.groovy.ast.stmt.ExpressionStatement.v isit(ExpressionStatement.java:40)
    at org.codehaus.groovy.ast.ClassCodeVisitorSupport.vi sitClassCodeContainer(ClassCodeVisitorSupport.java :138)
    at org.codehaus.groovy.ast.ClassCodeVisitorSupport.vi sitConstructorOrMethod(ClassCodeVisitorSupport.jav a:111)
    at org.codehaus.groovy.ast.ClassCodeExpressionTransfo rmer.visitConstructorOrMethod(ClassCodeExpressionT ransformer.java:66)
    at org.codehaus.groovy.control.StaticImportVisitor.vi sitConstructorOrMethod(StaticImportVisitor.java:10 8)
    at org.codehaus.groovy.ast.ClassCodeVisitorSupport.vi sitConstructor(ClassCodeVisitorSupport.java:101)
    at org.codehaus.groovy.ast.ClassNode.visitContents(Cl assNode.java:1089)
    at org.codehaus.groovy.ast.ClassCodeVisitorSupport.vi sitClass(ClassCodeVisitorSupport.java:52)
    at org.codehaus.groovy.control.CompilationUnit.lambda $addPhaseOperations$3(CompilationUnit.java:209)
    at org.codehaus.groovy.control.CompilationUnit$IPrima ryClassNodeOperation.doPhaseOperation(CompilationU nit.java:942)
    at org.codehaus.groovy.control.CompilationUnit.proces sPhaseOperations(CompilationUnit.java:671)
    at org.codehaus.groovy.control.CompilationUnit.compil e(CompilationUnit.java:635)
    at groovy.lang.GroovyClassLoader.doParseClass(GroovyC lassLoader.java:389)
    at groovy.lang.GroovyClassLoader.lambda$parseClass$3( GroovyClassLoader.java:332)
    at org.codehaus.groovy.runtime.memoize.StampedCommonC ache.compute(StampedCommonCache.java:163)
    at org.codehaus.groovy.runtime.memoize.StampedCommonC ache.getAndPut(StampedCommonCache.java:154)
    at groovy.lang.GroovyClassLoader.parseClass(GroovyCla ssLoader.java:330)
    at org.gradle.groovy.scripts.internal.DefaultScriptCo mpilationHandler.compileScript(DefaultScriptCompil ationHandler.java:139)
    at org.gradle.groovy.scripts.internal.DefaultScriptCo mpilationHandler.compileToDir(DefaultScriptCompila tionHandler.java:95)
    at org.gradle.groovy.scripts.internal.BuildOperationB ackedScriptCompilationHandler$2.run(BuildOperation BackedScriptCompilationHandler.java:54)
    at org.gradle.internal.operations.DefaultBuildOperati onRunner$1.execute(DefaultBuildOperationRunner.jav a:29)
    at org.gradle.internal.operations.DefaultBuildOperati onRunner$1.execute(DefaultBuildOperationRunner.jav a:26)
    at org.gradle.internal.operations.DefaultBuildOperati onRunner$3.execute(DefaultBuildOperationRunner.jav a:75)
    at org.gradle.internal.operations.DefaultBuildOperati onRunner$3.execute(DefaultBuildOperationRunner.jav a:68)
    at org.gradle.internal.operations.DefaultBuildOperati onRunner.execute(DefaultBuildOperationRunner.java: 153)
    at org.gradle.internal.operations.DefaultBuildOperati onRunner.execute(DefaultBuildOperationRunner.java: 68)
    at org.gradle.internal.operations.DefaultBuildOperati onRunner.run(DefaultBuildOperationRunner.java:56)
    at org.gradle.internal.operations.DefaultBuildOperati onExecutor.lambda$run$1(DefaultBuildOperationExecu tor.java:71)
    at org.gradle.internal.operations.UnmanagedBuildOpera tionWrapper.runWithUnmanagedSupport(UnmanagedBuild OperationWrapper.java:45)
    at org.gradle.internal.operations.DefaultBuildOperati onExecutor.run(DefaultBuildOperationExecutor.java: 71)
    at org.gradle.groovy.scripts.internal.BuildOperationB ackedScriptCompilationHandler.compileToDir(BuildOp erationBackedScriptCompilationHandler.java:51)
    at org.gradle.groovy.scripts.internal.FileCacheBacked ScriptClassCompiler$CompileToCrossBuildCacheAction .execute(FileCacheBackedScriptClassCompiler.java:1 90)
    at org.gradle.groovy.scripts.internal.FileCacheBacked ScriptClassCompiler$CompileToCrossBuildCacheAction .execute(FileCacheBackedScriptClassCompiler.java:1 70)
    at org.gradle.groovy.scripts.internal.FileCacheBacked ScriptClassCompiler$ProgressReportingInitializer.e xecute(FileCacheBackedScriptClassCompiler.java:211 )
    at org.gradle.groovy.scripts.internal.FileCacheBacked ScriptClassCompiler$ProgressReportingInitializer.e xecute(FileCacheBackedScriptClassCompiler.java:194 )
    at org.gradle.cache.internal.DefaultPersistentDirecto ryCache$Initializer.initialize(DefaultPersistentDi rectoryCache.java:100)
    at org.gradle.cache.internal.FixedSharedModeCrossProc essCacheAccess$1.run(FixedSharedModeCrossProcessCa cheAccess.java:86)
    at org.gradle.cache.internal.DefaultFileLockManager$D efaultFileLock.doWriteAction(DefaultFileLockManage r.java:216)
    at org.gradle.cache.internal.DefaultFileLockManager$D efaultFileLock.writeFile(DefaultFileLockManager.ja va:206)
    at org.gradle.cache.internal.FixedSharedModeCrossProc essCacheAccess.open(FixedSharedModeCrossProcessCac heAccess.java:83)
    at org.gradle.cache.internal.DefaultCacheAccess.open( DefaultCacheAccess.java:139)
    at org.gradle.cache.internal.DefaultPersistentDirecto ryStore.open(DefaultPersistentDirectoryStore.java: 89)
    at org.gradle.cache.internal.DefaultPersistentDirecto ryStore.open(DefaultPersistentDirectoryStore.java: 43)
    at org.gradle.cache.internal.DefaultCacheFactory.doOp en(DefaultCacheFactory.java:103)
    at org.gradle.cache.internal.DefaultCacheFactory.open (DefaultCacheFactory.java:68)
    at org.gradle.cache.internal.DefaultCacheRepository$P ersistentCacheBuilder.open(DefaultCacheRepository. java:126)
    at org.gradle.groovy.scripts.internal.FileCacheBacked ScriptClassCompiler.compile(FileCacheBackedScriptC lassCompiler.java:116)
    at org.gradle.groovy.scripts.internal.CrossBuildInMem oryCachingScriptClassCache.getOrCompile(CrossBuild InMemoryCachingScriptClassCache.java:50)
    at org.gradle.groovy.scripts.internal.BuildScopeInMem oryCachingScriptClassCompiler.compile(BuildScopeIn MemoryCachingScriptClassCompiler.java:50)
    at org.gradle.groovy.scripts.DefaultScriptCompilerFac tory$ScriptCompilerImpl.compile(DefaultScriptCompi lerFactory.java:49)
    at org.gradle.configuration.DefaultScriptPluginFactor y$ScriptPluginImpl.apply(DefaultScriptPluginFactor y.java:125)
    at org.gradle.configuration.BuildOperationScriptPlugi n$1.run(BuildOperationScriptPlugin.java:65)
    at org.gradle.internal.operations.DefaultBuildOperati onRunner$1.execute(DefaultBuildOperationRunner.jav a:29)
    at org.gradle.internal.operations.DefaultBuildOperati onRunner$1.execute(DefaultBuildOperationRunner.jav a:26)
    at org.gradle.internal.operations.DefaultBuildOperati onRunner$3.execute(DefaultBuildOperationRunner.jav a:75)
    at org.gradle.internal.operations.DefaultBuildOperati onRunner$3.execute(DefaultBuildOperationRunner.jav a:68)
    at org.gradle.internal.operations.DefaultBuildOperati onRunner.execute(DefaultBuildOperationRunner.java: 153)
    at org.gradle.internal.operations.DefaultBuildOperati onRunner.execute(DefaultBuildOperationRunner.java: 68)
    at org.gradle.internal.operations.DefaultBuildOperati onRunner.run(DefaultBuildOperationRunner.java:56)
    at org.gradle.internal.operations.DefaultBuildOperati onExecutor.lambda$run$1(DefaultBuildOperationExecu tor.java:71)
    at org.gradle.internal.operations.UnmanagedBuildOpera tionWrapper.runWithUnmanagedSupport(UnmanagedBuild OperationWrapper.java:45)
    at org.gradle.internal.operations.DefaultBuildOperati onExecutor.run(DefaultBuildOperationExecutor.java: 71)
    at org.gradle.configuration.BuildOperationScriptPlugi n.lambda$apply$0(BuildOperationScriptPlugin.java:6 2)
    at org.gradle.configuration.internal.DefaultUserCodeA pplicationContext.apply(DefaultUserCodeApplication Context.java:43)
    at org.gradle.configuration.BuildOperationScriptPlugi n.apply(BuildOperationScriptPlugin.java:62)
    at org.gradle.initialization.ScriptEvaluatingSettings Processor.applySettingsScript(ScriptEvaluatingSett ingsProcessor.java:74)
    at org.gradle.initialization.ScriptEvaluatingSettings Processor.process(ScriptEvaluatingSettingsProcesso r.java:67)
    at org.gradle.initialization.SettingsEvaluatedCallbac kFiringSettingsProcessor.process(SettingsEvaluated CallbackFiringSettingsProcessor.java:34)
    at org.gradle.initialization.RootBuildCacheController SettingsProcessor.process(RootBuildCacheController SettingsProcessor.java:47)
    at org.gradle.initialization.BuildOperationSettingsPr ocessor$2.call(BuildOperationSettingsProcessor.jav a:50)
    at org.gradle.initialization.BuildOperationSettingsPr ocessor$2.call(BuildOperationSettingsProcessor.jav a:47)
    at org.gradle.internal.operations.DefaultBuildOperati onRunner$CallableBuildOperationWorker.execute(Defa ultBuildOperationRunner.java:200)
    at org.gradle.internal.operations.DefaultBuildOperati onRunner$CallableBuildOperationWorker.execute(Defa ultBuildOperationRunner.java:195)
    at org.gradle.internal.operations.DefaultBuildOperati onRunner$3.execute(DefaultBuildOperationRunner.jav a:75)
    at org.gradle.internal.operations.DefaultBuildOperati onRunner$3.execute(DefaultBuildOperationRunner.jav a:68)
    at org.gradle.internal.operations.DefaultBuildOperati onRunner.execute(DefaultBuildOperationRunner.java: 153)
    at org.gradle.internal.operations.DefaultBuildOperati onRunner.execute(DefaultBuildOperationRunner.java: 68)
    at org.gradle.internal.operations.DefaultBuildOperati onRunner.call(DefaultBuildOperationRunner.java:62)
    at org.gradle.internal.operations.DefaultBuildOperati onExecutor.lambda$call$2(DefaultBuildOperationExec utor.java:76)
    at org.gradle.internal.operations.UnmanagedBuildOpera tionWrapper.callWithUnmanagedSupport(UnmanagedBuil dOperationWrapper.java:54)
    at org.gradle.internal.operations.DefaultBuildOperati onExecutor.call(DefaultBuildOperationExecutor.java :76)
    at org.gradle.initialization.BuildOperationSettingsPr ocessor.process(BuildOperationSettingsProcessor.ja va:47)
    at org.gradle.initialization.DefaultSettingsLoader.fi ndSettingsAndLoadIfAppropriate(DefaultSettingsLoad er.java:122)
    at org.gradle.initialization.DefaultSettingsLoader.fi ndAndLoadSettings(DefaultSettingsLoader.java:58)
    at org.gradle.initialization.SettingsAttachingSetting sLoader.findAndLoadSettings(SettingsAttachingSetti ngsLoader.java:35)
    at org.gradle.internal.composite.CommandLineIncludedB uildSettingsLoader.findAndLoadSettings(CommandLine IncludedBuildSettingsLoader.java:34)
    at org.gradle.internal.composite.ChildBuildRegisterin gSettingsLoader.findAndLoadSettings(ChildBuildRegi steringSettingsLoader.java:50)
    at org.gradle.internal.composite.CompositeBuildSettin gsLoader.findAndLoadSettings(CompositeBuildSetting sLoader.java:35)
    at org.gradle.initialization.DefaultSettingsPreparer. prepareSettings(DefaultSettingsPreparer.java:36)
    at org.gradle.initialization.BuildOperationFiringSett ingsPreparer$LoadBuild.doLoadBuild(BuildOperationF iringSettingsPreparer.java:62)
    at org.gradle.initialization.BuildOperationFiringSett ingsPreparer$LoadBuild.run(BuildOperationFiringSet tingsPreparer.java:57)
    at org.gradle.internal.operations.DefaultBuildOperati onRunner$1.execute(DefaultBuildOperationRunner.jav a:29)
    at org.gradle.internal.operations.DefaultBuildOperati onRunner$1.execute(DefaultBuildOperationRunner.jav a:26)
    at org.gradle.internal.operations.DefaultBuildOperati onRunner$3.execute(DefaultBuildOperationRunner.jav a:75)
    at org.gradle.internal.operations.DefaultBuildOperati onRunner$3.execute(DefaultBuildOperationRunner.jav a:68)
    at org.gradle.internal.operations.DefaultBuildOperati onRunner.execute(DefaultBuildOperationRunner.java: 153)
    at org.gradle.internal.operations.DefaultBuildOperati onRunner.execute(DefaultBuildOperationRunner.java: 68)
    at org.gradle.internal.operations.DefaultBuildOperati onRunner.run(DefaultBuildOperationRunner.java:56)
    at org.gradle.internal.operations.DefaultBuildOperati onExecutor.lambda$run$1(DefaultBuildOperationExecu tor.java:71)
    at org.gradle.internal.operations.UnmanagedBuildOpera tionWrapper.runWithUnmanagedSupport(UnmanagedBuild OperationWrapper.java:45)
    at org.gradle.internal.operations.DefaultBuildOperati onExecutor.run(DefaultBuildOperationExecutor.java: 71)
    at org.gradle.initialization.BuildOperationFiringSett ingsPreparer.prepareSettings(BuildOperationFiringS ettingsPreparer.java:45)
    at org.gradle.initialization.DefaultGradleLauncher.pr epareSettings(DefaultGradleLauncher.java:219)
    at org.gradle.initialization.DefaultGradleLauncher.do ClassicBuildStages(DefaultGradleLauncher.java:160)
    at org.gradle.initialization.DefaultGradleLauncher.do BuildStages(DefaultGradleLauncher.java:149)
    at org.gradle.initialization.DefaultGradleLauncher.ex ecuteTasks(DefaultGradleLauncher.java:125)
    at org.gradle.internal.invocation.GradleBuildControll er$1.create(GradleBuildController.java:71)
    at org.gradle.internal.work.DefaultWorkerLeaseService .withLocks(DefaultWorkerLeaseService.java:213)
    at org.gradle.internal.invocation.GradleBuildControll er.doBuild(GradleBuildController.java:67)
    at org.gradle.internal.invocation.GradleBuildControll er.run(GradleBuildController.java:56)
    at org.gradle.tooling.internal.provider.ExecuteBuildA ctionRunner.run(ExecuteBuildActionRunner.java:31)
    at org.gradle.launcher.exec.ChainingBuildActionRunner .run(ChainingBuildActionRunner.java:35)
    at org.gradle.launcher.exec.BuildOutcomeReportingBuil dActionRunner.run(BuildOutcomeReportingBuildAction Runner.java:66)
    at org.gradle.tooling.internal.provider.ValidatingBui ldActionRunner.run(ValidatingBuildActionRunner.jav a:32)
    at org.gradle.tooling.internal.provider.FileSystemWat chingBuildActionRunner.run(FileSystemWatchingBuild ActionRunner.java:90)
    at org.gradle.launcher.exec.BuildCompletionNotifyingB uildActionRunner.run(BuildCompletionNotifyingBuild ActionRunner.java:41)
    at org.gradle.launcher.exec.RunAsBuildOperationBuildA ctionRunner$3.call(RunAsBuildOperationBuildActionR unner.java:49)
    at org.gradle.launcher.exec.RunAsBuildOperationBuildA ctionRunner$3.call(RunAsBuildOperationBuildActionR unner.java:44)
    at org.gradle.internal.operations.DefaultBuildOperati onRunner$CallableBuildOperationWorker.execute(Defa ultBuildOperationRunner.java:200)
    at org.gradle.internal.operations.DefaultBuildOperati onRunner$CallableBuildOperationWorker.execute(Defa ultBuildOperationRunner.java:195)
    at org.gradle.internal.operations.DefaultBuildOperati onRunner$3.execute(DefaultBuildOperationRunner.jav a:75)
    at org.gradle.internal.operations.DefaultBuildOperati onRunner$3.execute(DefaultBuildOperationRunner.jav a:68)
    at org.gradle.internal.operations.DefaultBuildOperati onRunner.execute(DefaultBuildOperationRunner.java: 153)
    at org.gradle.internal.operations.DefaultBuildOperati onRunner.execute(DefaultBuildOperationRunner.java: 68)
    at org.gradle.internal.operations.DefaultBuildOperati onRunner.call(DefaultBuildOperationRunner.java:62)
    at org.gradle.internal.operations.DefaultBuildOperati onExecutor.lambda$call$2(DefaultBuildOperationExec utor.java:76)
    at org.gradle.internal.operations.UnmanagedBuildOpera tionWrapper.callWithUnmanagedSupport(UnmanagedBuil dOperationWrapper.java:54)
    at org.gradle.internal.operations.DefaultBuildOperati onExecutor.call(DefaultBuildOperationExecutor.java :76)
    at org.gradle.launcher.exec.RunAsBuildOperationBuildA ctionRunner.run(RunAsBuildOperationBuildActionRunn er.java:44)
    at org.gradle.launcher.exec.InProcessBuildActionExecu ter.lambda$execute$0(InProcessBuildActionExecuter. java:59)
    at org.gradle.composite.internal.DefaultRootBuildStat e.run(DefaultRootBuildState.java:86)
    at org.gradle.launcher.exec.InProcessBuildActionExecu ter.execute(InProcessBuildActionExecuter.java:58)
    at org.gradle.launcher.exec.InProcessBuildActionExecu ter.execute(InProcessBuildActionExecuter.java:30)
    at org.gradle.launcher.exec.BuildTreeScopeLifecycleBu ildActionExecuter.lambda$execute$0(BuildTreeScopeL ifecycleBuildActionExecuter.java:34)
    at org.gradle.internal.buildtree.BuildTreeState.run(B uildTreeState.java:53)
    at org.gradle.launcher.exec.BuildTreeScopeLifecycleBu ildActionExecuter.execute(BuildTreeScopeLifecycleB uildActionExecuter.java:33)
    at org.gradle.launcher.exec.BuildTreeScopeLifecycleBu ildActionExecuter.execute(BuildTreeScopeLifecycleB uildActionExecuter.java:28)
    at org.gradle.tooling.internal.provider.ContinuousBui ldActionExecuter.execute(ContinuousBuildActionExec uter.java:104)
    at org.gradle.tooling.internal.provider.ContinuousBui ldActionExecuter.execute(ContinuousBuildActionExec uter.java:55)
    at org.gradle.tooling.internal.provider.SubscribableB uildActionExecuter.execute(SubscribableBuildAction Executer.java:64)
    at org.gradle.tooling.internal.provider.SubscribableB uildActionExecuter.execute(SubscribableBuildAction Executer.java:37)
    at org.gradle.tooling.internal.provider.SessionScopeL ifecycleBuildActionExecuter.lambda$execute$0(Sessi onScopeLifecycleBuildActionExecuter.java:54)
    at org.gradle.internal.session.BuildSessionState.run( BuildSessionState.java:67)
    at org.gradle.tooling.internal.provider.SessionScopeL ifecycleBuildActionExecuter.execute(SessionScopeLi fecycleBuildActionExecuter.java:50)
    at org.gradle.tooling.internal.provider.SessionScopeL ifecycleBuildActionExecuter.execute(SessionScopeLi fecycleBuildActionExecuter.java:36)
    at org.gradle.tooling.internal.provider.GradleThreadB uildActionExecuter.execute(GradleThreadBuildAction Executer.java:36)
    at org.gradle.tooling.internal.provider.GradleThreadB uildActionExecuter.execute(GradleThreadBuildAction Executer.java:25)
    at org.gradle.tooling.internal.provider.StartParamsVa lidatingActionExecuter.execute(StartParamsValidati ngActionExecuter.java:59)
    at org.gradle.tooling.internal.provider.StartParamsVa lidatingActionExecuter.execute(StartParamsValidati ngActionExecuter.java:31)
    at org.gradle.tooling.internal.provider.SessionFailur eReportingActionExecuter.execute(SessionFailureRep ortingActionExecuter.java:58)
    at org.gradle.tooling.internal.provider.SessionFailur eReportingActionExecuter.execute(SessionFailureRep ortingActionExecuter.java:42)
    at org.gradle.tooling.internal.provider.SetupLoggingA ctionExecuter.execute(SetupLoggingActionExecuter.j ava:47)
    at org.gradle.tooling.internal.provider.SetupLoggingA ctionExecuter.execute(SetupLoggingActionExecuter.j ava:31)
    at org.gradle.launcher.daemon.server.exec.ExecuteBuil d.doBuild(ExecuteBuild.java:65)
    at org.gradle.launcher.daemon.server.exec.BuildComman dOnly.execute(BuildCommandOnly.java:37)
    at org.gradle.launcher.daemon.server.api.DaemonComman dExecution.proceed(DaemonCommandExecution.java:104 )
    at org.gradle.launcher.daemon.server.exec.WatchForDis connection.execute(WatchForDisconnection.java:39)
    at org.gradle.launcher.daemon.server.api.DaemonComman dExecution.proceed(DaemonCommandExecution.java:104 )
    at org.gradle.launcher.daemon.server.exec.ResetDeprec ationLogger.execute(ResetDeprecationLogger.java:29 )
    at org.gradle.launcher.daemon.server.api.DaemonComman dExecution.proceed(DaemonCommandExecution.java:104 )
    at org.gradle.launcher.daemon.server.exec.RequestStop IfSingleUsedDaemon.execute(RequestStopIfSingleUsed Daemon.java:35)
    at org.gradle.launcher.daemon.server.api.DaemonComman dExecution.proceed(DaemonCommandExecution.java:104 )
    at org.gradle.launcher.daemon.server.exec.ForwardClie ntInput$2.create(ForwardClientInput.java:78)
    at org.gradle.launcher.daemon.server.exec.ForwardClie ntInput$2.create(ForwardClientInput.java:75)
    at org.gradle.util.Swapper.swap(Swapper.java:38)
    at org.gradle.launcher.daemon.server.exec.ForwardClie ntInput.execute(ForwardClientInput.java:75)
    at org.gradle.launcher.daemon.server.api.DaemonComman dExecution.proceed(DaemonCommandExecution.java:104 )
    at org.gradle.launcher.daemon.server.exec.LogAndCheck Health.execute(LogAndCheckHealth.java:55)
    at org.gradle.launcher.daemon.server.api.DaemonComman dExecution.proceed(DaemonCommandExecution.java:104 )
    at org.gradle.launcher.daemon.server.exec.LogToClient .doBuild(LogToClient.java:63)
    at org.gradle.launcher.daemon.server.exec.BuildComman dOnly.execute(BuildCommandOnly.java:37)
    at org.gradle.launcher.daemon.server.api.DaemonComman dExecution.proceed(DaemonCommandExecution.java:104 )
    at org.gradle.launcher.daemon.server.exec.EstablishBu ildEnvironment.doBuild(EstablishBuildEnvironment.j ava:84)
    at org.gradle.launcher.daemon.server.exec.BuildComman dOnly.execute(BuildCommandOnly.java:37)
    at org.gradle.launcher.daemon.server.api.DaemonComman dExecution.proceed(DaemonCommandExecution.java:104 )
    at org.gradle.launcher.daemon.server.exec.StartBuildO rRespondWithBusy$1.run(StartBuildOrRespondWithBusy .java:52)
    at org.gradle.launcher.daemon.server.DaemonStateCoord inator$1.run(DaemonStateCoordinator.java:297)
    at org.gradle.internal.concurrent.ExecutorPolicy$Catc hAndRecordFailures.onExecute(ExecutorPolicy.java:6 4)
    at org.gradle.internal.concurrent.ManagedExecutorImpl $1.run(ManagedExecutorImpl.java:48)
    at java.base/java.util.concurrent.ThreadPoolExecutor.runWorker( ThreadPoolExecutor.java:1136)
    at java.base/java.util.concurrent.ThreadPoolExecutor$Worker.run (ThreadPoolExecutor.java:635)
    at org.gradle.internal.concurrent.ThreadFactoryImpl$M anagedThreadRunnable.run(ThreadFactoryImpl.java:56 )
    at java.base/java.lang.Thread.run(Thread.java:833)

    1 error


    * Try:
    Run with --stacktrace option to get the stack trace. Run with --info or --debug option to get more log output. Run with --scan to get full insights.

    * Get more help at https://help.gradle.org

    BUILD FAILED in 6s

    Please help. Android Studio is updated. Downloaded the newer one 3-5 days ago. Also using the beta version. Read somewhere it would work with Google Play Store. It does not work with the latest version, so changed it to the beta. Recently brought the developer for Google Play too.

    Please help.

    API 31, Min target 6.0, Max target 12.0.

  5. #5
    Clickteam Clickteam
    Fernando's Avatar
    Join Date
    Dec 2006
    Posts
    7,181
    Mentioned
    298 Post(s)
    Tagged
    4 Thread(s)
    This java version is not good anymore

    General error during conversion: Unsupported class file major version 61

    need to use the latest java 8 or latest java SDK from android studio

    also provide more information about what java SDK version & android studio version you have

    Regards,


    Fernando Vivolo

    ... new things are coming ...

  6. #6
    Clicker Fusion 2.5 (Steam)Fusion 2.5 Developer (Steam)Android Export Module (Steam)HTML5 Export Module (Steam)iOS Export Module (Steam)Universal Windows Platform Export Module (Steam)
    mrknd94's Avatar
    Join Date
    Jun 2017
    Location
    United Kingdom
    Posts
    49
    Mentioned
    0 Post(s)
    Tagged
    0 Thread(s)
    I have the latest SDK version, found here: Capture.PNG Capture 2.PNG Capture 3.PNG

    I have the latest version of Android Studio, found here: Capture 4.PNG

    Please, help.

  7. #7
    Clicker Fusion 2.5 (Steam)Fusion 2.5 Developer (Steam)Android Export Module (Steam)HTML5 Export Module (Steam)iOS Export Module (Steam)Universal Windows Platform Export Module (Steam)
    mrknd94's Avatar
    Join Date
    Jun 2017
    Location
    United Kingdom
    Posts
    49
    Mentioned
    0 Post(s)
    Tagged
    0 Thread(s)
    Please help me. I do not know how to fix this problem.

    Thanks in advance.

  8. #8
    Clickteam Clickteam
    Fernando's Avatar
    Join Date
    Dec 2006
    Posts
    7,181
    Mentioned
    298 Post(s)
    Tagged
    4 Thread(s)
    Can you install these

    Captureffff.PNG
    Regards,


    Fernando Vivolo

    ... new things are coming ...

  9. #9
    Clicker Fusion 2.5 (Steam)Fusion 2.5 Developer (Steam)Android Export Module (Steam)HTML5 Export Module (Steam)iOS Export Module (Steam)Universal Windows Platform Export Module (Steam)
    mrknd94's Avatar
    Join Date
    Jun 2017
    Location
    United Kingdom
    Posts
    49
    Mentioned
    0 Post(s)
    Tagged
    0 Thread(s)
    FAILURE: Build failed with an exception.

    * Where:
    Settings file 'C:\Users\Josh\AppData\Local\Temp\AndADEC.tmp\sett ings.gradle'

    * What went wrong:
    Could not compile settings file 'C:\Users\Josh\AppData\Local\Temp\AndADEC.tmp\sett ings.gradle'.
    > startup failed:
    General error during conversion: Unsupported class file major version 61

    java.lang.IllegalArgumentException: Unsupported class file major version 61
    at groovyjarjarasm.asm.ClassReader.<init>(ClassReader .java:189)
    at groovyjarjarasm.asm.ClassReader.<init>(ClassReader .java:170)
    at groovyjarjarasm.asm.ClassReader.<init>(ClassReader .java:156)
    at groovyjarjarasm.asm.ClassReader.<init>(ClassReader .java:277)
    at org.codehaus.groovy.ast.decompiled.AsmDecompiler.p arseClass(AsmDecompiler.java:81)
    at org.codehaus.groovy.control.ClassNodeResolver.find Decompiled(ClassNodeResolver.java:251)
    at org.codehaus.groovy.control.ClassNodeResolver.tryA sLoaderClassOrScript(ClassNodeResolver.java:189)
    at org.codehaus.groovy.control.ClassNodeResolver.find ClassNode(ClassNodeResolver.java:169)
    at org.codehaus.groovy.control.ClassNodeResolver.reso lveName(ClassNodeResolver.java:125)
    at org.codehaus.groovy.ast.decompiled.AsmReferenceRes olver.resolveClassNullable(AsmReferenceResolver.ja va:57)
    at org.codehaus.groovy.ast.decompiled.AsmReferenceRes olver.resolveClass(AsmReferenceResolver.java:44)
    at org.codehaus.groovy.ast.decompiled.AsmReferenceRes olver.resolveNonArrayType(AsmReferenceResolver.jav a:79)
    at org.codehaus.groovy.ast.decompiled.AsmReferenceRes olver.resolveType(AsmReferenceResolver.java:70)
    at org.codehaus.groovy.ast.decompiled.MemberSignature Parser.createMethodNode(MemberSignatureParser.java :57)
    at org.codehaus.groovy.ast.decompiled.DecompiledClass Node.lambda$createMethodNode$1(DecompiledClassNode .java:230)
    at org.codehaus.groovy.ast.decompiled.DecompiledClass Node.createMethodNode(DecompiledClassNode.java:236 )
    at org.codehaus.groovy.ast.decompiled.DecompiledClass Node.lazyInitMembers(DecompiledClassNode.java:203)
    at org.codehaus.groovy.ast.decompiled.DecompiledClass Node.getDeclaredMethods(DecompiledClassNode.java:1 22)
    at org.codehaus.groovy.ast.ClassNode.tryFindPossibleM ethod(ClassNode.java:1283)
    at org.codehaus.groovy.control.StaticImportVisitor.tr ansformMethodCallExpression(StaticImportVisitor.ja va:251)
    at org.codehaus.groovy.control.StaticImportVisitor.tr ansform(StaticImportVisitor.java:133)
    at org.codehaus.groovy.ast.ClassCodeExpressionTransfo rmer.visitExpressionStatement(ClassCodeExpressionT ransformer.java:108)
    at org.codehaus.groovy.ast.stmt.ExpressionStatement.v isit(ExpressionStatement.java:40)
    at org.codehaus.groovy.ast.ClassCodeVisitorSupport.vi sitClassCodeContainer(ClassCodeVisitorSupport.java :138)
    at org.codehaus.groovy.ast.ClassCodeVisitorSupport.vi sitConstructorOrMethod(ClassCodeVisitorSupport.jav a:111)
    at org.codehaus.groovy.ast.ClassCodeExpressionTransfo rmer.visitConstructorOrMethod(ClassCodeExpressionT ransformer.java:66)
    at org.codehaus.groovy.control.StaticImportVisitor.vi sitConstructorOrMethod(StaticImportVisitor.java:10 8)
    at org.codehaus.groovy.ast.ClassCodeVisitorSupport.vi sitConstructor(ClassCodeVisitorSupport.java:101)
    at org.codehaus.groovy.ast.ClassNode.visitContents(Cl assNode.java:1089)
    at org.codehaus.groovy.ast.ClassCodeVisitorSupport.vi sitClass(ClassCodeVisitorSupport.java:52)
    at org.codehaus.groovy.control.CompilationUnit.lambda $addPhaseOperations$3(CompilationUnit.java:209)
    at org.codehaus.groovy.control.CompilationUnit$IPrima ryClassNodeOperation.doPhaseOperation(CompilationU nit.java:942)
    at org.codehaus.groovy.control.CompilationUnit.proces sPhaseOperations(CompilationUnit.java:671)
    at org.codehaus.groovy.control.CompilationUnit.compil e(CompilationUnit.java:635)
    at groovy.lang.GroovyClassLoader.doParseClass(GroovyC lassLoader.java:389)
    at groovy.lang.GroovyClassLoader.lambda$parseClass$3( GroovyClassLoader.java:332)
    at org.codehaus.groovy.runtime.memoize.StampedCommonC ache.compute(StampedCommonCache.java:163)
    at org.codehaus.groovy.runtime.memoize.StampedCommonC ache.getAndPut(StampedCommonCache.java:154)
    at groovy.lang.GroovyClassLoader.parseClass(GroovyCla ssLoader.java:330)
    at org.gradle.groovy.scripts.internal.DefaultScriptCo mpilationHandler.compileScript(DefaultScriptCompil ationHandler.java:139)
    at org.gradle.groovy.scripts.internal.DefaultScriptCo mpilationHandler.compileToDir(DefaultScriptCompila tionHandler.java:95)
    at org.gradle.groovy.scripts.internal.BuildOperationB ackedScriptCompilationHandler$2.run(BuildOperation BackedScriptCompilationHandler.java:54)
    at org.gradle.internal.operations.DefaultBuildOperati onRunner$1.execute(DefaultBuildOperationRunner.jav a:29)
    at org.gradle.internal.operations.DefaultBuildOperati onRunner$1.execute(DefaultBuildOperationRunner.jav a:26)
    at org.gradle.internal.operations.DefaultBuildOperati onRunner$3.execute(DefaultBuildOperationRunner.jav a:75)
    at org.gradle.internal.operations.DefaultBuildOperati onRunner$3.execute(DefaultBuildOperationRunner.jav a:68)
    at org.gradle.internal.operations.DefaultBuildOperati onRunner.execute(DefaultBuildOperationRunner.java: 153)
    at org.gradle.internal.operations.DefaultBuildOperati onRunner.execute(DefaultBuildOperationRunner.java: 68)
    at org.gradle.internal.operations.DefaultBuildOperati onRunner.run(DefaultBuildOperationRunner.java:56)
    at org.gradle.internal.operations.DefaultBuildOperati onExecutor.lambda$run$1(DefaultBuildOperationExecu tor.java:71)
    at org.gradle.internal.operations.UnmanagedBuildOpera tionWrapper.runWithUnmanagedSupport(UnmanagedBuild OperationWrapper.java:45)
    at org.gradle.internal.operations.DefaultBuildOperati onExecutor.run(DefaultBuildOperationExecutor.java: 71)
    at org.gradle.groovy.scripts.internal.BuildOperationB ackedScriptCompilationHandler.compileToDir(BuildOp erationBackedScriptCompilationHandler.java:51)
    at org.gradle.groovy.scripts.internal.FileCacheBacked ScriptClassCompiler$CompileToCrossBuildCacheAction .execute(FileCacheBackedScriptClassCompiler.java:1 90)
    at org.gradle.groovy.scripts.internal.FileCacheBacked ScriptClassCompiler$CompileToCrossBuildCacheAction .execute(FileCacheBackedScriptClassCompiler.java:1 70)
    at org.gradle.groovy.scripts.internal.FileCacheBacked ScriptClassCompiler$ProgressReportingInitializer.e xecute(FileCacheBackedScriptClassCompiler.java:211 )
    at org.gradle.groovy.scripts.internal.FileCacheBacked ScriptClassCompiler$ProgressReportingInitializer.e xecute(FileCacheBackedScriptClassCompiler.java:194 )
    at org.gradle.cache.internal.DefaultPersistentDirecto ryCache$Initializer.initialize(DefaultPersistentDi rectoryCache.java:100)
    at org.gradle.cache.internal.FixedSharedModeCrossProc essCacheAccess$1.run(FixedSharedModeCrossProcessCa cheAccess.java:86)
    at org.gradle.cache.internal.DefaultFileLockManager$D efaultFileLock.doWriteAction(DefaultFileLockManage r.java:216)
    at org.gradle.cache.internal.DefaultFileLockManager$D efaultFileLock.writeFile(DefaultFileLockManager.ja va:206)
    at org.gradle.cache.internal.FixedSharedModeCrossProc essCacheAccess.open(FixedSharedModeCrossProcessCac heAccess.java:83)
    at org.gradle.cache.internal.DefaultCacheAccess.open( DefaultCacheAccess.java:139)
    at org.gradle.cache.internal.DefaultPersistentDirecto ryStore.open(DefaultPersistentDirectoryStore.java: 89)
    at org.gradle.cache.internal.DefaultPersistentDirecto ryStore.open(DefaultPersistentDirectoryStore.java: 43)
    at org.gradle.cache.internal.DefaultCacheFactory.doOp en(DefaultCacheFactory.java:103)
    at org.gradle.cache.internal.DefaultCacheFactory.open (DefaultCacheFactory.java:68)
    at org.gradle.cache.internal.DefaultCacheRepository$P ersistentCacheBuilder.open(DefaultCacheRepository. java:126)
    at org.gradle.groovy.scripts.internal.FileCacheBacked ScriptClassCompiler.compile(FileCacheBackedScriptC lassCompiler.java:116)
    at org.gradle.groovy.scripts.internal.CrossBuildInMem oryCachingScriptClassCache.getOrCompile(CrossBuild InMemoryCachingScriptClassCache.java:50)
    at org.gradle.groovy.scripts.internal.BuildScopeInMem oryCachingScriptClassCompiler.compile(BuildScopeIn MemoryCachingScriptClassCompiler.java:50)
    at org.gradle.groovy.scripts.DefaultScriptCompilerFac tory$ScriptCompilerImpl.compile(DefaultScriptCompi lerFactory.java:49)
    at org.gradle.configuration.DefaultScriptPluginFactor y$ScriptPluginImpl.apply(DefaultScriptPluginFactor y.java:125)
    at org.gradle.configuration.BuildOperationScriptPlugi n$1.run(BuildOperationScriptPlugin.java:65)
    at org.gradle.internal.operations.DefaultBuildOperati onRunner$1.execute(DefaultBuildOperationRunner.jav a:29)
    at org.gradle.internal.operations.DefaultBuildOperati onRunner$1.execute(DefaultBuildOperationRunner.jav a:26)
    at org.gradle.internal.operations.DefaultBuildOperati onRunner$3.execute(DefaultBuildOperationRunner.jav a:75)
    at org.gradle.internal.operations.DefaultBuildOperati onRunner$3.execute(DefaultBuildOperationRunner.jav a:68)
    at org.gradle.internal.operations.DefaultBuildOperati onRunner.execute(DefaultBuildOperationRunner.java: 153)
    at org.gradle.internal.operations.DefaultBuildOperati onRunner.execute(DefaultBuildOperationRunner.java: 68)
    at org.gradle.internal.operations.DefaultBuildOperati onRunner.run(DefaultBuildOperationRunner.java:56)
    at org.gradle.internal.operations.DefaultBuildOperati onExecutor.lambda$run$1(DefaultBuildOperationExecu tor.java:71)
    at org.gradle.internal.operations.UnmanagedBuildOpera tionWrapper.runWithUnmanagedSupport(UnmanagedBuild OperationWrapper.java:45)
    at org.gradle.internal.operations.DefaultBuildOperati onExecutor.run(DefaultBuildOperationExecutor.java: 71)
    at org.gradle.configuration.BuildOperationScriptPlugi n.lambda$apply$0(BuildOperationScriptPlugin.java:6 2)
    at org.gradle.configuration.internal.DefaultUserCodeA pplicationContext.apply(DefaultUserCodeApplication Context.java:43)
    at org.gradle.configuration.BuildOperationScriptPlugi n.apply(BuildOperationScriptPlugin.java:62)
    at org.gradle.initialization.ScriptEvaluatingSettings Processor.applySettingsScript(ScriptEvaluatingSett ingsProcessor.java:74)
    at org.gradle.initialization.ScriptEvaluatingSettings Processor.process(ScriptEvaluatingSettingsProcesso r.java:67)
    at org.gradle.initialization.SettingsEvaluatedCallbac kFiringSettingsProcessor.process(SettingsEvaluated CallbackFiringSettingsProcessor.java:34)
    at org.gradle.initialization.RootBuildCacheController SettingsProcessor.process(RootBuildCacheController SettingsProcessor.java:47)
    at org.gradle.initialization.BuildOperationSettingsPr ocessor$2.call(BuildOperationSettingsProcessor.jav a:50)
    at org.gradle.initialization.BuildOperationSettingsPr ocessor$2.call(BuildOperationSettingsProcessor.jav a:47)
    at org.gradle.internal.operations.DefaultBuildOperati onRunner$CallableBuildOperationWorker.execute(Defa ultBuildOperationRunner.java:200)
    at org.gradle.internal.operations.DefaultBuildOperati onRunner$CallableBuildOperationWorker.execute(Defa ultBuildOperationRunner.java:195)
    at org.gradle.internal.operations.DefaultBuildOperati onRunner$3.execute(DefaultBuildOperationRunner.jav a:75)
    at org.gradle.internal.operations.DefaultBuildOperati onRunner$3.execute(DefaultBuildOperationRunner.jav a:68)
    at org.gradle.internal.operations.DefaultBuildOperati onRunner.execute(DefaultBuildOperationRunner.java: 153)
    at org.gradle.internal.operations.DefaultBuildOperati onRunner.execute(DefaultBuildOperationRunner.java: 68)
    at org.gradle.internal.operations.DefaultBuildOperati onRunner.call(DefaultBuildOperationRunner.java:62)
    at org.gradle.internal.operations.DefaultBuildOperati onExecutor.lambda$call$2(DefaultBuildOperationExec utor.java:76)
    at org.gradle.internal.operations.UnmanagedBuildOpera tionWrapper.callWithUnmanagedSupport(UnmanagedBuil dOperationWrapper.java:54)
    at org.gradle.internal.operations.DefaultBuildOperati onExecutor.call(DefaultBuildOperationExecutor.java :76)
    at org.gradle.initialization.BuildOperationSettingsPr ocessor.process(BuildOperationSettingsProcessor.ja va:47)
    at org.gradle.initialization.DefaultSettingsLoader.fi ndSettingsAndLoadIfAppropriate(DefaultSettingsLoad er.java:122)
    at org.gradle.initialization.DefaultSettingsLoader.fi ndAndLoadSettings(DefaultSettingsLoader.java:58)
    at org.gradle.initialization.SettingsAttachingSetting sLoader.findAndLoadSettings(SettingsAttachingSetti ngsLoader.java:35)
    at org.gradle.internal.composite.CommandLineIncludedB uildSettingsLoader.findAndLoadSettings(CommandLine IncludedBuildSettingsLoader.java:34)
    at org.gradle.internal.composite.ChildBuildRegisterin gSettingsLoader.findAndLoadSettings(ChildBuildRegi steringSettingsLoader.java:50)
    at org.gradle.internal.composite.CompositeBuildSettin gsLoader.findAndLoadSettings(CompositeBuildSetting sLoader.java:35)
    at org.gradle.initialization.DefaultSettingsPreparer. prepareSettings(DefaultSettingsPreparer.java:36)
    at org.gradle.initialization.BuildOperationFiringSett ingsPreparer$LoadBuild.doLoadBuild(BuildOperationF iringSettingsPreparer.java:62)
    at org.gradle.initialization.BuildOperationFiringSett ingsPreparer$LoadBuild.run(BuildOperationFiringSet tingsPreparer.java:57)
    at org.gradle.internal.operations.DefaultBuildOperati onRunner$1.execute(DefaultBuildOperationRunner.jav a:29)
    at org.gradle.internal.operations.DefaultBuildOperati onRunner$1.execute(DefaultBuildOperationRunner.jav a:26)
    at org.gradle.internal.operations.DefaultBuildOperati onRunner$3.execute(DefaultBuildOperationRunner.jav a:75)
    at org.gradle.internal.operations.DefaultBuildOperati onRunner$3.execute(DefaultBuildOperationRunner.jav a:68)
    at org.gradle.internal.operations.DefaultBuildOperati onRunner.execute(DefaultBuildOperationRunner.java: 153)
    at org.gradle.internal.operations.DefaultBuildOperati onRunner.execute(DefaultBuildOperationRunner.java: 68)
    at org.gradle.internal.operations.DefaultBuildOperati onRunner.run(DefaultBuildOperationRunner.java:56)
    at org.gradle.internal.operations.DefaultBuildOperati onExecutor.lambda$run$1(DefaultBuildOperationExecu tor.java:71)
    at org.gradle.internal.operations.UnmanagedBuildOpera tionWrapper.runWithUnmanagedSupport(UnmanagedBuild OperationWrapper.java:45)
    at org.gradle.internal.operations.DefaultBuildOperati onExecutor.run(DefaultBuildOperationExecutor.java: 71)
    at org.gradle.initialization.BuildOperationFiringSett ingsPreparer.prepareSettings(BuildOperationFiringS ettingsPreparer.java:45)
    at org.gradle.initialization.DefaultGradleLauncher.pr epareSettings(DefaultGradleLauncher.java:219)
    at org.gradle.initialization.DefaultGradleLauncher.do ClassicBuildStages(DefaultGradleLauncher.java:160)
    at org.gradle.initialization.DefaultGradleLauncher.do BuildStages(DefaultGradleLauncher.java:149)
    at org.gradle.initialization.DefaultGradleLauncher.ex ecuteTasks(DefaultGradleLauncher.java:125)
    at org.gradle.internal.invocation.GradleBuildControll er$1.create(GradleBuildController.java:71)
    at org.gradle.internal.work.DefaultWorkerLeaseService .withLocks(DefaultWorkerLeaseService.java:213)
    at org.gradle.internal.invocation.GradleBuildControll er.doBuild(GradleBuildController.java:67)
    at org.gradle.internal.invocation.GradleBuildControll er.run(GradleBuildController.java:56)
    at org.gradle.tooling.internal.provider.ExecuteBuildA ctionRunner.run(ExecuteBuildActionRunner.java:31)
    at org.gradle.launcher.exec.ChainingBuildActionRunner .run(ChainingBuildActionRunner.java:35)
    at org.gradle.launcher.exec.BuildOutcomeReportingBuil dActionRunner.run(BuildOutcomeReportingBuildAction Runner.java:66)
    at org.gradle.tooling.internal.provider.ValidatingBui ldActionRunner.run(ValidatingBuildActionRunner.jav a:32)
    at org.gradle.tooling.internal.provider.FileSystemWat chingBuildActionRunner.run(FileSystemWatchingBuild ActionRunner.java:90)
    at org.gradle.launcher.exec.BuildCompletionNotifyingB uildActionRunner.run(BuildCompletionNotifyingBuild ActionRunner.java:41)
    at org.gradle.launcher.exec.RunAsBuildOperationBuildA ctionRunner$3.call(RunAsBuildOperationBuildActionR unner.java:49)
    at org.gradle.launcher.exec.RunAsBuildOperationBuildA ctionRunner$3.call(RunAsBuildOperationBuildActionR unner.java:44)
    at org.gradle.internal.operations.DefaultBuildOperati onRunner$CallableBuildOperationWorker.execute(Defa ultBuildOperationRunner.java:200)
    at org.gradle.internal.operations.DefaultBuildOperati onRunner$CallableBuildOperationWorker.execute(Defa ultBuildOperationRunner.java:195)
    at org.gradle.internal.operations.DefaultBuildOperati onRunner$3.execute(DefaultBuildOperationRunner.jav a:75)
    at org.gradle.internal.operations.DefaultBuildOperati onRunner$3.execute(DefaultBuildOperationRunner.jav a:68)
    at org.gradle.internal.operations.DefaultBuildOperati onRunner.execute(DefaultBuildOperationRunner.java: 153)
    at org.gradle.internal.operations.DefaultBuildOperati onRunner.execute(DefaultBuildOperationRunner.java: 68)
    at org.gradle.internal.operations.DefaultBuildOperati onRunner.call(DefaultBuildOperationRunner.java:62)
    at org.gradle.internal.operations.DefaultBuildOperati onExecutor.lambda$call$2(DefaultBuildOperationExec utor.java:76)
    at org.gradle.internal.operations.UnmanagedBuildOpera tionWrapper.callWithUnmanagedSupport(UnmanagedBuil dOperationWrapper.java:54)
    at org.gradle.internal.operations.DefaultBuildOperati onExecutor.call(DefaultBuildOperationExecutor.java :76)
    at org.gradle.launcher.exec.RunAsBuildOperationBuildA ctionRunner.run(RunAsBuildOperationBuildActionRunn er.java:44)
    at org.gradle.launcher.exec.InProcessBuildActionExecu ter.lambda$execute$0(InProcessBuildActionExecuter. java:59)
    at org.gradle.composite.internal.DefaultRootBuildStat e.run(DefaultRootBuildState.java:86)
    at org.gradle.launcher.exec.InProcessBuildActionExecu ter.execute(InProcessBuildActionExecuter.java:58)
    at org.gradle.launcher.exec.InProcessBuildActionExecu ter.execute(InProcessBuildActionExecuter.java:30)
    at org.gradle.launcher.exec.BuildTreeScopeLifecycleBu ildActionExecuter.lambda$execute$0(BuildTreeScopeL ifecycleBuildActionExecuter.java:34)
    at org.gradle.internal.buildtree.BuildTreeState.run(B uildTreeState.java:53)
    at org.gradle.launcher.exec.BuildTreeScopeLifecycleBu ildActionExecuter.execute(BuildTreeScopeLifecycleB uildActionExecuter.java:33)
    at org.gradle.launcher.exec.BuildTreeScopeLifecycleBu ildActionExecuter.execute(BuildTreeScopeLifecycleB uildActionExecuter.java:28)
    at org.gradle.tooling.internal.provider.ContinuousBui ldActionExecuter.execute(ContinuousBuildActionExec uter.java:104)
    at org.gradle.tooling.internal.provider.ContinuousBui ldActionExecuter.execute(ContinuousBuildActionExec uter.java:55)
    at org.gradle.tooling.internal.provider.SubscribableB uildActionExecuter.execute(SubscribableBuildAction Executer.java:64)
    at org.gradle.tooling.internal.provider.SubscribableB uildActionExecuter.execute(SubscribableBuildAction Executer.java:37)
    at org.gradle.tooling.internal.provider.SessionScopeL ifecycleBuildActionExecuter.lambda$execute$0(Sessi onScopeLifecycleBuildActionExecuter.java:54)
    at org.gradle.internal.session.BuildSessionState.run( BuildSessionState.java:67)
    at org.gradle.tooling.internal.provider.SessionScopeL ifecycleBuildActionExecuter.execute(SessionScopeLi fecycleBuildActionExecuter.java:50)
    at org.gradle.tooling.internal.provider.SessionScopeL ifecycleBuildActionExecuter.execute(SessionScopeLi fecycleBuildActionExecuter.java:36)
    at org.gradle.tooling.internal.provider.GradleThreadB uildActionExecuter.execute(GradleThreadBuildAction Executer.java:36)
    at org.gradle.tooling.internal.provider.GradleThreadB uildActionExecuter.execute(GradleThreadBuildAction Executer.java:25)
    at org.gradle.tooling.internal.provider.StartParamsVa lidatingActionExecuter.execute(StartParamsValidati ngActionExecuter.java:59)
    at org.gradle.tooling.internal.provider.StartParamsVa lidatingActionExecuter.execute(StartParamsValidati ngActionExecuter.java:31)
    at org.gradle.tooling.internal.provider.SessionFailur eReportingActionExecuter.execute(SessionFailureRep ortingActionExecuter.java:58)
    at org.gradle.tooling.internal.provider.SessionFailur eReportingActionExecuter.execute(SessionFailureRep ortingActionExecuter.java:42)
    at org.gradle.tooling.internal.provider.SetupLoggingA ctionExecuter.execute(SetupLoggingActionExecuter.j ava:47)
    at org.gradle.tooling.internal.provider.SetupLoggingA ctionExecuter.execute(SetupLoggingActionExecuter.j ava:31)
    at org.gradle.launcher.daemon.server.exec.ExecuteBuil d.doBuild(ExecuteBuild.java:65)
    at org.gradle.launcher.daemon.server.exec.BuildComman dOnly.execute(BuildCommandOnly.java:37)
    at org.gradle.launcher.daemon.server.api.DaemonComman dExecution.proceed(DaemonCommandExecution.java:104 )
    at org.gradle.launcher.daemon.server.exec.WatchForDis connection.execute(WatchForDisconnection.java:39)
    at org.gradle.launcher.daemon.server.api.DaemonComman dExecution.proceed(DaemonCommandExecution.java:104 )
    at org.gradle.launcher.daemon.server.exec.ResetDeprec ationLogger.execute(ResetDeprecationLogger.java:29 )
    at org.gradle.launcher.daemon.server.api.DaemonComman dExecution.proceed(DaemonCommandExecution.java:104 )
    at org.gradle.launcher.daemon.server.exec.RequestStop IfSingleUsedDaemon.execute(RequestStopIfSingleUsed Daemon.java:35)
    at org.gradle.launcher.daemon.server.api.DaemonComman dExecution.proceed(DaemonCommandExecution.java:104 )
    at org.gradle.launcher.daemon.server.exec.ForwardClie ntInput$2.create(ForwardClientInput.java:78)
    at org.gradle.launcher.daemon.server.exec.ForwardClie ntInput$2.create(ForwardClientInput.java:75)
    at org.gradle.util.Swapper.swap(Swapper.java:38)
    at org.gradle.launcher.daemon.server.exec.ForwardClie ntInput.execute(ForwardClientInput.java:75)
    at org.gradle.launcher.daemon.server.api.DaemonComman dExecution.proceed(DaemonCommandExecution.java:104 )
    at org.gradle.launcher.daemon.server.exec.LogAndCheck Health.execute(LogAndCheckHealth.java:55)
    at org.gradle.launcher.daemon.server.api.DaemonComman dExecution.proceed(DaemonCommandExecution.java:104 )
    at org.gradle.launcher.daemon.server.exec.LogToClient .doBuild(LogToClient.java:63)
    at org.gradle.launcher.daemon.server.exec.BuildComman dOnly.execute(BuildCommandOnly.java:37)
    at org.gradle.launcher.daemon.server.api.DaemonComman dExecution.proceed(DaemonCommandExecution.java:104 )
    at org.gradle.launcher.daemon.server.exec.EstablishBu ildEnvironment.doBuild(EstablishBuildEnvironment.j ava:84)
    at org.gradle.launcher.daemon.server.exec.BuildComman dOnly.execute(BuildCommandOnly.java:37)
    at org.gradle.launcher.daemon.server.api.DaemonComman dExecution.proceed(DaemonCommandExecution.java:104 )
    at org.gradle.launcher.daemon.server.exec.StartBuildO rRespondWithBusy$1.run(StartBuildOrRespondWithBusy .java:52)
    at org.gradle.launcher.daemon.server.DaemonStateCoord inator$1.run(DaemonStateCoordinator.java:297)
    at org.gradle.internal.concurrent.ExecutorPolicy$Catc hAndRecordFailures.onExecute(ExecutorPolicy.java:6 4)
    at org.gradle.internal.concurrent.ManagedExecutorImpl $1.run(ManagedExecutorImpl.java:48)
    at java.base/java.util.concurrent.ThreadPoolExecutor.runWorker( ThreadPoolExecutor.java:1136)
    at java.base/java.util.concurrent.ThreadPoolExecutor$Worker.run (ThreadPoolExecutor.java:635)
    at org.gradle.internal.concurrent.ThreadFactoryImpl$M anagedThreadRunnable.run(ThreadFactoryImpl.java:56 )
    at java.base/java.lang.Thread.run(Thread.java:833)

    1 error


    * Try:
    Run with --stacktrace option to get the stack trace. Run with --info or --debug option to get more log output. Run with --scan to get full insights.

    * Get more help at https://help.gradle.org

    BUILD FAILED in 1s

    I have installed: Capture 5.PNG

    Please help?

  10. #10
    Clickteam Clickteam
    Fernando's Avatar
    Join Date
    Dec 2006
    Posts
    7,181
    Mentioned
    298 Post(s)
    Tagged
    4 Thread(s)
    You still have problem with the java SDK can you show what version you have there?
    Regards,


    Fernando Vivolo

    ... new things are coming ...

Page 1 of 2 1 2 LastLast

Similar Threads

  1. Unable to launch game due to unknown error
    By Electromaster in forum HTML5 Export Module 2.5
    Replies: 0
    Last Post: 6th February 2017, 02:32 AM
  2. Build process fails with error message 'cannot build blah.mfa
    By Jusfury in forum Android Export Module 2.5
    Replies: 7
    Last Post: 22nd May 2015, 09:16 PM
  3. Build process fails with error message 'Invalid keystore format'
    By trigonom in forum Android Export Module 2.5
    Replies: 7
    Last Post: 5th February 2015, 12:58 AM
  4. [solved]Build Error "Unable to resolve project target 'android-18'"
    By Jonas in forum Android Export Module 2.5
    Replies: 0
    Last Post: 30th November 2014, 11:32 PM
  5. build problem with edif SDK "unable to start program "
    By shuzhuoqq in forum Extension Development
    Replies: 6
    Last Post: 17th April 2014, 01:21 PM

Posting Permissions

  • You may not post new threads
  • You may not post replies
  • You may not post attachments
  • You may not edit your posts
  •