User Tag List

Page 1 of 2 1 2 LastLast
Results 1 to 10 of 12

Thread: Fusion b293.10 can't build any APK file

  1. #1
    Clicker Fusion 2.5 DeveloperFusion 2.5+ DLCAndroid Export ModuleHTML5 Export ModuleiOS Export ModuleUniversal Windows Platform Export ModuleXNA Export Module
    Dobermann's Avatar
    Join Date
    Feb 2009
    Location
    France
    Posts
    973
    Mentioned
    38 Post(s)
    Tagged
    0 Thread(s)

    Fusion b293.10 can't build any APK file

    Hello, since i've update my Fusion Dev 2.5+ to version b293.10, i canb't build any APK file, i always get the same kind of error:

    Code:
    Warning: Mapping new ns http://schemas.android.com/repository/android/common/02 to old ns http://schemas.android.com/repository/android/common/01
    Warning: Mapping new ns http://schemas.android.com/repository/android/generic/02 to old ns http://schemas.android.com/repository/android/generic/01
    Warning: Mapping new ns http://schemas.android.com/sdk/android/repo/addon2/02 to old ns http://schemas.android.com/sdk/android/repo/addon2/01
    Warning: Mapping new ns http://schemas.android.com/sdk/android/repo/repository2/02 to old ns http://schemas.android.com/sdk/android/repo/repository2/01
    Warning: Mapping new ns http://schemas.android.com/sdk/android/repo/sys-img2/02 to old ns http://schemas.android.com/sdk/android/repo/sys-img2/01
    > Task :app:preBuild UP-TO-DATE
    > Task :app:preReleaseBuild UP-TO-DATE
    > Task :app:compileReleaseAidl NO-SOURCE
    > Task :app:compileReleaseRenderscript NO-SOURCE
    > Task :app:generateReleaseBuildConfig
    > Task :app:javaPreCompileRelease
    > Task :app:writeReleaseApplicationId
    > Task :app:analyticsRecordingRelease
    > Task :app:checkReleaseAarMetadata
    > Task :app:generateReleaseResValues
    > Task :app:generateReleaseResources
    > Task :app:createReleaseCompatibleScreenManifests
    > Task :app:extractDeepLinksRelease
    > Task :app:processReleaseMainManifest
    > Task :app:processReleaseManifest
    > Task :app:mergeReleaseResources
    > Task :app:mergeReleaseJniLibFolders
    > Task :app:mergeReleaseShaders
    > Task :app:compileReleaseShaders NO-SOURCE
    > Task :app:generateReleaseAssets UP-TO-DATE
    > Task :app:mergeReleaseAssets
    > Task :app:compressReleaseAssets
    > Task :app:checkReleaseDuplicateClasses
    > Task :app:processReleaseJavaRes NO-SOURCE
    > Task :app:collectReleaseDependencies
    > Task :app:sdkReleaseDependencyData
    > Task :app:validateSigningRelease
    > Task :app:writeReleaseAppMetadata
    > Task :app:writeReleaseSigningConfigVersions
    > Task :app:processReleaseManifestForPackage
    > Task :app:desugarReleaseFileDependencies
    > Task :app:mergeReleaseJavaResource
    > Task :app:mergeReleaseNativeLibs
    
    > Task :app:stripReleaseDebugSymbols
    Unable to strip the following libraries, packaging them as they are: libBluewing_Client.so, libES1Renderer.so, libES2Renderer.so, libES3Renderer.so, libRuntimeNative.so, libgdx.so.
    
    > Task :app:extractReleaseNativeSymbolTables
    Unable to extract native debug metadata from C:\Users\William\AppData\Local\Temp\And4F6A.tmp\app\build\intermediates\merged_native_libs\release\out\lib\arm64-v8a\libBluewing_Client.so because unable to locate the objcopy executable for the arm64-v8a ABI.
    Unable to extract native debug metadata from C:\Users\William\AppData\Local\Temp\And4F6A.tmp\app\build\intermediates\merged_native_libs\release\out\lib\arm64-v8a\libES1Renderer.so because unable to locate the objcopy executable for the arm64-v8a ABI.
    Unable to extract native debug metadata from C:\Users\William\AppData\Local\Temp\And4F6A.tmp\app\build\intermediates\merged_native_libs\release\out\lib\arm64-v8a\libES2Renderer.so because unable to locate the objcopy executable for the arm64-v8a ABI.
    Unable to extract native debug metadata from C:\Users\William\AppData\Local\Temp\And4F6A.tmp\app\build\intermediates\merged_native_libs\release\out\lib\arm64-v8a\libES3Renderer.so because unable to locate the objcopy executable for the arm64-v8a ABI.
    Unable to extract native debug metadata from C:\Users\William\AppData\Local\Temp\And4F6A.tmp\app\build\intermediates\merged_native_libs\release\out\lib\arm64-v8a\libgdx.so because unable to locate the objcopy executable for the arm64-v8a ABI.
    Unable to extract native debug metadata from C:\Users\William\AppData\Local\Temp\And4F6A.tmp\app\build\intermediates\merged_native_libs\release\out\lib\arm64-v8a\libRuntimeNative.so because unable to locate the objcopy executable for the arm64-v8a ABI.
    Unable to extract native debug metadata from C:\Users\William\AppData\Local\Temp\And4F6A.tmp\app\build\intermediates\merged_native_libs\release\out\lib\armeabi-v7a\libBluewing_Client.so because unable to locate the objcopy executable for the armeabi-v7a ABI.
    Unable to extract native debug metadata from C:\Users\William\AppData\Local\Temp\And4F6A.tmp\app\build\intermediates\merged_native_libs\release\out\lib\armeabi-v7a\libES1Renderer.so because unable to locate the objcopy executable for the armeabi-v7a ABI.
    Unable to extract native debug metadata from C:\Users\William\AppData\Local\Temp\And4F6A.tmp\app\build\intermediates\merged_native_libs\release\out\lib\armeabi-v7a\libES2Renderer.so because unable to locate the objcopy executable for the armeabi-v7a ABI.
    Unable to extract native debug metadata from C:\Users\William\AppData\Local\Temp\And4F6A.tmp\app\build\intermediates\merged_native_libs\release\out\lib\armeabi-v7a\libES3Renderer.so because unable to locate the objcopy executable for the armeabi-v7a ABI.
    Unable to extract native debug metadata from C:\Users\William\AppData\Local\Temp\And4F6A.tmp\app\build\intermediates\merged_native_libs\release\out\lib\armeabi-v7a\libgdx.so because unable to locate the objcopy executable for the armeabi-v7a ABI.
    Unable to extract native debug metadata from C:\Users\William\AppData\Local\Temp\And4F6A.tmp\app\build\intermediates\merged_native_libs\release\out\lib\armeabi-v7a\libRuntimeNative.so because unable to locate the objcopy executable for the armeabi-v7a ABI.
    Unable to extract native debug metadata from C:\Users\William\AppData\Local\Temp\And4F6A.tmp\app\build\intermediates\merged_native_libs\release\out\lib\x86\libBluewing_Client.so because unable to locate the objcopy executable for the x86 ABI.
    Unable to extract native debug metadata from C:\Users\William\AppData\Local\Temp\And4F6A.tmp\app\build\intermediates\merged_native_libs\release\out\lib\x86\libES1Renderer.so because unable to locate the objcopy executable for the x86 ABI.
    Unable to extract native debug metadata from C:\Users\William\AppData\Local\Temp\And4F6A.tmp\app\build\intermediates\merged_native_libs\release\out\lib\x86\libES2Renderer.so because unable to locate the objcopy executable for the x86 ABI.
    Unable to extract native debug metadata from C:\Users\William\AppData\Local\Temp\And4F6A.tmp\app\build\intermediates\merged_native_libs\release\out\lib\x86\libES3Renderer.so because unable to locate the objcopy executable for the x86 ABI.
    Unable to extract native debug metadata from C:\Users\William\AppData\Local\Temp\And4F6A.tmp\app\build\intermediates\merged_native_libs\release\out\lib\x86\libgdx.so because unable to locate the objcopy executable for the x86 ABI.
    Unable to extract native debug metadata from C:\Users\William\AppData\Local\Temp\And4F6A.tmp\app\build\intermediates\merged_native_libs\release\out\lib\x86\libRuntimeNative.so because unable to locate the objcopy executable for the x86 ABI.
    Unable to extract native debug metadata from C:\Users\William\AppData\Local\Temp\And4F6A.tmp\app\build\intermediates\merged_native_libs\release\out\lib\x86_64\libBluewing_Client.so because unable to locate the objcopy executable for the x86_64 ABI.
    Unable to extract native debug metadata from C:\Users\William\AppData\Local\Temp\And4F6A.tmp\app\build\intermediates\merged_native_libs\release\out\lib\x86_64\libES1Renderer.so because unable to locate the objcopy executable for the x86_64 ABI.
    Unable to extract native debug metadata from C:\Users\William\AppData\Local\Temp\And4F6A.tmp\app\build\intermediates\merged_native_libs\release\out\lib\x86_64\libES2Renderer.so because unable to locate the objcopy executable for the x86_64 ABI.
    Unable to extract native debug metadata from C:\Users\William\AppData\Local\Temp\And4F6A.tmp\app\build\intermediates\merged_native_libs\release\out\lib\x86_64\libES3Renderer.so because unable to locate the objcopy executable for the x86_64 ABI.
    Unable to extract native debug metadata from C:\Users\William\AppData\Local\Temp\And4F6A.tmp\app\build\intermediates\merged_native_libs\release\out\lib\x86_64\libgdx.so because unable to locate the objcopy executable for the x86_64 ABI.
    Unable to extract native debug metadata from C:\Users\William\AppData\Local\Temp\And4F6A.tmp\app\build\intermediates\merged_native_libs\release\out\lib\x86_64\libRuntimeNative.so because unable to locate the objcopy executable for the x86_64 ABI.
    
    > Task :app:mergeReleaseNativeDebugMetadata NO-SOURCE
    > Task :app:processReleaseResources
    > Task :app:mergeExtDexRelease
    
    > Task :app:compileReleaseJavaWithJavac
    C:\Users\William\AppData\Local\Temp\And4F6A.tmp\app\src\main\java\Application\CRunApp.java:1911: error: cannot find symbol
    						file.stream = MMFRuntime.inst.getInputStreamFromOBB(path);
    						                             ^
      symbol:   method getInputStreamFromOBB(String)
      location: variable inst of type MMFRuntime
    C:\Users\William\AppData\Local\Temp\And4F6A.tmp\app\src\main\java\Services\CFile.java:74: error: cannot find symbol
                if(MMFRuntime.inst.assetsAvailable)
                                  ^
      symbol:   variable assetsAvailable
      location: variable inst of type MMFRuntime
    C:\Users\William\AppData\Local\Temp\And4F6A.tmp\app\src\main\java\Services\CFile.java:74: error: illegal parenthesized expression
                if(MMFRuntime.inst.assetsAvailable)
                  ^
    C:\Users\William\AppData\Local\Temp\And4F6A.tmp\app\src\main\java\Services\CFile.java:76: error: cannot find symbol
                    MMFRuntime.inst.inputAssetToFile ("application.ccn", filename);
                                   ^
      symbol:   method inputAssetToFile(String,String)
      location: variable inst of type MMFRuntime
    C:\Users\William\AppData\Local\Temp\And4F6A.tmp\app\src\main\java\Services\CFile.java:83: error: cannot find symbol
                    		MMFRuntime.inst.getInputStreamFromOBB("res/raw/application.ccn"), filename);
                    		               ^
      symbol:   method getInputStreamFromOBB(String)
      location: variable inst of type MMFRuntime
    C:\Users\William\AppData\Local\Temp\And4F6A.tmp\app\src\main\java\Services\CFile.java:93: error: cannot find symbol
                        if(MMFRuntime.inst.assetsAvailable) {
                                          ^
      symbol:   variable assetsAvailable
      location: variable inst of type MMFRuntime
    C:\Users\William\AppData\Local\Temp\And4F6A.tmp\app\src\main\java\Services\CFile.java:93: error: illegal parenthesized expression
                        if(MMFRuntime.inst.assetsAvailable) {
                          ^
    C:\Users\William\AppData\Local\Temp\And4F6A.tmp\app\src\main\java\Services\CFile.java:94: error: cannot find symbol
                            MMFRuntime.inst.inputAssetToFile ("application.ccn", filename);
                                           ^
      symbol:   method inputAssetToFile(String,String)
      location: variable inst of type MMFRuntime
    C:\Users\William\AppData\Local\Temp\And4F6A.tmp\app\src\main\java\Services\CFile.java:103: error: cannot find symbol
                                    MMFRuntime.inst.getInputStreamFromOBB("res/raw/application.ccn"), filename);
                                                   ^
      symbol:   method getInputStreamFromOBB(String)
      location: variable inst of type MMFRuntime
    C:\Users\William\AppData\Local\Temp\And4F6A.tmp\app\src\main\java\Banks\CSoundBank.java:195: error: cannot find symbol
    							if (MMFRuntime.inst.assetsAvailable)
    							                   ^
      symbol:   variable assetsAvailable
      location: variable inst of type MMFRuntime
    C:\Users\William\AppData\Local\Temp\And4F6A.tmp\app\src\main\java\Banks\CSoundBank.java:195: error: illegal parenthesized expression
    							if (MMFRuntime.inst.assetsAvailable)
    							   ^
    C:\Users\William\AppData\Local\Temp\And4F6A.tmp\app\src\main\java\Banks\CSoundBank.java:196: error: cannot find symbol
    								fd = MMFRuntime.inst.getSoundFromAssets(String.format(Locale.US, "s%04d", h));
    								                    ^
      symbol:   method getSoundFromAssets(String)
      location: variable inst of type MMFRuntime
    C:\Users\William\AppData\Local\Temp\And4F6A.tmp\app\src\main\java\Banks\CSoundBank.java:198: error: cannot find symbol
    								fd = MMFRuntime.inst.getSoundFromOBB(String.format(Locale.US, "res/raw/s%04d", h));
    								                    ^
      symbol:   method getSoundFromOBB(String)
      location: variable inst of type MMFRuntime
    C:\Users\William\AppData\Local\Temp\And4F6A.tmp\app\src\main\java\Banks\CSound.java:300: error: cannot find symbol
            if (!MMFRuntime.inst.obbAvailable && !MMFRuntime.inst.assetsAvailable)
                                                                 ^
      symbol:   variable assetsAvailable
      location: variable inst of type MMFRuntime
    C:\Users\William\AppData\Local\Temp\And4F6A.tmp\app\src\main\java\Banks\CSound.java:307: error: cannot find symbol
                if (MMFRuntime.inst.assetsAvailable) {
                                   ^
      symbol:   variable assetsAvailable
      location: variable inst of type MMFRuntime
    C:\Users\William\AppData\Local\Temp\And4F6A.tmp\app\src\main\java\Banks\CSound.java:307: error: illegal parenthesized expression
                if (MMFRuntime.inst.assetsAvailable) {
                   ^
    C:\Users\William\AppData\Local\Temp\And4F6A.tmp\app\src\main\java\Banks\CSound.java:308: error: cannot find symbol
                    fd = MMFRuntime.inst.getSoundFromAssets(String.format(Locale.US, "s%04d", h));
                                        ^
      symbol:   method getSoundFromAssets(String)
      location: variable inst of type MMFRuntime
    C:\Users\William\AppData\Local\Temp\And4F6A.tmp\app\src\main\java\Banks\CSound.java:311: error: cannot find symbol
                    fd = MMFRuntime.inst.getSoundFromOBB(String.format(Locale.US, "res/raw/s%04d", h));
                                        ^
      symbol:   method getSoundFromOBB(String)
      location: variable inst of type MMFRuntime
    C:\Users\William\AppData\Local\Temp\And4F6A.tmp\app\src\main\java\Runtime\MMFRuntime.java:1307: error: no suitable method found for requestPermissionsIfNecessaryForResult(MMFRuntime,String[],PermissionsResultAction)
    		PermissionsHelper.getInstance().requestPermissionsIfNecessaryForResult(this, permissions, action);
    		                               ^
        method PermissionsHelper.requestPermissionsIfNecessaryForResult(Activity,int,String[],PermissionsResultAction) is not applicable
          (actual and formal argument lists differ in length)
        method PermissionsHelper.requestPermissionsIfNecessaryForResult(Fragment,int,String[],PermissionsResultAction) is not applicable
          (actual and formal argument lists differ in length)
    C:\Users\William\AppData\Local\Temp\And4F6A.tmp\app\src\main\java\Runtime\MMFRuntime.java:1921: error: no suitable method found for requestPermissionsIfNecessaryForResult(MMFRuntime,String[],<anonymous PermissionsResultAction>)
    		PermissionsHelper.getInstance().requestPermissionsIfNecessaryForResult(this,
    		                               ^
        method PermissionsHelper.requestPermissionsIfNecessaryForResult(Activity,int,String[],PermissionsResultAction) is not applicable
          (actual and formal argument lists differ in length)
        method PermissionsHelper.requestPermissionsIfNecessaryForResult(Fragment,int,String[],PermissionsResultAction) is not applicable
          (actual and formal argument lists differ in length)
    Note: Some input files use or override a deprecated API.
    Note: Recompile with -Xlint:deprecation for details.
    Note: Some input files use unchecked or unsafe operations.
    Note: Recompile with -Xlint:unchecked for details.
    20 errors
    
    > Task :app:compileReleaseJavaWithJavac FAILED
    
    FAILURE: Build failed with an exception.
    
    * What went wrong:
    Execution failed for task ':app:compileReleaseJavaWithJavac'.
    > Compilation failed; see the compiler error output for details.
    
    * Try:
    Run with --stacktrace option to get the stack trace. Run with --info or --debug option to get more log output. Run with --scan to get full insights.
    
    * Get more help at https://help.gradle.org
    
    BUILD FAILED in 8s
    30 actionable tasks: 30 executed
    I don't really understand the issue, am i missing something? Thank you.

  2. #2
    Forum Moderator Fusion 2.5 MacFusion 2.5 DeveloperAndroid Export ModuleHTML5 Export ModuleiOS Export Module
    Fusion 2.5 (Steam)Fusion 2.5 Developer (Steam)Fusion 2.5+ DLC (Steam)Android Export Module (Steam)HTML5 Export Module (Steam)iOS Export Module (Steam)Universal Windows Platform Export Module (Steam)Firefly 3D Module (Steam)
    NaitorStudios's Avatar
    Join Date
    May 2010
    Location
    Brazil
    Posts
    1,125
    Mentioned
    9 Post(s)
    Tagged
    0 Thread(s)
    What extensions are you using? What Build API?

  3. #3
    Clicker

    Fusion 2.5 MacFusion 2.5 DeveloperFusion 2.5+ DLCAndroid Export ModuleHTML5 Export ModuleiOS Export ModuleSWF Export ModuleUnicode Add-onInstall Creator Pro
    StingRay's Avatar
    Join Date
    Nov 2006
    Location
    Austria
    Posts
    1,083
    Mentioned
    7 Post(s)
    Tagged
    0 Thread(s)
    Seems like bluewing make problems regarding the log?

  4. #4
    Clicker Fusion 2.5 DeveloperFusion 2.5+ DLCAndroid Export ModuleHTML5 Export ModuleiOS Export ModuleUniversal Windows Platform Export ModuleXNA Export Module
    Dobermann's Avatar
    Join Date
    Feb 2009
    Location
    France
    Posts
    973
    Mentioned
    38 Post(s)
    Tagged
    0 Thread(s)
    I have another app with no bluewing, and i have the exact same issue.
    It seems to happens only in the apps where i use GPG objects. But i have updated it from click store like 10 times and it made no change.

    This is the list of extensions i use:
    extensions.png

    Also, i've set min version to 5, target version to 11 and API 30.

  5. #5
    Clicker Fusion 2.5 DeveloperFusion 2.5+ DLCAndroid Export ModuleHTML5 Export ModuleiOS Export ModuleUniversal Windows Platform Export ModuleXNA Export Module
    Dobermann's Avatar
    Join Date
    Feb 2009
    Location
    France
    Posts
    973
    Mentioned
    38 Post(s)
    Tagged
    0 Thread(s)
    I confirm that the issues comes from GPG objects. If i delete them i can build APK/AAB files. But i can update it as many time as i want, it doesn't solve the issue. Last version i installe is GPGObjects_V200e_AndroidX_20210709

  6. #6
    Clickteam Clickteam

    Join Date
    Jun 2006
    Location
    France
    Posts
    14,384
    Mentioned
    279 Post(s)
    Tagged
    3 Thread(s)
    Last version i installe is GPGObjects_V200e_AndroidX_20210709
    You need to install the version for the build 293.7 or above as explained in the release notes. Don't you see this version in Clickstore? EDIT: filename = GPGObjects_V200f_AndroidX_ForBuild293.7orAbove_211 022.exe

  7. #7
    Clicker Fusion 2.5 DeveloperFusion 2.5+ DLCAndroid Export ModuleHTML5 Export ModuleiOS Export ModuleUniversal Windows Platform Export ModuleXNA Export Module
    Dobermann's Avatar
    Join Date
    Feb 2009
    Location
    France
    Posts
    973
    Mentioned
    38 Post(s)
    Tagged
    0 Thread(s)
    No the 200f isn't in my list, i have received the email about it, but all i have is 200c that downloads the 200e version... xD

  8. #8
    Clicker Fusion 2.5 DeveloperFusion 2.5+ DLCAndroid Export ModuleHTML5 Export ModuleiOS Export ModuleUniversal Windows Platform Export ModuleXNA Export Module
    Dobermann's Avatar
    Join Date
    Feb 2009
    Location
    France
    Posts
    973
    Mentioned
    38 Post(s)
    Tagged
    0 Thread(s)
    Ok, so i'm just missing update 200f that isn't available in my downloads, even if i got the mail, all i can download is the version 200e and that's why it doesn't work. Now, i need to wait for someone to fix my downloads page/account.

  9. #9
    Clickteam Clickteam

    Join Date
    Jun 2006
    Location
    France
    Posts
    14,384
    Mentioned
    279 Post(s)
    Tagged
    3 Thread(s)
    Weird, I'll ask Simon...

  10. #10
    Clicker Fusion 2.5 DeveloperFusion 2.5+ DLCAndroid Export ModuleHTML5 Export ModuleiOS Export ModuleUniversal Windows Platform Export ModuleXNA Export Module
    Dobermann's Avatar
    Join Date
    Feb 2009
    Location
    France
    Posts
    973
    Mentioned
    38 Post(s)
    Tagged
    0 Thread(s)
    That's all i get, last version available for GPG Objects in my list is 200c:

    Sans titre.jpg

Page 1 of 2 1 2 LastLast

Similar Threads

  1. Replies: 0
    Last Post: 16th October 2020, 11:39 PM
  2. Fusion 2.5 - Build 280.28
    By Yves in forum Fusion 2.5
    Replies: 24
    Last Post: 24th December 2013, 02:47 PM
  3. Cannot Build MFA File
    By drnebula in forum Multimedia Fusion 2 - Technical Support
    Replies: 9
    Last Post: 19th February 2007, 07:03 PM

Posting Permissions

  • You may not post new threads
  • You may not post replies
  • You may not post attachments
  • You may not edit your posts
  •