User Tag List

Page 2 of 3 FirstFirst 1 2 3 LastLast
Results 11 to 20 of 21

Thread: Build 293.1 Android Build failed with an exception.

  1. #11
    Clicker Fusion 2.5 DeveloperAndroid Export Module

    Join Date
    Jan 2021
    Posts
    15
    Mentioned
    0 Post(s)
    Tagged
    0 Thread(s)
    thank you NaitorStudios,
    i tried any name also with the proper format (com.mycompany.test), but it didn't work.
    also about the API, how do i know what is the latest? i mean how do i know what version is the right one?

  2. #12
    Forum Moderator Fusion 2.5 MacFusion 2.5 DeveloperAndroid Export ModuleHTML5 Export ModuleiOS Export Module
    Fusion 2.5 (Steam)Fusion 2.5 Developer (Steam)Fusion 2.5+ DLC (Steam)Android Export Module (Steam)HTML5 Export Module (Steam)iOS Export Module (Steam)Universal Windows Platform Export Module (Steam)Firefly 3D Module (Steam)
    NaitorStudios's Avatar
    Join Date
    May 2010
    Location
    Brazil
    Posts
    835
    Mentioned
    9 Post(s)
    Tagged
    0 Thread(s)
    Try setting Fusion to API 30, even if you have API 31 installed... BTW, what API have you installed?

  3. #13
    Clicker Fusion 2.5 DeveloperAndroid Export Module

    Join Date
    Jan 2021
    Posts
    15
    Mentioned
    0 Post(s)
    Tagged
    0 Thread(s)
    the API is the SDK numbers in the android studio ?
    if so i installed 28,29,31.

  4. #14
    Clicker Fusion 2.5 DeveloperAndroid Export Module

    Join Date
    Jan 2021
    Posts
    15
    Mentioned
    0 Post(s)
    Tagged
    0 Thread(s)
    still same error with the API to 30

    FAILURE: Build failed with an exception.
    * What went wrong:
    Could not determine the dependencies of task ':app:compileDebugJavaWithJavac'.
    > Trailing char < > at index 44: C:\Users\pikiwin10\AppData\Local\Android\Sdk \package.xml
    * Try:
    Run with --stacktrace option to get the stack trace. Run with --info or --debug option to get more log output. Run with --scan to get full insights.
    * Get more help at https://help.gradle.org
    BUILD FAILED in 857ms

  5. #15
    Clicker Fusion 2.5 DeveloperAndroid Export Module

    Join Date
    Jan 2021
    Posts
    15
    Mentioned
    0 Post(s)
    Tagged
    0 Thread(s)
    and i even reinstall the app and reinstall the exporter, updated to the latest beta, but still..no apk build with that error.

  6. #16
    Forum Moderator Fusion 2.5 MacFusion 2.5 DeveloperAndroid Export ModuleHTML5 Export ModuleiOS Export Module
    Fusion 2.5 (Steam)Fusion 2.5 Developer (Steam)Fusion 2.5+ DLC (Steam)Android Export Module (Steam)HTML5 Export Module (Steam)iOS Export Module (Steam)Universal Windows Platform Export Module (Steam)Firefly 3D Module (Steam)
    NaitorStudios's Avatar
    Join Date
    May 2010
    Location
    Brazil
    Posts
    835
    Mentioned
    9 Post(s)
    Tagged
    0 Thread(s)
    What is your system language? Cause it could be something with certain characters...
    If possible try changing your system language to English, there was a user that couldn't build because of this

  7. #17
    Clicker Fusion 2.5 DeveloperAndroid Export Module

    Join Date
    Jan 2021
    Posts
    15
    Mentioned
    0 Post(s)
    Tagged
    0 Thread(s)
    by system you mean my pc operating system or the fusion ?

  8. #18
    Clicker Fusion 2.5 DeveloperAndroid Export Module

    Join Date
    Jan 2021
    Posts
    15
    Mentioned
    0 Post(s)
    Tagged
    0 Thread(s)
    both the windows and the fusion are english.

  9. #19
    Clicker Fusion 2.5 DeveloperAndroid Export Module

    Join Date
    Jan 2021
    Posts
    15
    Mentioned
    0 Post(s)
    Tagged
    0 Thread(s)
    Ok, finally i have got some good new's
    i started to think about installing the fusion on second computer and see if it works, and to use it only for builds, a bit annoying, but at least something that i can work with in the mean time, but i wanted to try one last thing before this, and that thing was to reinstall Android Studio, and guess what?
    it worked
    fusion developer now build apk files like charm.

    i can't thank you enough, for your help and support guys, i appreciate every second of your time and effort.
    be safe and see you in the next issue LOL

  10. #20
    Clickteam Clickteam
    Fernando's Avatar
    Join Date
    Dec 2006
    Posts
    7,179
    Mentioned
    298 Post(s)
    Tagged
    4 Thread(s)
    You need to post the full error.log file for me to check, and also, please post your preferences (an image will be ok, and must important does your username in windows

    and please send me your mfa that is making this error (a simple one, not your whole project)
    Regards,


    Fernando Vivolo

    ... new things are coming ...

Page 2 of 3 FirstFirst 1 2 3 LastLast

Similar Threads

  1. FAILURE: Build failed with an exception.
    By Mystr in forum Android Export Module 2.5
    Replies: 4
    Last Post: 29th September 2020, 05:34 PM
  2. Failed to build Android .apk
    By mrknd94 in forum Android Export Module 2.5
    Replies: 4
    Last Post: 21st July 2020, 02:17 PM
  3. Build failed with an exception.
    By VoyVivika in forum Android Export Module 2.5
    Replies: 3
    Last Post: 9th November 2019, 01:20 AM
  4. Build failed Android
    By Melubnio in forum Android Export Module 2.5
    Replies: 2
    Last Post: 17th October 2016, 05:32 PM

Posting Permissions

  • You may not post new threads
  • You may not post replies
  • You may not post attachments
  • You may not edit your posts
  •