User Tag List

Page 1 of 2 1 2 LastLast
Results 1 to 10 of 15

Thread: Export Error Android

  1. #1
    Clicker

    Fusion 2.5 DeveloperFusion 2.5+ DLCAndroid Export Module

    Join Date
    Dec 2013
    Posts
    115
    Mentioned
    0 Post(s)
    Tagged
    0 Thread(s)

    Export Error Android

    I try to export an android application but they give me an error. I post the error file, glad if someone can help me, thanks


    FAILURE: Build failed with an exception.

    * Where:
    Settings file 'C:\Users\Ciacio\AppData\Local\Temp\AndC613.tmp\se ttings.gradle'

    * What went wrong:
    Could not compile settings file 'C:\Users\Ciacio\AppData\Local\Temp\AndC613.tmp\se ttings.gradle'.
    > startup failed:
    General error during conversion: Unsupported class file major version 61

    java.lang.IllegalArgumentException: Unsupported class file major version 61
    at groovyjarjarasm.asm.ClassReader.<init>(ClassReader .java:189)
    at groovyjarjarasm.asm.ClassReader.<init>(ClassReader .java:170)
    at groovyjarjarasm.asm.ClassReader.<init>(ClassReader .java:156)
    at groovyjarjarasm.asm.ClassReader.<init>(ClassReader .java:277)
    at org.codehaus.groovy.ast.decompiled.AsmDecompiler.p arseClass(AsmDecompiler.java:81)
    at org.codehaus.groovy.control.ClassNodeResolver.find Decompiled(ClassNodeResolver.java:251)
    at org.codehaus.groovy.control.ClassNodeResolver.tryA sLoaderClassOrScript(ClassNodeResolver.java:189)
    at org.codehaus.groovy.control.ClassNodeResolver.find ClassNode(ClassNodeResolver.java:169)
    at org.codehaus.groovy.control.ClassNodeResolver.reso lveName(ClassNodeResolver.java:125)
    at org.codehaus.groovy.ast.decompiled.AsmReferenceRes olver.resolveClassNullable(AsmReferenceResolver.ja va:57)
    at org.codehaus.groovy.ast.decompiled.AsmReferenceRes olver.resolveClass(AsmReferenceResolver.java:44)
    at org.codehaus.groovy.ast.decompiled.AsmReferenceRes olver.resolveNonArrayType(AsmReferenceResolver.jav a:79)
    at org.codehaus.groovy.ast.decompiled.AsmReferenceRes olver.resolveType(AsmReferenceResolver.java:70)
    at org.codehaus.groovy.ast.decompiled.MemberSignature Parser.createMethodNode(MemberSignatureParser.java :57)
    at org.codehaus.groovy.ast.decompiled.DecompiledClass Node.lambda$createMethodNode$1(DecompiledClassNode .java:230)
    at org.codehaus.groovy.ast.decompiled.DecompiledClass Node.createMethodNode(DecompiledClassNode.java:236 )
    at org.codehaus.groovy.ast.decompiled.DecompiledClass Node.lazyInitMembers(DecompiledClassNode.java:203)
    at org.codehaus.groovy.ast.decompiled.DecompiledClass Node.getDeclaredMethods(DecompiledClassNode.java:1 22)
    at org.codehaus.groovy.ast.ClassNode.tryFindPossibleM ethod(ClassNode.java:1283)
    at org.codehaus.groovy.control.StaticImportVisitor.tr ansformMethodCallExpression(StaticImportVisitor.ja va:251)
    at org.codehaus.groovy.control.StaticImportVisitor.tr ansform(StaticImportVisitor.java:133)
    at org.codehaus.groovy.ast.ClassCodeExpressionTransfo rmer.visitExpressionStatement(ClassCodeExpressionT ransformer.java:108)
    at org.codehaus.groovy.ast.stmt.ExpressionStatement.v isit(ExpressionStatement.java:40)
    at org.codehaus.groovy.ast.ClassCodeVisitorSupport.vi sitClassCodeContainer(ClassCodeVisitorSupport.java :138)
    at org.codehaus.groovy.ast.ClassCodeVisitorSupport.vi sitConstructorOrMethod(ClassCodeVisitorSupport.jav a:111)
    at org.codehaus.groovy.ast.ClassCodeExpressionTransfo rmer.visitConstructorOrMethod(ClassCodeExpressionT ransformer.java:66)
    at org.codehaus.groovy.control.StaticImportVisitor.vi sitConstructorOrMethod(StaticImportVisitor.java:10 8)
    at org.codehaus.groovy.ast.ClassCodeVisitorSupport.vi sitConstructor(ClassCodeVisitorSupport.java:101)
    at org.codehaus.groovy.ast.ClassNode.visitContents(Cl assNode.java:1089)
    at org.codehaus.groovy.ast.ClassCodeVisitorSupport.vi sitClass(ClassCodeVisitorSupport.java:52)
    at org.codehaus.groovy.control.CompilationUnit.lambda $addPhaseOperations$3(CompilationUnit.java:209)
    at org.codehaus.groovy.control.CompilationUnit$IPrima ryClassNodeOperation.doPhaseOperation(CompilationU nit.java:942)
    at org.codehaus.groovy.control.CompilationUnit.proces sPhaseOperations(CompilationUnit.java:671)
    at org.codehaus.groovy.control.CompilationUnit.compil e(CompilationUnit.java:635)
    at groovy.lang.GroovyClassLoader.doParseClass(GroovyC lassLoader.java:389)
    at groovy.lang.GroovyClassLoader.lambda$parseClass$3( GroovyClassLoader.java:332)
    at org.codehaus.groovy.runtime.memoize.StampedCommonC ache.compute(StampedCommonCache.java:163)
    at org.codehaus.groovy.runtime.memoize.StampedCommonC ache.getAndPut(StampedCommonCache.java:154)
    at groovy.lang.GroovyClassLoader.parseClass(GroovyCla ssLoader.java:330)
    at org.gradle.groovy.scripts.internal.DefaultScriptCo mpilationHandler.compileScript(DefaultScriptCompil ationHandler.java:139)
    at org.gradle.groovy.scripts.internal.DefaultScriptCo mpilationHandler.compileToDir(DefaultScriptCompila tionHandler.java:95)
    at org.gradle.groovy.scripts.internal.BuildOperationB ackedScriptCompilationHandler$2.run(BuildOperation BackedScriptCompilationHandler.java:54)
    at org.gradle.internal.operations.DefaultBuildOperati onRunner$1.execute(DefaultBuildOperationRunner.jav a:29)
    at org.gradle.internal.operations.DefaultBuildOperati onRunner$1.execute(DefaultBuildOperationRunner.jav a:26)
    at org.gradle.internal.operations.DefaultBuildOperati onRunner$3.execute(DefaultBuildOperationRunner.jav a:75)
    at org.gradle.internal.operations.DefaultBuildOperati onRunner$3.execute(DefaultBuildOperationRunner.jav a:68)
    at org.gradle.internal.operations.DefaultBuildOperati onRunner.execute(DefaultBuildOperationRunner.java: 153)
    at org.gradle.internal.operations.DefaultBuildOperati onRunner.execute(DefaultBuildOperationRunner.java: 68)
    at org.gradle.internal.operations.DefaultBuildOperati onRunner.run(DefaultBuildOperationRunner.java:56)
    at org.gradle.internal.operations.DefaultBuildOperati onExecutor.lambda$run$1(DefaultBuildOperationExecu tor.java:71)
    at org.gradle.internal.operations.UnmanagedBuildOpera tionWrapper.runWithUnmanagedSupport(UnmanagedBuild OperationWrapper.java:45)
    at org.gradle.internal.operations.DefaultBuildOperati onExecutor.run(DefaultBuildOperationExecutor.java: 71)
    at org.gradle.groovy.scripts.internal.BuildOperationB ackedScriptCompilationHandler.compileToDir(BuildOp erationBackedScriptCompilationHandler.java:51)
    at org.gradle.groovy.scripts.internal.FileCacheBacked ScriptClassCompiler$CompileToCrossBuildCacheAction .execute(FileCacheBackedScriptClassCompiler.java:1 90)
    at org.gradle.groovy.scripts.internal.FileCacheBacked ScriptClassCompiler$CompileToCrossBuildCacheAction .execute(FileCacheBackedScriptClassCompiler.java:1 70)
    at org.gradle.groovy.scripts.internal.FileCacheBacked ScriptClassCompiler$ProgressReportingInitializer.e xecute(FileCacheBackedScriptClassCompiler.java:211 )
    at org.gradle.groovy.scripts.internal.FileCacheBacked ScriptClassCompiler$ProgressReportingInitializer.e xecute(FileCacheBackedScriptClassCompiler.java:194 )
    at org.gradle.cache.internal.DefaultPersistentDirecto ryCache$Initializer.initialize(DefaultPersistentDi rectoryCache.java:100)
    at org.gradle.cache.internal.FixedSharedModeCrossProc essCacheAccess$1.run(FixedSharedModeCrossProcessCa cheAccess.java:86)
    at org.gradle.cache.internal.DefaultFileLockManager$D efaultFileLock.doWriteAction(DefaultFileLockManage r.java:216)
    at org.gradle.cache.internal.DefaultFileLockManager$D efaultFileLock.writeFile(DefaultFileLockManager.ja va:206)
    at org.gradle.cache.internal.FixedSharedModeCrossProc essCacheAccess.open(FixedSharedModeCrossProcessCac heAccess.java:83)
    at org.gradle.cache.internal.DefaultCacheAccess.open( DefaultCacheAccess.java:139)
    at org.gradle.cache.internal.DefaultPersistentDirecto ryStore.open(DefaultPersistentDirectoryStore.java: 89)
    at org.gradle.cache.internal.DefaultPersistentDirecto ryStore.open(DefaultPersistentDirectoryStore.java: 43)
    at org.gradle.cache.internal.DefaultCacheFactory.doOp en(DefaultCacheFactory.java:103)
    at org.gradle.cache.internal.DefaultCacheFactory.open (DefaultCacheFactory.java:68)
    at org.gradle.cache.internal.DefaultCacheRepository$P ersistentCacheBuilder.open(DefaultCacheRepository. java:126)
    at org.gradle.groovy.scripts.internal.FileCacheBacked ScriptClassCompiler.compile(FileCacheBackedScriptC lassCompiler.java:116)
    at org.gradle.groovy.scripts.internal.CrossBuildInMem oryCachingScriptClassCache.getOrCompile(CrossBuild InMemoryCachingScriptClassCache.java:50)
    at org.gradle.groovy.scripts.internal.BuildScopeInMem oryCachingScriptClassCompiler.compile(BuildScopeIn MemoryCachingScriptClassCompiler.java:50)
    at org.gradle.groovy.scripts.DefaultScriptCompilerFac tory$ScriptCompilerImpl.compile(DefaultScriptCompi lerFactory.java:49)
    at org.gradle.configuration.DefaultScriptPluginFactor y$ScriptPluginImpl.apply(DefaultScriptPluginFactor y.java:125)
    at org.gradle.configuration.BuildOperationScriptPlugi n$1.run(BuildOperationScriptPlugin.java:65)
    at org.gradle.internal.operations.DefaultBuildOperati onRunner$1.execute(DefaultBuildOperationRunner.jav a:29)
    at org.gradle.internal.operations.DefaultBuildOperati onRunner$1.execute(DefaultBuildOperationRunner.jav a:26)
    at org.gradle.internal.operations.DefaultBuildOperati onRunner$3.execute(DefaultBuildOperationRunner.jav a:75)
    at org.gradle.internal.operations.DefaultBuildOperati onRunner$3.execute(DefaultBuildOperationRunner.jav a:68)
    at org.gradle.internal.operations.DefaultBuildOperati onRunner.execute(DefaultBuildOperationRunner.java: 153)
    at org.gradle.internal.operations.DefaultBuildOperati onRunner.execute(DefaultBuildOperationRunner.java: 68)
    at org.gradle.internal.operations.DefaultBuildOperati onRunner.run(DefaultBuildOperationRunner.java:56)
    at org.gradle.internal.operations.DefaultBuildOperati onExecutor.lambda$run$1(DefaultBuildOperationExecu tor.java:71)
    at org.gradle.internal.operations.UnmanagedBuildOpera tionWrapper.runWithUnmanagedSupport(UnmanagedBuild OperationWrapper.java:45)
    at org.gradle.internal.operations.DefaultBuildOperati onExecutor.run(DefaultBuildOperationExecutor.java: 71)
    at org.gradle.configuration.BuildOperationScriptPlugi n.lambda$apply$0(BuildOperationScriptPlugin.java:6 2)
    at org.gradle.configuration.internal.DefaultUserCodeA pplicationContext.apply(DefaultUserCodeApplication Context.java:43)
    at org.gradle.configuration.BuildOperationScriptPlugi n.apply(BuildOperationScriptPlugin.java:62)
    at org.gradle.initialization.ScriptEvaluatingSettings Processor.applySettingsScript(ScriptEvaluatingSett ingsProcessor.java:74)
    at org.gradle.initialization.ScriptEvaluatingSettings Processor.process(ScriptEvaluatingSettingsProcesso r.java:67)
    at org.gradle.initialization.SettingsEvaluatedCallbac kFiringSettingsProcessor.process(SettingsEvaluated CallbackFiringSettingsProcessor.java:34)
    at org.gradle.initialization.RootBuildCacheController SettingsProcessor.process(RootBuildCacheController SettingsProcessor.java:47)
    at org.gradle.initialization.BuildOperationSettingsPr ocessor$2.call(BuildOperationSettingsProcessor.jav a:50)
    at org.gradle.initialization.BuildOperationSettingsPr ocessor$2.call(BuildOperationSettingsProcessor.jav a:47)
    at org.gradle.internal.operations.DefaultBuildOperati onRunner$CallableBuildOperationWorker.execute(Defa ultBuildOperationRunner.java:200)
    at org.gradle.internal.operations.DefaultBuildOperati onRunner$CallableBuildOperationWorker.execute(Defa ultBuildOperationRunner.java:195)
    at org.gradle.internal.operations.DefaultBuildOperati onRunner$3.execute(DefaultBuildOperationRunner.jav a:75)
    at org.gradle.internal.operations.DefaultBuildOperati onRunner$3.execute(DefaultBuildOperationRunner.jav a:68)
    at org.gradle.internal.operations.DefaultBuildOperati onRunner.execute(DefaultBuildOperationRunner.java: 153)
    at org.gradle.internal.operations.DefaultBuildOperati onRunner.execute(DefaultBuildOperationRunner.java: 68)
    at org.gradle.internal.operations.DefaultBuildOperati onRunner.call(DefaultBuildOperationRunner.java:62)
    at org.gradle.internal.operations.DefaultBuildOperati onExecutor.lambda$call$2(DefaultBuildOperationExec utor.java:76)
    at org.gradle.internal.operations.UnmanagedBuildOpera tionWrapper.callWithUnmanagedSupport(UnmanagedBuil dOperationWrapper.java:54)
    at org.gradle.internal.operations.DefaultBuildOperati onExecutor.call(DefaultBuildOperationExecutor.java :76)
    at org.gradle.initialization.BuildOperationSettingsPr ocessor.process(BuildOperationSettingsProcessor.ja va:47)
    at org.gradle.initialization.DefaultSettingsLoader.fi ndSettingsAndLoadIfAppropriate(DefaultSettingsLoad er.java:122)
    at org.gradle.initialization.DefaultSettingsLoader.fi ndAndLoadSettings(DefaultSettingsLoader.java:58)
    at org.gradle.initialization.SettingsAttachingSetting sLoader.findAndLoadSettings(SettingsAttachingSetti ngsLoader.java:35)
    at org.gradle.internal.composite.CommandLineIncludedB uildSettingsLoader.findAndLoadSettings(CommandLine IncludedBuildSettingsLoader.java:34)
    at org.gradle.internal.composite.ChildBuildRegisterin gSettingsLoader.findAndLoadSettings(ChildBuildRegi steringSettingsLoader.java:50)
    at org.gradle.internal.composite.CompositeBuildSettin gsLoader.findAndLoadSettings(CompositeBuildSetting sLoader.java:35)
    at org.gradle.initialization.DefaultSettingsPreparer. prepareSettings(DefaultSettingsPreparer.java:36)
    at org.gradle.initialization.BuildOperationFiringSett ingsPreparer$LoadBuild.doLoadBuild(BuildOperationF iringSettingsPreparer.java:62)
    at org.gradle.initialization.BuildOperationFiringSett ingsPreparer$LoadBuild.run(BuildOperationFiringSet tingsPreparer.java:57)
    at org.gradle.internal.operations.DefaultBuildOperati onRunner$1.execute(DefaultBuildOperationRunner.jav a:29)
    at org.gradle.internal.operations.DefaultBuildOperati onRunner$1.execute(DefaultBuildOperationRunner.jav a:26)
    at org.gradle.internal.operations.DefaultBuildOperati onRunner$3.execute(DefaultBuildOperationRunner.jav a:75)
    at org.gradle.internal.operations.DefaultBuildOperati onRunner$3.execute(DefaultBuildOperationRunner.jav a:68)
    at org.gradle.internal.operations.DefaultBuildOperati onRunner.execute(DefaultBuildOperationRunner.java: 153)
    at org.gradle.internal.operations.DefaultBuildOperati onRunner.execute(DefaultBuildOperationRunner.java: 68)
    at org.gradle.internal.operations.DefaultBuildOperati onRunner.run(DefaultBuildOperationRunner.java:56)
    at org.gradle.internal.operations.DefaultBuildOperati onExecutor.lambda$run$1(DefaultBuildOperationExecu tor.java:71)
    at org.gradle.internal.operations.UnmanagedBuildOpera tionWrapper.runWithUnmanagedSupport(UnmanagedBuild OperationWrapper.java:45)
    at org.gradle.internal.operations.DefaultBuildOperati onExecutor.run(DefaultBuildOperationExecutor.java: 71)
    at org.gradle.initialization.BuildOperationFiringSett ingsPreparer.prepareSettings(BuildOperationFiringS ettingsPreparer.java:45)
    at org.gradle.initialization.DefaultGradleLauncher.pr epareSettings(DefaultGradleLauncher.java:219)
    at org.gradle.initialization.DefaultGradleLauncher.do ClassicBuildStages(DefaultGradleLauncher.java:160)
    at org.gradle.initialization.DefaultGradleLauncher.do BuildStages(DefaultGradleLauncher.java:149)
    at org.gradle.initialization.DefaultGradleLauncher.ex ecuteTasks(DefaultGradleLauncher.java:125)
    at org.gradle.internal.invocation.GradleBuildControll er$1.create(GradleBuildController.java:71)
    at org.gradle.internal.work.DefaultWorkerLeaseService .withLocks(DefaultWorkerLeaseService.java:213)
    at org.gradle.internal.invocation.GradleBuildControll er.doBuild(GradleBuildController.java:67)
    at org.gradle.internal.invocation.GradleBuildControll er.run(GradleBuildController.java:56)
    at org.gradle.tooling.internal.provider.ExecuteBuildA ctionRunner.run(ExecuteBuildActionRunner.java:31)
    at org.gradle.launcher.exec.ChainingBuildActionRunner .run(ChainingBuildActionRunner.java:35)
    at org.gradle.launcher.exec.BuildOutcomeReportingBuil dActionRunner.run(BuildOutcomeReportingBuildAction Runner.java:66)
    at org.gradle.tooling.internal.provider.ValidatingBui ldActionRunner.run(ValidatingBuildActionRunner.jav a:32)
    at org.gradle.tooling.internal.provider.FileSystemWat chingBuildActionRunner.run(FileSystemWatchingBuild ActionRunner.java:90)
    at org.gradle.launcher.exec.BuildCompletionNotifyingB uildActionRunner.run(BuildCompletionNotifyingBuild ActionRunner.java:41)
    at org.gradle.launcher.exec.RunAsBuildOperationBuildA ctionRunner$3.call(RunAsBuildOperationBuildActionR unner.java:49)
    at org.gradle.launcher.exec.RunAsBuildOperationBuildA ctionRunner$3.call(RunAsBuildOperationBuildActionR unner.java:44)
    at org.gradle.internal.operations.DefaultBuildOperati onRunner$CallableBuildOperationWorker.execute(Defa ultBuildOperationRunner.java:200)
    at org.gradle.internal.operations.DefaultBuildOperati onRunner$CallableBuildOperationWorker.execute(Defa ultBuildOperationRunner.java:195)
    at org.gradle.internal.operations.DefaultBuildOperati onRunner$3.execute(DefaultBuildOperationRunner.jav a:75)
    at org.gradle.internal.operations.DefaultBuildOperati onRunner$3.execute(DefaultBuildOperationRunner.jav a:68)
    at org.gradle.internal.operations.DefaultBuildOperati onRunner.execute(DefaultBuildOperationRunner.java: 153)
    at org.gradle.internal.operations.DefaultBuildOperati onRunner.execute(DefaultBuildOperationRunner.java: 68)
    at org.gradle.internal.operations.DefaultBuildOperati onRunner.call(DefaultBuildOperationRunner.java:62)
    at org.gradle.internal.operations.DefaultBuildOperati onExecutor.lambda$call$2(DefaultBuildOperationExec utor.java:76)
    at org.gradle.internal.operations.UnmanagedBuildOpera tionWrapper.callWithUnmanagedSupport(UnmanagedBuil dOperationWrapper.java:54)
    at org.gradle.internal.operations.DefaultBuildOperati onExecutor.call(DefaultBuildOperationExecutor.java :76)
    at org.gradle.launcher.exec.RunAsBuildOperationBuildA ctionRunner.run(RunAsBuildOperationBuildActionRunn er.java:44)
    at org.gradle.launcher.exec.InProcessBuildActionExecu ter.lambda$execute$0(InProcessBuildActionExecuter. java:59)
    at org.gradle.composite.internal.DefaultRootBuildStat e.run(DefaultRootBuildState.java:86)
    at org.gradle.launcher.exec.InProcessBuildActionExecu ter.execute(InProcessBuildActionExecuter.java:58)
    at org.gradle.launcher.exec.InProcessBuildActionExecu ter.execute(InProcessBuildActionExecuter.java:30)
    at org.gradle.launcher.exec.BuildTreeScopeLifecycleBu ildActionExecuter.lambda$execute$0(BuildTreeScopeL ifecycleBuildActionExecuter.java:34)
    at org.gradle.internal.buildtree.BuildTreeState.run(B uildTreeState.java:53)
    at org.gradle.launcher.exec.BuildTreeScopeLifecycleBu ildActionExecuter.execute(BuildTreeScopeLifecycleB uildActionExecuter.java:33)
    at org.gradle.launcher.exec.BuildTreeScopeLifecycleBu ildActionExecuter.execute(BuildTreeScopeLifecycleB uildActionExecuter.java:28)
    at org.gradle.tooling.internal.provider.ContinuousBui ldActionExecuter.execute(ContinuousBuildActionExec uter.java:104)
    at org.gradle.tooling.internal.provider.ContinuousBui ldActionExecuter.execute(ContinuousBuildActionExec uter.java:55)
    at org.gradle.tooling.internal.provider.SubscribableB uildActionExecuter.execute(SubscribableBuildAction Executer.java:64)
    at org.gradle.tooling.internal.provider.SubscribableB uildActionExecuter.execute(SubscribableBuildAction Executer.java:37)
    at org.gradle.tooling.internal.provider.SessionScopeL ifecycleBuildActionExecuter.lambda$execute$0(Sessi onScopeLifecycleBuildActionExecuter.java:54)
    at org.gradle.internal.session.BuildSessionState.run( BuildSessionState.java:67)
    at org.gradle.tooling.internal.provider.SessionScopeL ifecycleBuildActionExecuter.execute(SessionScopeLi fecycleBuildActionExecuter.java:50)
    at org.gradle.tooling.internal.provider.SessionScopeL ifecycleBuildActionExecuter.execute(SessionScopeLi fecycleBuildActionExecuter.java:36)
    at org.gradle.tooling.internal.provider.GradleThreadB uildActionExecuter.execute(GradleThreadBuildAction Executer.java:36)
    at org.gradle.tooling.internal.provider.GradleThreadB uildActionExecuter.execute(GradleThreadBuildAction Executer.java:25)
    at org.gradle.tooling.internal.provider.StartParamsVa lidatingActionExecuter.execute(StartParamsValidati ngActionExecuter.java:59)
    at org.gradle.tooling.internal.provider.StartParamsVa lidatingActionExecuter.execute(StartParamsValidati ngActionExecuter.java:31)
    at org.gradle.tooling.internal.provider.SessionFailur eReportingActionExecuter.execute(SessionFailureRep ortingActionExecuter.java:58)
    at org.gradle.tooling.internal.provider.SessionFailur eReportingActionExecuter.execute(SessionFailureRep ortingActionExecuter.java:42)
    at org.gradle.tooling.internal.provider.SetupLoggingA ctionExecuter.execute(SetupLoggingActionExecuter.j ava:47)
    at org.gradle.tooling.internal.provider.SetupLoggingA ctionExecuter.execute(SetupLoggingActionExecuter.j ava:31)
    at org.gradle.launcher.daemon.server.exec.ExecuteBuil d.doBuild(ExecuteBuild.java:65)
    at org.gradle.launcher.daemon.server.exec.BuildComman dOnly.execute(BuildCommandOnly.java:37)
    at org.gradle.launcher.daemon.server.api.DaemonComman dExecution.proceed(DaemonCommandExecution.java:104 )
    at org.gradle.launcher.daemon.server.exec.WatchForDis connection.execute(WatchForDisconnection.java:39)
    at org.gradle.launcher.daemon.server.api.DaemonComman dExecution.proceed(DaemonCommandExecution.java:104 )
    at org.gradle.launcher.daemon.server.exec.ResetDeprec ationLogger.execute(ResetDeprecationLogger.java:29 )
    at org.gradle.launcher.daemon.server.api.DaemonComman dExecution.proceed(DaemonCommandExecution.java:104 )
    at org.gradle.launcher.daemon.server.exec.RequestStop IfSingleUsedDaemon.execute(RequestStopIfSingleUsed Daemon.java:35)
    at org.gradle.launcher.daemon.server.api.DaemonComman dExecution.proceed(DaemonCommandExecution.java:104 )
    at org.gradle.launcher.daemon.server.exec.ForwardClie ntInput$2.create(ForwardClientInput.java:78)
    at org.gradle.launcher.daemon.server.exec.ForwardClie ntInput$2.create(ForwardClientInput.java:75)
    at org.gradle.util.Swapper.swap(Swapper.java:38)
    at org.gradle.launcher.daemon.server.exec.ForwardClie ntInput.execute(ForwardClientInput.java:75)
    at org.gradle.launcher.daemon.server.api.DaemonComman dExecution.proceed(DaemonCommandExecution.java:104 )
    at org.gradle.launcher.daemon.server.exec.LogAndCheck Health.execute(LogAndCheckHealth.java:55)
    at org.gradle.launcher.daemon.server.api.DaemonComman dExecution.proceed(DaemonCommandExecution.java:104 )
    at org.gradle.launcher.daemon.server.exec.LogToClient .doBuild(LogToClient.java:63)
    at org.gradle.launcher.daemon.server.exec.BuildComman dOnly.execute(BuildCommandOnly.java:37)
    at org.gradle.launcher.daemon.server.api.DaemonComman dExecution.proceed(DaemonCommandExecution.java:104 )
    at org.gradle.launcher.daemon.server.exec.EstablishBu ildEnvironment.doBuild(EstablishBuildEnvironment.j ava:84)
    at org.gradle.launcher.daemon.server.exec.BuildComman dOnly.execute(BuildCommandOnly.java:37)
    at org.gradle.launcher.daemon.server.api.DaemonComman dExecution.proceed(DaemonCommandExecution.java:104 )
    at org.gradle.launcher.daemon.server.exec.StartBuildO rRespondWithBusy$1.run(StartBuildOrRespondWithBusy .java:52)
    at org.gradle.launcher.daemon.server.DaemonStateCoord inator$1.run(DaemonStateCoordinator.java:297)
    at org.gradle.internal.concurrent.ExecutorPolicy$Catc hAndRecordFailures.onExecute(ExecutorPolicy.java:6 4)
    at org.gradle.internal.concurrent.ManagedExecutorImpl $1.run(ManagedExecutorImpl.java:48)
    at java.base/java.util.concurrent.ThreadPoolExecutor.runWorker( ThreadPoolExecutor.java:1136)
    at java.base/java.util.concurrent.ThreadPoolExecutor$Worker.run (ThreadPoolExecutor.java:635)
    at org.gradle.internal.concurrent.ThreadFactoryImpl$M anagedThreadRunnable.run(ThreadFactoryImpl.java:56 )
    at java.base/java.lang.Thread.run(Thread.java:833)

    1 error


    * Try:
    Run with --stacktrace option to get the stack trace. Run with --info or --debug option to get more log output. Run with --scan to get full insights.

    * Get more help at https://help.gradle.org

    BUILD FAILED in 4s

  2. #2
    Clickteam Clickteam
    Fernando's Avatar
    Join Date
    Dec 2006
    Posts
    7,295
    Mentioned
    298 Post(s)
    Tagged
    4 Thread(s)
    can you explain what java SDK are you using?

    did you install android studio or just the command line tools?

    this error indicate that you have installed a version non 1.8

    General error during conversion: Unsupported class file major version 61
    Regards,


    Fernando Vivolo

    ... new things are coming ...

  3. #3
    Clicker

    Fusion 2.5 DeveloperFusion 2.5+ DLCAndroid Export Module

    Join Date
    Dec 2013
    Posts
    115
    Mentioned
    0 Post(s)
    Tagged
    0 Thread(s)
    i use java 1.7 and the latest android studio. Now i try with a tip i found in discord.
    Anyway really thanks for the very quick answer Fernando!

  4. #4
    Clicker

    Fusion 2.5 DeveloperFusion 2.5+ DLCAndroid Export Module

    Join Date
    Dec 2013
    Posts
    115
    Mentioned
    0 Post(s)
    Tagged
    0 Thread(s)
    I solve the problem on discord! Thank's again

  5. #5
    Clicker Fusion 2.5 MacFusion 2.5 DeveloperFusion 2.5 DeveloperAndroid Export ModuleHTML5 Export ModuleiOS Export ModuleMac Export ModuleUniversal Windows Platform Export ModuleSWF Export ModuleXNA Export Module
    Fusion 2.5 (Steam)Fusion 2.5 Developer (Steam)Android Export Module (Steam)HTML5 Export Module (Steam)iOS Export Module (Steam)Universal Windows Platform Export Module (Steam)
    Baggins69's Avatar
    Join Date
    Aug 2012
    Location
    Brisbane, Australia
    Posts
    64
    Mentioned
    0 Post(s)
    Tagged
    0 Thread(s)
    Quote Originally Posted by ciaciosacchetti View Post
    I solve the problem on discord! Thank's again
    Hi ciaciosacchetti,

    Do you mind outlining how the issue was resolved? So other with the same issue or similar can also resolve the issue, or a link to the discord discussion would also help.

    Many thanks,

  6. #6
    Forum Moderator Fusion 2.5 MacFusion 2.5 DeveloperAndroid Export ModuleHTML5 Export ModuleiOS Export Module
    Fusion 2.5 (Steam)Fusion 2.5 Developer (Steam)Fusion 2.5+ DLC (Steam)Android Export Module (Steam)HTML5 Export Module (Steam)iOS Export Module (Steam)Universal Windows Platform Export Module (Steam)Firefly 3D Module (Steam)
    NaitorStudios's Avatar
    Join Date
    May 2010
    Location
    Brazil
    Posts
    1,123
    Mentioned
    9 Post(s)
    Tagged
    0 Thread(s)
    @Baggins69 on ClickConverse discord server, just go to Android channel and check my pinned messages.

  7. #7
    Clicker Fusion 2.5 DeveloperAndroid Export ModuleHTML5 Export Module
    foyzul2002's Avatar
    Join Date
    Nov 2011
    Location
    London, UK
    Posts
    111
    Mentioned
    0 Post(s)
    Tagged
    0 Thread(s)
    @NaitorStudios do you have a new link? the discord link has expired

  8. #8
    Clicker The Games Factory 2

    Join Date
    May 2014
    Posts
    23
    Mentioned
    0 Post(s)
    Tagged
    0 Thread(s)
    I have the same problem, and i checked the discord channel and i can't find anything, anyone here can help us and explain how to solve the problem ?

  9. #9
    Forum Moderator Fusion 2.5 MacFusion 2.5 DeveloperAndroid Export ModuleHTML5 Export ModuleiOS Export Module
    Fusion 2.5 (Steam)Fusion 2.5 Developer (Steam)Fusion 2.5+ DLC (Steam)Android Export Module (Steam)HTML5 Export Module (Steam)iOS Export Module (Steam)Universal Windows Platform Export Module (Steam)Firefly 3D Module (Steam)
    NaitorStudios's Avatar
    Join Date
    May 2010
    Location
    Brazil
    Posts
    1,123
    Mentioned
    9 Post(s)
    Tagged
    0 Thread(s)
    @upnavig on the official discord server, after you verify your products, you'll have access to the Android channel, there you can find the pinned messages with all the instructions to get the latest Fusion / Android exporter working.
    On desktop it's a pin icon on the top of the window, close to the name and description of the channel, on mobile you have to drag from the right corner to display the user list, just above it there will be a pin icon.

  10. #10
    Clicker The Games Factory 2

    Join Date
    May 2014
    Posts
    23
    Mentioned
    0 Post(s)
    Tagged
    0 Thread(s)
    I tried but it doesn't work. I followed the instructions on discord, bot displayed i would gain access to new forum sub directory, but there is nothing new. I don't know what to do, it only displays i have The games factory 2... but I also have Fusion 2.5 Developper Steam version with Android, iOS and HTML5 exporters...

Page 1 of 2 1 2 LastLast

Similar Threads

  1. Export To Android Error
    By Microline_Games in forum Fusion 2.5
    Replies: 7
    Last Post: 22nd October 2016, 12:22 PM
  2. Error to export on Android (APK)
    By salih in forum Android Export Module 2.5
    Replies: 20
    Last Post: 2nd October 2016, 12:14 AM
  3. error on android export
    By chubbybarbarian in forum Android Export Module 2.5
    Replies: 1
    Last Post: 2nd September 2016, 02:11 PM
  4. Android SDK Export error
    By alienayyy in forum Android Export Module 2.5
    Replies: 3
    Last Post: 19th October 2015, 08:38 PM

Posting Permissions

  • You may not post new threads
  • You may not post replies
  • You may not post attachments
  • You may not edit your posts
  •