User Tag List

Page 2 of 2 FirstFirst 1 2
Results 11 to 14 of 14

Thread: WebView2 BUILD FAILED when build apk

  1. #11
    Clickteam Clickteam
    Fernando's Avatar
    Join Date
    Dec 2006
    Posts
    7,370
    Mentioned
    298 Post(s)
    Tagged
    4 Thread(s)
    Problem is not the object or runtime, seems something off with java SDK version

    An exception has occurred in the compiler (1.8.0_341). Please file a bug against the Java compiler via the Java bug reporting page (http://bugreport.java.com) after checking the Bug Database (http://bugs.java.com) for duplicates. Include your program and the following diagnostic in your report. Thank you.

    java.lang.AssertionError: annotationType(): unrecognized Attribute name MODULE (class com.sun.tools.javac.util.UnsharedNameTable$NameImp l)


    Can you help me to test something different in your case?

    Reduce to version 332 or 331 (original java from Oracle) or install OpenJDK from here https://www.openlogic.com/openjdk-downloads


    it is becoming now, more than ever that android prefers to use their OpenJDK (the one that comes with android studio) instead of using java from oracle
    Regards,


    Fernando Vivolo

    ... new things are coming ...

  2. #12
    Clicker

    Fusion 2.5 DeveloperFusion 2.5+ DLCAndroid Export ModuleHTML5 Export ModuleiOS Export ModuleMac Export ModuleSWF Export Module
    CapitaineCaverne's Avatar
    Join Date
    Feb 2011
    Location
    Bretigny sur Orge
    Posts
    560
    Mentioned
    5 Post(s)
    Tagged
    0 Thread(s)
    Bonjour
    voici le retour tu test ou lieur d’installé la version 331 j ai décompresse le OPENJDK et change les paramètre dans fusion et fait un test de compilation avec webview2 avec API 32 et Android cible 12 et la compilation c est bien fini en APK ou ABB.
    comme vous le dit il faut que l'on utiliser OpenJDK.
    grand merci Fernando
    Petit question je toi aussi change les propriétés des variables d’environnement JAVA_HOME pour lui donne le nouveau chemin de OpenSDK ?

    Hello
    here is the return you test or linker installed version 331 I unpacked the OPENJDK and changed the parameters in fusion and did a compilation test with webview2 with API 32 and Android target 12 and the compilation is finished in APK or ABB .
    as you said, we must use OpenJDK.
    big thank you fernando
    Little question, can I also change the properties of the JAVA_HOME environment variables to give it the new OpenSDK path?

  3. #13
    Clickteam Clickteam
    Fernando's Avatar
    Join Date
    Dec 2006
    Posts
    7,370
    Mentioned
    298 Post(s)
    Tagged
    4 Thread(s)
    Quote Originally Posted by CapitaineCaverne View Post
    Little question, can I also change the properties of the JAVA_HOME environment variables to give it the new OpenSDK path?
    Not sure, depends on what application is using this path variable here is used by Visual Studio, but not sure who else required this.
    Regards,


    Fernando Vivolo

    ... new things are coming ...

  4. #14
    Clicker

    Fusion 2.5 DeveloperFusion 2.5+ DLCAndroid Export ModuleHTML5 Export ModuleiOS Export ModuleMac Export ModuleSWF Export Module
    CapitaineCaverne's Avatar
    Join Date
    Feb 2011
    Location
    Bretigny sur Orge
    Posts
    560
    Mentioned
    5 Post(s)
    Tagged
    0 Thread(s)
    Merci je fait laisse le chemin du java home sur le jdk1.8.0_341 vus que fusion ne utilise pas.
    Thank you I left the java home path on the jdk1.8.0_341 seen that fusion does not use.

Page 2 of 2 FirstFirst 1 2

Similar Threads

  1. Build 293.1 Android Build failed with an exception.
    By piki in forum Android Export Module 2.5
    Replies: 20
    Last Post: 27th November 2021, 04:17 PM
  2. build failed (sometimes)
    By gagegage926 in forum Android Export Module 2.5
    Replies: 9
    Last Post: 14th August 2014, 08:21 AM
  3. BUILD FAILED
    By gregoire0 in forum Android Export Module Version 2.0
    Replies: 3
    Last Post: 18th April 2013, 04:05 PM
  4. Build failed
    By Farhan in forum Android Export Module Version 2.0
    Replies: 4
    Last Post: 9th April 2013, 06:09 PM
  5. [RC7] BUILD FAILED
    By Pharanygitis in forum Android Export Module Version 2.0
    Replies: 7
    Last Post: 29th March 2013, 01:44 PM

Posting Permissions

  • You may not post new threads
  • You may not post replies
  • You may not post attachments
  • You may not edit your posts
  •