User Tag List

Page 1 of 2 1 2 LastLast
Results 1 to 10 of 12

Thread: 294 Android Build Fail

  1. #1
    Clicker Fusion 2.5 DeveloperAndroid Export ModuleHTML5 Export ModuleiOS Export ModuleMac Export ModuleUniversal Windows Platform Export ModuleSWF Export ModuleInstall Creator Pro
    Fusion 2.5 (Steam)Fusion 2.5 Developer (Steam)Android Export Module (Steam)HTML5 Export Module (Steam)iOS Export Module (Steam)Universal Windows Platform Export Module (Steam)
    Tisnart's Avatar
    Join Date
    Feb 2008
    Location
    On, Canada
    Posts
    1,119
    Mentioned
    3 Post(s)
    Tagged
    0 Thread(s)

    294 Android Build Fail

    Updated to the new build Beta 294.4 and now I can't build Android App

    Starting a Gradle Daemon, 1 incompatible and 1 stopped Daemons could not be reused, use --status for details
    > Task :app:preBuild UP-TO-DATE
    > Task :app:preDebugBuild UP-TO-DATE
    > Task :app:compileDebugAidl NO-SOURCE
    > Task :app:compileDebugRenderscript NO-SOURCE
    > Task :app:generateDebugBuildConfig
    > Task :app:javaPreCompileDebug
    > Task :app:checkDebugAarMetadata
    > Task :app:generateDebugResValues
    > Task :app:generateDebugResources
    > Task :app:createDebugCompatibleScreenManifests
    > Task :app:extractDeepLinksDebug
    > Task :app:mergeDebugResources
    > Task :app:processDebugMainManifest
    > Task :app:processDebugManifest
    > Task :app:mergeDebugNativeDebugMetadata NO-SOURCE
    > Task :app:mergeDebugShaders
    > Task :app:compileDebugShaders NO-SOURCE
    > Task :app:generateDebugAssets UP-TO-DATE
    > Task :app:mergeDebugAssets
    > Task :app:compressDebugAssets
    > Task :app:processDebugJavaRes NO-SOURCE
    > Task :app:checkDebugDuplicateClasses
    > Task :app:mergeDebugJniLibFolders
    > Task :app:processDebugManifestForPackage
    > Task :app:validateSigningDebug
    > Task :app:writeDebugAppMetadata
    > Task :app:writeDebugSigningConfigVersions
    > Task :app:mergeDebugJavaResource
    > Task :app:mergeDebugNativeLibs


    > Task :app:stripDebugDebugSymbols
    Unable to strip the following libraries, packaging them as they are: libES1Renderer.so, libES2Renderer.so, libES3Renderer.so, libRuntimeNative.so, libgdx.so.


    > Task :app:desugarDebugFileDependencies
    > Task :app:processDebugResources
    > Task :app:mergeExtDexDebug


    > Task :app:compileDebugJavaWithJavac
    C:\Users\Gerald\AppData\Local\Temp\AndD836.tmp\app \src\main\java\com\clickteam\special\CTSignInClien t.java:165: error: cannot find symbol
    public boolean isConnected() { return mGoogleSignInClient.getInstanceId() != 0;}
    ^
    symbol: method getInstanceId()
    location: variable mGoogleSignInClient of type GoogleSignInClient
    C:\Users\Gerald\AppData\Local\Temp\AndD836.tmp\app \src\main\java\Extensions\CRunGPGLeaderboard.java: 541: error: cannot find symbol
    int collection = (flgColl == 0 ? LeaderboardVariant.COLLECTION_PUBLIC: LeaderboardVariant.COLLECTION_SOCIAL);
    ^
    symbol: variable COLLECTION_SOCIAL
    location: interface LeaderboardVariant
    C:\Users\Gerald\AppData\Local\Temp\AndD836.tmp\app \src\main\java\Extensions\CRunGPGLeaderboard.java: 597: error: cannot find symbol
    int collection = (flgColl == 0 ? LeaderboardVariant.COLLECTION_PUBLIC: LeaderboardVariant.COLLECTION_SOCIAL);
    ^
    symbol: variable COLLECTION_SOCIAL
    location: interface LeaderboardVariant
    C:\Users\Gerald\AppData\Local\Temp\AndD836.tmp\app \src\main\java\Extensions\CRunGPGLeaderboard.java: 774: error: cannot find symbol
    int collection = (flgColl == 0 ? LeaderboardVariant.COLLECTION_PUBLIC: LeaderboardVariant.COLLECTION_SOCIAL);
    ^
    symbol: variable COLLECTION_SOCIAL
    location: interface LeaderboardVariant
    Note: Some input files use or override a deprecated API.
    Note: Recompile with -Xlint:deprecation for details.
    Note: Some input files use unchecked or unsafe operations.
    Note: Recompile with -Xlint:unchecked for details.
    4 errors


    > Task :app:compileDebugJavaWithJavac FAILED


    FAILURE: Build failed with an exception.


    * What went wrong:
    Execution failed for task ':app:compileDebugJavaWithJavac'.
    > Compilation failed; see the compiler error output for details.


    * Try:
    Run with --stacktrace option to get the stack trace. Run with --info or --debug option to get more log output. Run with --scan to get full insights.


    * Get more help at https://help.gradle.org


    BUILD FAILED in 24s
    25 actionable tasks: 25 executed

  2. #2
    Clicker Fusion 2.5 DeveloperFusion 2.5+ DLCAndroid Export ModuleHTML5 Export ModuleiOS Export ModuleUniversal Windows Platform Export ModuleXNA Export Module
    Dobermann's Avatar
    Join Date
    Feb 2009
    Location
    France
    Posts
    1,050
    Mentioned
    38 Post(s)
    Tagged
    0 Thread(s)
    You need to install GPG Object V200G. Check your downloads in the clickstore: https://clickstore.clickteam.com/index.php?route=account/download

  3. #3
    Clicker Fusion 2.5 DeveloperAndroid Export ModuleHTML5 Export ModuleiOS Export ModuleMac Export ModuleUniversal Windows Platform Export ModuleSWF Export ModuleInstall Creator Pro
    Fusion 2.5 (Steam)Fusion 2.5 Developer (Steam)Android Export Module (Steam)HTML5 Export Module (Steam)iOS Export Module (Steam)Universal Windows Platform Export Module (Steam)
    Tisnart's Avatar
    Join Date
    Feb 2008
    Location
    On, Canada
    Posts
    1,119
    Mentioned
    3 Post(s)
    Tagged
    0 Thread(s)
    Quote Originally Posted by Dobermann View Post
    You need to install GPG Object V200G. Check your downloads in the clickstore: https://clickstore.clickteam.com/index.php?route=account/download
    Thanks, That has done the trick.
    Much appreciated!

  4. #4
    Clicker Fusion 2.5 MacFusion 2.5 DeveloperFusion 2.5 DeveloperAndroid Export ModuleHTML5 Export ModuleiOS Export ModuleMac Export ModuleUniversal Windows Platform Export ModuleSWF Export ModuleXNA Export Module
    Fusion 2.5 (Steam)Fusion 2.5 Developer (Steam)Android Export Module (Steam)HTML5 Export Module (Steam)iOS Export Module (Steam)Universal Windows Platform Export Module (Steam)
    Baggins69's Avatar
    Join Date
    Aug 2012
    Location
    Brisbane, Australia
    Posts
    66
    Mentioned
    0 Post(s)
    Tagged
    0 Thread(s)
    Hi Dobermann,

    I'm having the very same problem as Tisnart.
    I've looked in clickstore downloads and cannot find anything that mentions GPG object V200G.

    Is there another location to download?

  5. #5
    Clicker

    Fusion 2.5 DeveloperFusion 2.5+ DLCAndroid Export ModuleHTML5 Export ModuleiOS Export ModuleMac Export ModuleSWF Export Module
    CapitaineCaverne's Avatar
    Join Date
    Feb 2011
    Location
    Bretigny sur Orge
    Posts
    564
    Mentioned
    5 Post(s)
    Tagged
    0 Thread(s)
    Bonjour oui il et disponible dans le clickstore dans la session Account Downloads.
    Hello yes it is available in the clickstore in the Account Downloads session.

  6. #6
    Clicker Fusion 2.5 DeveloperFusion 2.5+ DLCAndroid Export ModuleHTML5 Export ModuleiOS Export ModuleUniversal Windows Platform Export ModuleXNA Export Module
    Dobermann's Avatar
    Join Date
    Feb 2009
    Location
    France
    Posts
    1,050
    Mentioned
    38 Post(s)
    Tagged
    0 Thread(s)
    Quote Originally Posted by Baggins69 View Post
    Hi Dobermann,

    I'm having the very same problem as Tisnart.
    I've looked in clickstore downloads and cannot find anything that mentions GPG object V200G.

    Is there another location to download?
    Got the same issue at first, you have to contact clickteam if the update isn't availabel in your downloads.

  7. #7
    Clicker Fusion 2.5 DeveloperFusion 2.5+ DLCAndroid Export Module
    Tiny's Avatar
    Join Date
    Jul 2006
    Location
    Sweden
    Posts
    623
    Mentioned
    0 Post(s)
    Tagged
    0 Thread(s)
    Am having same issue and it doesn't show on my download section in clickstore.

    Clickteam seem to be hard to reach now a days so where exactly is the "Contact us" button so I can ask for the GPG Object V200G to be available?

  8. #8
    Clicker Fusion 2.5 DeveloperFusion 2.5+ DLCAndroid Export Module
    Janette5's Avatar
    Join Date
    Dec 2014
    Location
    Western Cape, SA
    Posts
    1,209
    Mentioned
    199 Post(s)
    Tagged
    0 Thread(s)
    Quote Originally Posted by Tiny View Post
    Am having same issue and it doesn't show on my download section in clickstore.

    Clickteam seem to be hard to reach now a days so where exactly is the "Contact us" button so I can ask for the GPG Object V200G to be available?
    Yes - they create many barriers between them and customers:

    https://service.clickteam.com/open.php?topicId=14&subtopicId=8

  9. #9
    Clicker Fusion 2.5 DeveloperFusion 2.5+ DLCAndroid Export Module
    Tiny's Avatar
    Join Date
    Jul 2006
    Location
    Sweden
    Posts
    623
    Mentioned
    0 Post(s)
    Tagged
    0 Thread(s)
    Quote Originally Posted by Janette5 View Post
    Yes - they create many barriers between them and customers:

    https://service.clickteam.com/open.php?topicId=14&subtopicId=8
    Thank you Janette.

    If this GPG object V200G is necessary for Fusion to be able to build my app shouldn't it be part of/built in to Fusion instead of all this extra hassle or am I just not getting it (which absolutely can be the case)? Just a thought.

  10. #10
    Clicker Fusion 2.5 DeveloperFusion 2.5+ DLCAndroid Export Module
    Janette5's Avatar
    Join Date
    Dec 2014
    Location
    Western Cape, SA
    Posts
    1,209
    Mentioned
    199 Post(s)
    Tagged
    0 Thread(s)
    Quote Originally Posted by Tiny View Post
    Thank you Janette.

    If this GPG object V200G is necessary for Fusion to be able to build my app shouldn't it be part of/built in to Fusion instead of all this extra hassle or am I just not getting it (which absolutely can be the case)? Just a thought.
    You don't need it unless you use certain features (I've never used it - but that's because my games with in-app are not written in Fusion).

Page 1 of 2 1 2 LastLast

Similar Threads

  1. Build 293.9 Android Build fail
    By Dobermann in forum Android Export Module 2.5
    Replies: 5
    Last Post: 5th November 2021, 03:09 PM
  2. Android Exporter Build Fail - app:compileReleaseJavaWithJavac?
    By cdhexter in forum Android Export Module 2.5
    Replies: 2
    Last Post: 16th September 2021, 02:41 PM
  3. Many extensions fail to build - is there a solution?
    By CrazyFrezi in forum Android Export Module 2.5
    Replies: 7
    Last Post: 10th September 2021, 04:21 PM
  4. Android "build.xml" compile fail with the lacewing object
    By Naturium in forum Android Export Module 2.5
    Replies: 2
    Last Post: 12th January 2018, 11:11 PM
  5. Android Exporter Build Fail
    By FinalSpecimen in forum Android Export Module 2.5
    Replies: 14
    Last Post: 29th April 2016, 03:10 AM

Posting Permissions

  • You may not post new threads
  • You may not post replies
  • You may not post attachments
  • You may not edit your posts
  •