User Tag List

Results 1 to 4 of 4

Thread: Can't compile app with android 31, but works fine with android 30

  1. #1
    Clicker Fusion 2.5 (Steam)Fusion 2.5 Developer (Steam)Android Export Module (Steam)iOS Export Module (Steam)

    Join Date
    May 2014
    Posts
    247
    Mentioned
    6 Post(s)
    Tagged
    0 Thread(s)

    Can't compile app with android 31, but works fine with android 30

    I tried exporting with both versions 293.10 and 294.7 of Clickteam Fusion. On both I can compile with build 30 by targeting android 11, but if I try to compile with build 31, targeting android 12 the compiler crashes.

    I only just downloaded android 12 from android studio and I updated my jdk with the latest version from the Liberica java JDK. I also updated the GPG object to its latest version of 200G. Does anyone know what this error log might mean?

    Starting a Gradle Daemon, 1 incompatible Daemon could not be reused, use --status for details
    Warning: Mapping new ns http://schemas.android.com/repository/android/common/02 to old ns http://schemas.android.com/repository/android/common/01
    Warning: Mapping new ns http://schemas.android.com/repositor...oid/generic/02 to old ns http://schemas.android.com/repositor...oid/generic/01
    Warning: Mapping new ns http://schemas.android.com/sdk/android/repo/addon2/02 to old ns http://schemas.android.com/sdk/android/repo/addon2/01
    Warning: Mapping new ns http://schemas.android.com/sdk/andro...repository2/02 to old ns http://schemas.android.com/sdk/andro...repository2/01
    Warning: Mapping new ns http://schemas.android.com/sdk/android/repo/sys-img2/02 to old ns http://schemas.android.com/sdk/android/repo/sys-img2/01
    > Task :app:preBuild UP-TO-DATE
    > Task :app:preReleaseBuild UP-TO-DATE
    > Task :app:compileReleaseAidl NO-SOURCE
    > Task :app:compileReleaseRenderscript NO-SOURCE
    > Task :app:generateReleaseBuildConfig
    > Task :app:javaPreCompileRelease
    > Task :app:writeReleaseApplicationId
    > Task :app:analyticsRecordingRelease
    > Task :app:generateReleaseResValues
    > Task :app:generateReleaseResources
    > Task :app:checkReleaseAarMetadata
    > Task :app:createReleaseCompatibleScreenManifests
    > Task :app:extractDeepLinksRelease
    > Task :app:processReleaseMainManifest
    > Task :app:processReleaseManifest
    > Task :app:mergeReleaseJniLibFolders
    > Task :app:mergeReleaseResources
    > Task :app:mergeReleaseShaders
    > Task :app:compileReleaseShaders NO-SOURCE
    > Task :app:generateReleaseAssets UP-TO-DATE
    > Task :app:mergeReleaseAssets
    > Task :app:compressReleaseAssets
    > Task :app:checkReleaseDuplicateClasses
    > Task :app:processReleaseJavaRes NO-SOURCE
    > Task :app:collectReleaseDependencies
    > Task :app:sdkReleaseDependencyData
    > Task :app:validateSigningRelease
    > Task :app:writeReleaseAppMetadata
    > Task :app:writeReleaseSigningConfigVersions
    > Task :app:desugarReleaseFileDependencies
    > Task :app:mergeReleaseNativeLibs
    > Task :app:mergeReleaseJavaResource
    > Task :app:processReleaseManifestForPackage

    > Task :app:stripReleaseDebugSymbols
    Unable to strip the following libraries, packaging them as they are: libES1Renderer.so, libES2Renderer.so, libES3Renderer.so, libRuntimeNative.so, libgdx.so.

    > Task :app:extractReleaseNativeSymbolTables
    Unable to extract native debug metadata from C:\Users\nemee\AppData\Local\Temp\And15BE.tmp\app\ build\intermediates\merged_native_libs\release\out \lib\arm64-v8a\libES1Renderer.so because unable to locate the objcopy executable for the arm64-v8a ABI.
    Unable to extract native debug metadata from C:\Users\nemee\AppData\Local\Temp\And15BE.tmp\app\ build\intermediates\merged_native_libs\release\out \lib\arm64-v8a\libES2Renderer.so because unable to locate the objcopy executable for the arm64-v8a ABI.
    Unable to extract native debug metadata from C:\Users\nemee\AppData\Local\Temp\And15BE.tmp\app\ build\intermediates\merged_native_libs\release\out \lib\arm64-v8a\libES3Renderer.so because unable to locate the objcopy executable for the arm64-v8a ABI.
    Unable to extract native debug metadata from C:\Users\nemee\AppData\Local\Temp\And15BE.tmp\app\ build\intermediates\merged_native_libs\release\out \lib\arm64-v8a\libgdx.so because unable to locate the objcopy executable for the arm64-v8a ABI.
    Unable to extract native debug metadata from C:\Users\nemee\AppData\Local\Temp\And15BE.tmp\app\ build\intermediates\merged_native_libs\release\out \lib\arm64-v8a\libRuntimeNative.so because unable to locate the objcopy executable for the arm64-v8a ABI.
    Unable to extract native debug metadata from C:\Users\nemee\AppData\Local\Temp\And15BE.tmp\app\ build\intermediates\merged_native_libs\release\out \lib\armeabi-v7a\libES1Renderer.so because unable to locate the objcopy executable for the armeabi-v7a ABI.
    Unable to extract native debug metadata from C:\Users\nemee\AppData\Local\Temp\And15BE.tmp\app\ build\intermediates\merged_native_libs\release\out \lib\armeabi-v7a\libES2Renderer.so because unable to locate the objcopy executable for the armeabi-v7a ABI.
    Unable to extract native debug metadata from C:\Users\nemee\AppData\Local\Temp\And15BE.tmp\app\ build\intermediates\merged_native_libs\release\out \lib\armeabi-v7a\libES3Renderer.so because unable to locate the objcopy executable for the armeabi-v7a ABI.
    Unable to extract native debug metadata from C:\Users\nemee\AppData\Local\Temp\And15BE.tmp\app\ build\intermediates\merged_native_libs\release\out \lib\armeabi-v7a\libgdx.so because unable to locate the objcopy executable for the armeabi-v7a ABI.
    Unable to extract native debug metadata from C:\Users\nemee\AppData\Local\Temp\And15BE.tmp\app\ build\intermediates\merged_native_libs\release\out \lib\armeabi-v7a\libRuntimeNative.so because unable to locate the objcopy executable for the armeabi-v7a ABI.
    Unable to extract native debug metadata from C:\Users\nemee\AppData\Local\Temp\And15BE.tmp\app\ build\intermediates\merged_native_libs\release\out \lib\x86\libES1Renderer.so because unable to locate the objcopy executable for the x86 ABI.
    Unable to extract native debug metadata from C:\Users\nemee\AppData\Local\Temp\And15BE.tmp\app\ build\intermediates\merged_native_libs\release\out \lib\x86\libES2Renderer.so because unable to locate the objcopy executable for the x86 ABI.
    Unable to extract native debug metadata from C:\Users\nemee\AppData\Local\Temp\And15BE.tmp\app\ build\intermediates\merged_native_libs\release\out \lib\x86\libES3Renderer.so because unable to locate the objcopy executable for the x86 ABI.
    Unable to extract native debug metadata from C:\Users\nemee\AppData\Local\Temp\And15BE.tmp\app\ build\intermediates\merged_native_libs\release\out \lib\x86\libgdx.so because unable to locate the objcopy executable for the x86 ABI.
    Unable to extract native debug metadata from C:\Users\nemee\AppData\Local\Temp\And15BE.tmp\app\ build\intermediates\merged_native_libs\release\out \lib\x86\libRuntimeNative.so because unable to locate the objcopy executable for the x86 ABI.
    Unable to extract native debug metadata from C:\Users\nemee\AppData\Local\Temp\And15BE.tmp\app\ build\intermediates\merged_native_libs\release\out \lib\x86_64\libES1Renderer.so because unable to locate the objcopy executable for the x86_64 ABI.
    Unable to extract native debug metadata from C:\Users\nemee\AppData\Local\Temp\And15BE.tmp\app\ build\intermediates\merged_native_libs\release\out \lib\x86_64\libES2Renderer.so because unable to locate the objcopy executable for the x86_64 ABI.
    Unable to extract native debug metadata from C:\Users\nemee\AppData\Local\Temp\And15BE.tmp\app\ build\intermediates\merged_native_libs\release\out \lib\x86_64\libES3Renderer.so because unable to locate the objcopy executable for the x86_64 ABI.
    Unable to extract native debug metadata from C:\Users\nemee\AppData\Local\Temp\And15BE.tmp\app\ build\intermediates\merged_native_libs\release\out \lib\x86_64\libgdx.so because unable to locate the objcopy executable for the x86_64 ABI.
    Unable to extract native debug metadata from C:\Users\nemee\AppData\Local\Temp\And15BE.tmp\app\ build\intermediates\merged_native_libs\release\out \lib\x86_64\libRuntimeNative.so because unable to locate the objcopy executable for the x86_64 ABI.

    > Task :app:mergeReleaseNativeDebugMetadata NO-SOURCE
    > Task :app:processReleaseResources
    > Task :app:mergeExtDexRelease

    > Task :app:compileReleaseJavaWithJavac FAILED
    An exception has occurred in the compiler (1.8.0_345). Please file a bug against the Java compiler via the Java bug reporting page (http://bugreport.java.com) after checking the Bug Database (http://bugs.java.com) for duplicates. Include your program and the following diagnostic in your report. Thank you.
    java.lang.AssertionError: annotationType(): unrecognized Attribute name MODULE (class com.sun.tools.javac.util.UnsharedNameTable$NameImp l)
    at com.sun.tools.javac.util.Assert.error(Assert.java: 133)
    at com.sun.tools.javac.code.TypeAnnotations.annotatio nType(TypeAnnotations.java:231)
    at com.sun.tools.javac.code.TypeAnnotations$TypeAnnot ationPositions.separateAnnotationsKinds(TypeAnnota tions.java:294)
    at com.sun.tools.javac.code.TypeAnnotations$TypeAnnot ationPositions.visitMethodDef(TypeAnnotations.java :1066)
    at com.sun.tools.javac.tree.JCTree$JCMethodDecl.accep t(JCTree.java:778)
    at com.sun.tools.javac.tree.TreeScanner.scan(TreeScan ner.java:49)
    at com.sun.tools.javac.code.TypeAnnotations$TypeAnnot ationPositions.scan(TypeAnnotations.java:275)
    at com.sun.tools.javac.tree.TreeScanner.scan(TreeScan ner.java:57)
    at com.sun.tools.javac.code.TypeAnnotations$TypeAnnot ationPositions.visitClassDef(TypeAnnotations.java: 1042)
    at com.sun.tools.javac.tree.JCTree$JCClassDecl.accept (JCTree.java:693)
    at com.sun.tools.javac.tree.TreeScanner.scan(TreeScan ner.java:49)
    at com.sun.tools.javac.code.TypeAnnotations$TypeAnnot ationPositions.scan(TypeAnnotations.java:275)
    at com.sun.tools.javac.code.TypeAnnotations$1.run(Typ eAnnotations.java:127)
    at com.sun.tools.javac.comp.Annotate.flush(Annotate.j ava:152)
    at com.sun.tools.javac.comp.Annotate.enterDone(Annota te.java:129)
    at com.sun.tools.javac.comp.Enter.complete(Enter.java :512)
    at com.sun.tools.javac.comp.Enter.main(Enter.java:471 )
    at com.sun.tools.javac.main.JavaCompiler.enterTrees(J avaCompiler.java:982)
    at com.sun.tools.javac.main.JavaCompiler.compile(Java Compiler.java:857)
    at com.sun.tools.javac.main.Main.compile(Main.java:52 3)
    at com.sun.tools.javac.api.JavacTaskImpl.doCall(Javac TaskImpl.java:129)
    at com.sun.tools.javac.api.JavacTaskImpl.call(JavacTa skImpl.java:138)
    at org.gradle.internal.compiler.java.IncrementalCompi leTask.call(IncrementalCompileTask.java:74)
    at org.gradle.api.internal.tasks.compile.AnnotationPr ocessingCompileTask.call(AnnotationProcessingCompi leTask.java:94)
    at org.gradle.api.internal.tasks.compile.ResourceClea ningCompilationTask.call(ResourceCleaningCompilati onTask.java:57)
    at org.gradle.api.internal.tasks.compile.JdkJavaCompi ler.execute(JdkJavaCompiler.java:55)
    at org.gradle.api.internal.tasks.compile.JdkJavaCompi ler.execute(JdkJavaCompiler.java:40)
    at org.gradle.api.internal.tasks.compile.NormalizingJ avaCompiler.delegateAndHandleErrors(NormalizingJav aCompiler.java:97)
    at org.gradle.api.internal.tasks.compile.NormalizingJ avaCompiler.execute(NormalizingJavaCompiler.java:5 1)
    at org.gradle.api.internal.tasks.compile.NormalizingJ avaCompiler.execute(NormalizingJavaCompiler.java:3 7)
    at org.gradle.api.internal.tasks.compile.AnnotationPr ocessorDiscoveringCompiler.execute(AnnotationProce ssorDiscoveringCompiler.java:51)
    at org.gradle.api.internal.tasks.compile.AnnotationPr ocessorDiscoveringCompiler.execute(AnnotationProce ssorDiscoveringCompiler.java:37)
    at org.gradle.api.internal.tasks.compile.ModuleApplic ationNameWritingCompiler.execute(ModuleApplication NameWritingCompiler.java:46)
    at org.gradle.api.internal.tasks.compile.ModuleApplic ationNameWritingCompiler.execute(ModuleApplication NameWritingCompiler.java:36)
    at org.gradle.api.internal.tasks.compile.CleaningJava Compiler.execute(CleaningJavaCompiler.java:53)
    at org.gradle.api.internal.tasks.compile.incremental. IncrementalCompilerFactory.lambda$createRebuildAll Compiler$0(IncrementalCompilerFactory.java:98)
    at org.gradle.api.internal.tasks.compile.incremental. IncrementalResultStoringCompiler.execute(Increment alResultStoringCompiler.java:61)
    at org.gradle.api.internal.tasks.compile.incremental. IncrementalResultStoringCompiler.execute(Increment alResultStoringCompiler.java:45)
    at org.gradle.api.internal.tasks.compile.CompileJavaB uildOperationReportingCompiler$2.call(CompileJavaB uildOperationReportingCompiler.java:59)
    at org.gradle.api.internal.tasks.compile.CompileJavaB uildOperationReportingCompiler$2.call(CompileJavaB uildOperationReportingCompiler.java:51)
    at org.gradle.internal.operations.DefaultBuildOperati onRunner$CallableBuildOperationWorker.execute(Defa ultBuildOperationRunner.java:200)
    at org.gradle.internal.operations.DefaultBuildOperati onRunner$CallableBuildOperationWorker.execute(Defa ultBuildOperationRunner.java:195)
    at org.gradle.internal.operations.DefaultBuildOperati onRunner$3.execute(DefaultBuildOperationRunner.jav a:75)
    at org.gradle.internal.operations.DefaultBuildOperati onRunner$3.execute(DefaultBuildOperationRunner.jav a:68)
    at org.gradle.internal.operations.DefaultBuildOperati onRunner.execute(DefaultBuildOperationRunner.java: 153)
    at org.gradle.internal.operations.DefaultBuildOperati onRunner.execute(DefaultBuildOperationRunner.java: 68)
    at org.gradle.internal.operations.DefaultBuildOperati onRunner.call(DefaultBuildOperationRunner.java:62)
    at org.gradle.internal.operations.DefaultBuildOperati onExecutor.lambda$call$2(DefaultBuildOperationExec utor.java:76)
    at org.gradle.internal.operations.UnmanagedBuildOpera tionWrapper.callWithUnmanagedSupport(UnmanagedBuil dOperationWrapper.java:54)
    at org.gradle.internal.operations.DefaultBuildOperati onExecutor.call(DefaultBuildOperationExecutor.java :76)
    at org.gradle.api.internal.tasks.compile.CompileJavaB uildOperationReportingCompiler.execute(CompileJava BuildOperationReportingCompiler.java:51)
    at org.gradle.api.tasks.compile.JavaCompile.performCo mpilation(JavaCompile.java:343)
    at org.gradle.api.tasks.compile.JavaCompile.performIn crementalCompilation(JavaCompile.java:237)
    at org.gradle.api.tasks.compile.JavaCompile.compile(J avaCompile.java:209)
    at sun.reflect.NativeMethodAccessorImpl.invoke0(Nativ e Method)
    at sun.reflect.NativeMethodAccessorImpl.invoke(Native MethodAccessorImpl.java:62)
    at sun.reflect.DelegatingMethodAccessorImpl.invoke(De legatingMethodAccessorImpl.java:43)
    at java.lang.reflect.Method.invoke(Method.java:498)
    at org.gradle.internal.reflect.JavaMethod.invoke(Java Method.java:104)
    at org.gradle.api.internal.project.taskfactory.Increm entalInputsTaskAction.doExecute(IncrementalInputsT askAction.java:32)
    at org.gradle.api.internal.project.taskfactory.Standa rdTaskAction.execute(StandardTaskAction.java:51)
    at org.gradle.api.internal.project.taskfactory.Abstra ctIncrementalTaskAction.execute(AbstractIncrementa lTaskAction.java:25)
    at org.gradle.api.internal.project.taskfactory.Standa rdTaskAction.execute(StandardTaskAction.java:29)
    at org.gradle.api.internal.tasks.execution.ExecuteAct ionsTaskExecuter$3.run(ExecuteActionsTaskExecuter. java:555)
    at org.gradle.internal.operations.DefaultBuildOperati onRunner$1.execute(DefaultBuildOperationRunner.jav a:29)
    at org.gradle.internal.operations.DefaultBuildOperati onRunner$1.execute(DefaultBuildOperationRunner.jav a:26)
    at org.gradle.internal.operations.DefaultBuildOperati onRunner$3.execute(DefaultBuildOperationRunner.jav a:75)
    at org.gradle.internal.operations.DefaultBuildOperati onRunner$3.execute(DefaultBuildOperationRunner.jav a:68)
    at org.gradle.internal.operations.DefaultBuildOperati onRunner.execute(DefaultBuildOperationRunner.java: 153)
    at org.gradle.internal.operations.DefaultBuildOperati onRunner.execute(DefaultBuildOperationRunner.java: 68)
    at org.gradle.internal.operations.DefaultBuildOperati onRunner.run(DefaultBuildOperationRunner.java:56)
    at org.gradle.internal.operations.DefaultBuildOperati onExecutor.lambda$run$1(DefaultBuildOperationExecu tor.java:71)
    at org.gradle.internal.operations.UnmanagedBuildOpera tionWrapper.runWithUnmanagedSupport(UnmanagedBuild OperationWrapper.java:45)
    at org.gradle.internal.operations.DefaultBuildOperati onExecutor.run(DefaultBuildOperationExecutor.java: 71)
    at org.gradle.api.internal.tasks.execution.ExecuteAct ionsTaskExecuter.executeAction(ExecuteActionsTaskE xecuter.java:540)
    at org.gradle.api.internal.tasks.execution.ExecuteAct ionsTaskExecuter.executeActions(ExecuteActionsTask Executer.java:523)
    at org.gradle.api.internal.tasks.execution.ExecuteAct ionsTaskExecuter.access$300(ExecuteActionsTaskExec uter.java:108)
    at org.gradle.api.internal.tasks.execution.ExecuteAct ionsTaskExecuter$TaskExecution.executeWithPrevious OutputFiles(ExecuteActionsTaskExecuter.java:271)
    at org.gradle.api.internal.tasks.execution.ExecuteAct ionsTaskExecuter$TaskExecution.execute(ExecuteActi onsTaskExecuter.java:260)
    at org.gradle.internal.execution.steps.ExecuteStep.la mbda$execute$0(ExecuteStep.java:33)
    at java.util.Optional.map(Optional.java:215)
    at org.gradle.internal.execution.steps.ExecuteStep.ex ecute(ExecuteStep.java:33)
    at org.gradle.internal.execution.steps.ExecuteStep.ex ecute(ExecuteStep.java:26)
    at org.gradle.internal.execution.steps.CleanupOutputs Step.execute(CleanupOutputsStep.java:67)
    at org.gradle.internal.execution.steps.CleanupOutputs Step.execute(CleanupOutputsStep.java:36)
    at org.gradle.internal.execution.steps.ResolveInputCh angesStep.execute(ResolveInputChangesStep.java:49)
    at org.gradle.internal.execution.steps.ResolveInputCh angesStep.execute(ResolveInputChangesStep.java:34)
    at org.gradle.internal.execution.steps.CancelExecutio nStep.execute(CancelExecutionStep.java:43)
    at org.gradle.internal.execution.steps.TimeoutStep.ex ecuteWithoutTimeout(TimeoutStep.java:73)
    at org.gradle.internal.execution.steps.TimeoutStep.ex ecute(TimeoutStep.java:54)
    at org.gradle.internal.execution.steps.CreateOutputsS tep.execute(CreateOutputsStep.java:44)
    at org.gradle.internal.execution.steps.SnapshotOutput sStep.execute(SnapshotOutputsStep.java:54)
    at org.gradle.internal.execution.steps.SnapshotOutput sStep.execute(SnapshotOutputsStep.java:38)
    at org.gradle.internal.execution.steps.BroadcastChang ingOutputsStep.execute(BroadcastChangingOutputsSte p.java:42)
    at org.gradle.internal.execution.steps.CacheStep.exec uteWithoutCache(CacheStep.java:159)
    at org.gradle.internal.execution.steps.CacheStep.exec ute(CacheStep.java:72)
    at org.gradle.internal.execution.steps.CacheStep.exec ute(CacheStep.java:43)
    at org.gradle.internal.execution.steps.StoreExecution StateStep.execute(StoreExecutionStateStep.java:44)
    at org.gradle.internal.execution.steps.StoreExecution StateStep.execute(StoreExecutionStateStep.java:33)
    at org.gradle.internal.execution.steps.RecordOutputsS tep.execute(RecordOutputsStep.java:38)
    at org.gradle.internal.execution.steps.RecordOutputsS tep.execute(RecordOutputsStep.java:24)
    at org.gradle.internal.execution.steps.SkipUpToDateSt ep.executeBecause(SkipUpToDateStep.java:92)
    at org.gradle.internal.execution.steps.SkipUpToDateSt ep.lambda$execute$0(SkipUpToDateStep.java:85)
    at java.util.Optional.map(Optional.java:215)
    at org.gradle.internal.execution.steps.SkipUpToDateSt ep.execute(SkipUpToDateStep.java:55)
    at org.gradle.internal.execution.steps.SkipUpToDateSt ep.execute(SkipUpToDateStep.java:39)
    at org.gradle.internal.execution.steps.ResolveChanges Step.execute(ResolveChangesStep.java:76)
    at org.gradle.internal.execution.steps.ResolveChanges Step.execute(ResolveChangesStep.java:37)
    at org.gradle.internal.execution.steps.legacy.MarkSna pshottingInputsFinishedStep.execute(MarkSnapshotti ngInputsFinishedStep.java:36)
    at org.gradle.internal.execution.steps.legacy.MarkSna pshottingInputsFinishedStep.execute(MarkSnapshotti ngInputsFinishedStep.java:26)
    at org.gradle.internal.execution.steps.ResolveCaching StateStep.execute(ResolveCachingStateStep.java:94)
    at org.gradle.internal.execution.steps.ResolveCaching StateStep.execute(ResolveCachingStateStep.java:49)
    at org.gradle.internal.execution.steps.CaptureStateBe foreExecutionStep.execute(CaptureStateBeforeExecut ionStep.java:79)
    at org.gradle.internal.execution.steps.CaptureStateBe foreExecutionStep.execute(CaptureStateBeforeExecut ionStep.java:53)
    at org.gradle.internal.execution.steps.ValidateStep.e xecute(ValidateStep.java:74)
    at org.gradle.internal.execution.steps.SkipEmptyWorkS tep.lambda$execute$2(SkipEmptyWorkStep.java:78)
    at java.util.Optional.orElseGet(Optional.java:267)
    at org.gradle.internal.execution.steps.SkipEmptyWorkS tep.execute(SkipEmptyWorkStep.java:78)
    at org.gradle.internal.execution.steps.SkipEmptyWorkS tep.execute(SkipEmptyWorkStep.java:34)
    at org.gradle.internal.execution.steps.legacy.MarkSna pshottingInputsStartedStep.execute(MarkSnapshottin gInputsStartedStep.java:39)
    at org.gradle.internal.execution.steps.LoadExecutionS tateStep.execute(LoadExecutionStateStep.java:40)
    at org.gradle.internal.execution.steps.LoadExecutionS tateStep.execute(LoadExecutionStateStep.java:28)
    at org.gradle.internal.execution.impl.DefaultWorkExec utor.execute(DefaultWorkExecutor.java:33)
    at org.gradle.api.internal.tasks.execution.ExecuteAct ionsTaskExecuter.executeIfValid(ExecuteActionsTask Executer.java:187)
    at org.gradle.api.internal.tasks.execution.ExecuteAct ionsTaskExecuter.execute(ExecuteActionsTaskExecute r.java:179)
    at org.gradle.api.internal.tasks.execution.CleanupSta leOutputsExecuter.execute(CleanupStaleOutputsExecu ter.java:109)
    at org.gradle.api.internal.tasks.execution.FinalizePr opertiesTaskExecuter.execute(FinalizePropertiesTas kExecuter.java:46)
    at org.gradle.api.internal.tasks.execution.ResolveTas kExecutionModeExecuter.execute(ResolveTaskExecutio nModeExecuter.java:62)
    at org.gradle.api.internal.tasks.execution.SkipTaskWi thNoActionsExecuter.execute(SkipTaskWithNoActionsE xecuter.java:57)
    at org.gradle.api.internal.tasks.execution.SkipOnlyIf TaskExecuter.execute(SkipOnlyIfTaskExecuter.java:5 6)
    at org.gradle.api.internal.tasks.execution.CatchExcep tionTaskExecuter.execute(CatchExceptionTaskExecute r.java:36)
    at org.gradle.api.internal.tasks.execution.EventFirin gTaskExecuter$1.executeTask(EventFiringTaskExecute r.java:77)
    at org.gradle.api.internal.tasks.execution.EventFirin gTaskExecuter$1.call(EventFiringTaskExecuter.java: 55)
    at org.gradle.api.internal.tasks.execution.EventFirin gTaskExecuter$1.call(EventFiringTaskExecuter.java: 52)
    at org.gradle.internal.operations.DefaultBuildOperati onRunner$CallableBuildOperationWorker.execute(Defa ultBuildOperationRunner.java:200)
    at org.gradle.internal.operations.DefaultBuildOperati onRunner$CallableBuildOperationWorker.execute(Defa ultBuildOperationRunner.java:195)
    at org.gradle.internal.operations.DefaultBuildOperati onRunner$3.execute(DefaultBuildOperationRunner.jav a:75)
    at org.gradle.internal.operations.DefaultBuildOperati onRunner$3.execute(DefaultBuildOperationRunner.jav a:68)
    at org.gradle.internal.operations.DefaultBuildOperati onRunner.execute(DefaultBuildOperationRunner.java: 153)
    at org.gradle.internal.operations.DefaultBuildOperati onRunner.execute(DefaultBuildOperationRunner.java: 68)
    at org.gradle.internal.operations.DefaultBuildOperati onRunner.call(DefaultBuildOperationRunner.java:62)
    at org.gradle.internal.operations.DefaultBuildOperati onExecutor.lambda$call$2(DefaultBuildOperationExec utor.java:76)
    at org.gradle.internal.operations.UnmanagedBuildOpera tionWrapper.callWithUnmanagedSupport(UnmanagedBuil dOperationWrapper.java:54)
    at org.gradle.internal.operations.DefaultBuildOperati onExecutor.call(DefaultBuildOperationExecutor.java :76)
    at org.gradle.api.internal.tasks.execution.EventFirin gTaskExecuter.execute(EventFiringTaskExecuter.java :52)
    at org.gradle.execution.plan.LocalTaskNodeExecutor.ex ecute(LocalTaskNodeExecutor.java:41)
    at org.gradle.execution.taskgraph.DefaultTaskExecutio nGraph$InvokeNodeExecutorsAction.execute(DefaultTa skExecutionGraph.java:372)
    at org.gradle.execution.taskgraph.DefaultTaskExecutio nGraph$InvokeNodeExecutorsAction.execute(DefaultTa skExecutionGraph.java:359)
    at org.gradle.execution.taskgraph.DefaultTaskExecutio nGraph$BuildOperationAwareExecutionAction.execute( DefaultTaskExecutionGraph.java:352)
    at org.gradle.execution.taskgraph.DefaultTaskExecutio nGraph$BuildOperationAwareExecutionAction.execute( DefaultTaskExecutionGraph.java:338)
    at org.gradle.execution.plan.DefaultPlanExecutor$Exec utorWorker.lambda$run$0(DefaultPlanExecutor.java:1 27)
    at org.gradle.execution.plan.DefaultPlanExecutor$Exec utorWorker.execute(DefaultPlanExecutor.java:191)
    at org.gradle.execution.plan.DefaultPlanExecutor$Exec utorWorker.executeNextNode(DefaultPlanExecutor.jav a:182)
    at org.gradle.execution.plan.DefaultPlanExecutor$Exec utorWorker.run(DefaultPlanExecutor.java:124)
    at org.gradle.internal.concurrent.ExecutorPolicy$Catc hAndRecordFailures.onExecute(ExecutorPolicy.java:6 4)
    at org.gradle.internal.concurrent.ManagedExecutorImpl $1.run(ManagedExecutorImpl.java:48)
    at java.util.concurrent.ThreadPoolExecutor.runWorker( ThreadPoolExecutor.java:1149)
    at java.util.concurrent.ThreadPoolExecutor$Worker.run (ThreadPoolExecutor.java:624)
    at org.gradle.internal.concurrent.ThreadFactoryImpl$M anagedThreadRunnable.run(ThreadFactoryImpl.java:56 )
    at java.lang.Thread.run(Thread.java:750)

    FAILURE: Build failed with an exception.

    * What went wrong:
    Execution failed for task ':app:compileReleaseJavaWithJavac'.
    > Compilation failed; see the compiler error output for details.

    * Try:
    Run with --stacktrace option to get the stack trace. Run with --info or --debug option to get more log output. Run with --scan to get full insights.

    * Get more help at https://help.gradle.org

    BUILD FAILED in 12s
    30 actionable tasks: 30 executed

  2. #2
    Clickteam Clickteam
    Fernando's Avatar
    Join Date
    Dec 2006
    Posts
    7,481
    Mentioned
    298 Post(s)
    Tagged
    4 Thread(s)
    This error comes from ORACLE Java.

    An exception has occurred in the compiler (1.8.0_345). Please file a bug against the Java compiler via the Java bug reporting page (http://bugreport.java.com) after checking the Bug Database (http://bugs.java.com) for duplicates. Include your program and the following diagnostic in your report. Thank you.


    Actually, Google is using the open java SDK which is much better to build android APK. This is available when you install Android Studio or by downloading at

    https://www.openlogic.com/openjdk-downloads
    Regards,


    Fernando Vivolo

    ... new things are coming ...

  3. #3
    Clicker Fusion 2.5 (Steam)Fusion 2.5 Developer (Steam)Android Export Module (Steam)iOS Export Module (Steam)

    Join Date
    May 2014
    Posts
    247
    Mentioned
    6 Post(s)
    Tagged
    0 Thread(s)
    Oh, wow, that's amazing! I actually tried 5 different versions of jdk, including 17 and 19 from Oracle, but the version from your link is the one that finally fixed it.

    Thank you so much!

  4. #4
    Clickteam Clickteam

    Join Date
    Jun 2006
    Location
    France
    Posts
    14,614
    Mentioned
    279 Post(s)
    Tagged
    3 Thread(s)
    Quote Originally Posted by Nemeean_lion View Post
    Oh, wow, that's amazing! I actually tried 5 different versions of jdk, including 17 and 19 from Oracle, but the version from your link is the one that finally fixed it.

    Thank you so much!
    Note that you do not need to download it, it's installed with Android Studio (usually in C:\Program Files\Android\Android Studio\jre - better use this one I think, as I suppose it gets updated with Android Studio updates).

    PS: the next update of Fusion automatically finds it on your machine the first time you build an Android app (= if you didn't enter the JDK pathname yet).

Similar Threads

  1. android export worked fine, but crash since update to 293.10
    By fredetmumu in forum Android Export Module 2.5
    Replies: 6
    Last Post: 17th December 2021, 04:14 PM
  2. fine detection with android seems different then PC
    By fredetmumu in forum Android Export Module 2.5
    Replies: 3
    Last Post: 10th April 2021, 02:04 PM
  3. Replace Color Bug only when compiling for Android (fine in Windows)
    By DiegoArthur in forum Android Export Module 2.5
    Replies: 8
    Last Post: 2nd August 2019, 07:41 PM
  4. Fine collision on Fusion 2.5+ Bugged (android)
    By diefox in forum Fusion 2.5
    Replies: 9
    Last Post: 13th June 2019, 02:24 AM
  5. Help me compile android/ios extensions
    By SoftWarewolf in forum Extension Development
    Replies: 3
    Last Post: 8th July 2015, 10:56 AM

Posting Permissions

  • You may not post new threads
  • You may not post replies
  • You may not post attachments
  • You may not edit your posts
  •