User Tag List

Results 1 to 3 of 3

Thread: New Build Error for me - help please

  1. #1
    Clicker Fusion 2.5 DeveloperAndroid Export ModuleiOS Export Module

    Join Date
    Jun 2015
    Posts
    108
    Mentioned
    2 Post(s)
    Tagged
    0 Thread(s)

    New Build Error for me - help please

    Hello. I messed with my SDK and JDKs to get Unreal Engine 5 to export Android - but now Fusion 2.5+ Developer seems to be unhappy. I've tried many combinations of JDK / Android JDK / Anroid SDK version but generally the same error. Please any advice? Thank you.

    Fusion 2.5+ Developer
    v294.14

    JAVA JDK (I think I also tried Android JDK but I'm not sure which version - it was the version that was working)
    jre1.8.0_351

    Android SDK 13 (API 33)

    Android Studio Electric Eel

    Building to 5.0 min and 12 Target




    FAILURE: Build failed with an exception.

    * What went wrong:
    A problem occurred configuring project ':app'.
    > com.android.builder.errors.EvalIssueException: android.defaultConfig.versionCode is set to 0, but it should be a positive integer.
    See https://developer.android.com/studio...#appversioning for more information.

    * Try:
    Run with --stacktrace option to get the stack trace. Run with --info or --debug option to get more log output. Run with --scan to get full insights.

    * Get more help at https://help.gradle.org

    BUILD FAILED in 886ms

  2. #2
    Clickteam Clickteam
    Fernando's Avatar
    Join Date
    Dec 2006
    Posts
    7,502
    Mentioned
    298 Post(s)
    Tagged
    4 Thread(s)
    Quote Originally Posted by KevinSmith View Post
    Hello. I messed with my SDK and JDKs to get Unreal Engine 5 to export Android - but now Fusion 2.5+ Developer seems to be unhappy. I've tried many combinations of JDK / Android JDK / Anroid SDK version but generally the same error. Please any advice? Thank you.

    Fusion 2.5+ Developer
    v294.14

    JAVA JDK (I think I also tried Android JDK but I'm not sure which version - it was the version that was working)
    jre1.8.0_351

    Android SDK 13 (API 33)

    Android Studio Electric Eel

    Building to 5.0 min and 12 Target




    FAILURE: Build failed with an exception.

    * What went wrong:
    A problem occurred configuring project ':app'.
    > com.android.builder.errors.EvalIssueException: android.defaultConfig.versionCode is set to 0, but it should be a positive integer.
    See https://developer.android.com/studio...#appversioning for more information.

    * Try:
    Run with --stacktrace option to get the stack trace. Run with --info or --debug option to get more log output. Run with --scan to get full insights.

    * Get more help at https://help.gradle.org

    BUILD FAILED in 886ms
    still using dolphin here, but if you are using eel you should use their JBR so instead of using JDK : java 8 release 351 set path to C:\Program Files\Android\Android Studio\jbr

    let us know how it goes
    Regards,


    Fernando Vivolo

    ... new things are coming ...

  3. #3
    Clicker Fusion 2.5 DeveloperAndroid Export ModuleiOS Export Module

    Join Date
    Jun 2015
    Posts
    108
    Mentioned
    2 Post(s)
    Tagged
    0 Thread(s)
    Quote Originally Posted by Fernando View Post
    still using dolphin here, but if you are using eel you should use their JBR so instead of using JDK : java 8 release 351 set path to C:\Program Files\Android\Android Studio\jbr

    let us know how it goes
    That was it! Thank you so much!

Similar Threads

  1. Users that cannot build with Android Studio (ant\build.xml error)
    By Perry in forum Android Export Module 2.5
    Replies: 102
    Last Post: 28th November 2019, 08:02 PM
  2. Cannot build my Android app (ant/build.xml error)
    By oaklan5 in forum Fusion 2.5
    Replies: 1
    Last Post: 27th July 2017, 07:59 PM
  3. Getting build error when trying to build for Android
    By Outcast in forum Android Export Module 2.5
    Replies: 7
    Last Post: 19th March 2016, 07:10 PM
  4. Build process fails with error message 'cannot build blah.mfa
    By Jusfury in forum Android Export Module 2.5
    Replies: 7
    Last Post: 22nd May 2015, 09:16 PM
  5. Build error
    By Ls2 in forum Android Export Module Version 2.0
    Replies: 8
    Last Post: 1st August 2012, 10:35 PM

Posting Permissions

  • You may not post new threads
  • You may not post replies
  • You may not post attachments
  • You may not edit your posts
  •