User Tag List

Results 1 to 4 of 4

Thread: Beta 22 - Compiling Error

  1. #1
    Clickteam Clickteam
    Kisguri's Avatar
    Join Date
    Jun 2006
    Location
    Bakersfield, CA
    Posts
    3,057
    Mentioned
    39 Post(s)
    Tagged
    3 Thread(s)

    Beta 22 - Compiling Error

    Here is the report generated from my Compiling error, I updated my SDK to the best of my knowledge, I will continue to diagnose the issue but wanted to record my results thus far.

    "Buildfile: C:\DOCUME~1\CHRIS~1.CAR\LOCALS~1\Temp\And23E.tmp\b uild.xml

    -set-mode-check:

    -set-debug-files:

    -set-debug-mode:

    -debug-obfuscation-check:

    -setup:
    [echo] Gathering info for RuntimeAndroid...
    [setup] Android SDK Tools Revision 16
    [setup] Project Target: Android 3.2
    [setup] API level: 13
    [setup]
    [setup] ------------------
    [setup] Resolving library dependencies:
    [setup] No library dependencies.
    [setup]
    [setup] ------------------
    [setup]
    [setup] WARNING: Attribute minSdkVersion in AndroidManifest.xml (7) is lower than the project target API level (13)

    -build-setup:
    [echo] Creating output directories if needed...
    [mkdir] Created dir: C:\DOCUME~1\CHRIS~1.CAR\LOCALS~1\Temp\And23E.tmp\b in\res
    [mkdir] Created dir: C:\DOCUME~1\CHRIS~1.CAR\LOCALS~1\Temp\And23E.tmp\b in\classes

    -pre-build:

    -code-gen:
    [echo] ----------
    [echo] Handling aidl files...
    [aidl] No AIDL files to compile.
    [echo] ----------
    [echo] Handling RenderScript files...
    [renderscript] No RenderScript files to compile.
    [echo] ----------
    [echo] Handling Resources...
    [aapt] Found Deleted Target File
    [aapt] Generating resource IDs...

    -pre-compile:

    -compile:
    [javac] Compiling 344 source files to C:\DOCUME~1\CHRIS~1.CAR\LOCALS~1\Temp\And23E.tmp\b in\classes
    [javac] C:\DOCUME~1\CHRIS~1.CAR\LOCALS~1\Temp\And23E.tmp\s rc\Extensions\CRunAndroidEmail.java:132: error: cannot find symbol
    [javac] ho.uiThreadRun(new Runnable()
    [javac] ^
    [javac] symbol: method uiThreadRun(<anonymous Runnable>)
    [javac] location: variable ho of type CExtension
    [javac] C:\DOCUME~1\CHRIS~1.CAR\LOCALS~1\Temp\And23E.tmp\s rc\Extensions\CRunAndroidEmail.java:160: error: cannot find symbol
    [javac] ho.uiThreadRun(new Runnable()
    [javac] ^
    [javac] symbol: method uiThreadRun(<anonymous Runnable>)
    [javac] location: variable ho of type CExtension
    [javac] Note: Some input files use or override a deprecated API.
    [javac] Note: Recompile with -Xlint:deprecation for details.
    [javac] 2 errors

    BUILD FAILED
    C:\Program Files\Android\android-sdk\tools\ant\build.xml:602: The following error occurred while executing this line:
    C:\Program Files\Android\android-sdk\tools\ant\build.xml:622: Compile failed; see the compiler error output for details.

    Total time: 6 seconds"

  2. #2
    Clickteam Clickteam
    Kisguri's Avatar
    Join Date
    Jun 2006
    Location
    Bakersfield, CA
    Posts
    3,057
    Mentioned
    39 Post(s)
    Tagged
    3 Thread(s)
    It seems after reviewing my SDK manager version 16 that I have installed the latest versions of API 13, I have posted these images of uninstalled content and Installed and Uninstalled so you can cross check me...



    Only things not Installed



    Includes Installed

  3. #3
    Clicker Multimedia Fusion 2 DeveloperSWF Export Module

    Join Date
    Jun 2006
    Posts
    6,773
    Mentioned
    1 Post(s)
    Tagged
    0 Thread(s)
    You need an updated version of the email object (you can tell by the "CRunAndroidEmail.java" in the log).

  4. #4
    Forum Moderator Fusion 2.5 DeveloperAndroid Export ModuleHTML5 Export ModuleSWF Export Module
    Stephen's Avatar
    Join Date
    Aug 2008
    Location
    Montana
    Posts
    4,515
    Mentioned
    1 Post(s)
    Tagged
    0 Thread(s)
    On it.
    _____________________________________________
    Nivram's Examples -Need extensions? Send me a PM.-


Similar Threads

  1. error compiling...
    By Ahiru in forum iOS Export Module Version 2.0
    Replies: 9
    Last Post: 22nd January 2013, 08:10 PM
  2. Strange error Xcode (the last) with BETA 5
    By Koji_Kabuto in forum iOS Export Module Version 2.0
    Replies: 11
    Last Post: 14th November 2012, 05:07 PM
  3. Compiling error when changing 'Build filename'
    By Yos in forum iOS Export Module Version 2.0
    Replies: 3
    Last Post: 10th April 2012, 01:55 PM
  4. Beta 4/SDK 4.1: Error compiling the application
    By Koji_Kabuto in forum iOS Export Module Version 2.0
    Replies: 2
    Last Post: 30th October 2010, 10:41 PM
  5. Fixed - Beta 2: OpenGL error
    By DavidN in forum iOS Export Module Version 2.0
    Replies: 0
    Last Post: 25th September 2010, 08:29 PM

Posting Permissions

  • You may not post new threads
  • You may not post replies
  • You may not post attachments
  • You may not edit your posts
  •