User Tag List

Page 1 of 3 1 2 3 LastLast
Results 1 to 10 of 22

Thread: Android Build Error

  1. #1
    Clicker Fusion 2.5 DeveloperFusion 2.5+ DLCAndroid Export ModuleMac Export Module
    dsilvers's Avatar
    Join Date
    Jun 2008
    Location
    Boston, MA
    Posts
    523
    Mentioned
    9 Post(s)
    Tagged
    0 Thread(s)

    Android Build Error

    Just picked up the Android export module and am excited to test a really simple game I made last month for the #1GAM challenge. Anyway, I fix the couple events I have to (mostly replacing click with touch), install the Android and Java SDK's, set up the Android build settings, then go to build and I get this error:

    Code:
    Buildfile: C:\Users\Daniel\AppData\Local\Temp\AndD0D2.tmp\build.xml
    
    
    BUILD FAILED
    C:\Users\Daniel\AppData\Local\Temp\AndD0D2.tmp\build.xml:83: Cannot find F:\Android\Android SDK\tools\ant\build.xml imported from C:\Users\Daniel\AppData\Local\Temp\AndD0D2.tmp\build.xml
    
    
    Total time: 0 seconds
    Not entirely sure what do here. Thinking maybe I pointed one of the SDK's at the wrong directory but I'm not sure what directory it'd want me to point it to if not the top level one.
    Currently the SDK's are located at:
    F:\Android\Android SDK\adt-bundle-windows-x86_64-20130219
    F:\Android\JDK

    Any thoughts?

  2. #2
    Clickteam Clickteam

    Join Date
    Jun 2006
    Location
    France
    Posts
    13,092
    Mentioned
    123 Post(s)
    Tagged
    2 Thread(s)
    Did you install the ADT bundle? You have to install the other version of the Android SDK, the one for existing IDE's. Take a look at the documentation or at the "getting started" post in this forum.

  3. #3
    Clicker

    Fusion 2.5 DeveloperAndroid Export ModuleHTML5 Export ModuleiOS Export ModuleSWF Export Module
    Fusion 2.5 (Steam)Fusion 2.5 Developer (Steam)Android Export Module (Steam)HTML5 Export Module (Steam)iOS Export Module (Steam)Universal Windows Platform Export Module (Steam)

    Join Date
    Jun 2006
    Location
    Killeen, TEXAS
    Posts
    1,037
    Mentioned
    2 Post(s)
    Tagged
    0 Thread(s)
    I get the same error;
    My system is WIN7 64bit.
    i installed Java JDK 6 (32 bit version)
    i installed Android (for existing IDE's version) : install manager chose (api#17) and it installed those packages.

    I pointed the build at C:\Program Files (x86)\Java\jdk1.6.0_43
    BUILD FAILED
    C:\Users\Dan2K13\AppData\Local\Temp\AndFF47.tmp\bu ild.xml:83: Cannot find C:\Program Files (x86)\Java\jdk1.6.0_43\tools\ant\build.xml imported from C:\Users\Dan2K13\AppData\Local\Temp\AndFF47.tmp\bu ild.xml

    If this is at the wrong folder; how do you change the location? when building the file, it wont give me the location folder any more. <- edit;( I have found this in the MMF options for the Android exporter)

    I changed the Android pathname: C:\Program Files (x86)\Android\android-sdk
    I get a build error
    Buildfile: C:\Users\Dan2K13\AppData\Local\Temp\And5617.tmp\bu ild.xml
    -set-mode-check:
    -set-debug-files:
    -check-env:
    [checkenv] Android SDK Tools Revision 21.1.0
    [checkenv] Installed at C:\Program Files (x86)\Android\android-sdk
    -setup:
    [echo] Project Name: RuntimeAndroid
    [gettype] Project Type: Application
    -set-debug-mode:
    -debug-obfuscation-check:
    -pre-build:
    -build-setup:
    [echo] Resolving Build Target for RuntimeAndroid...
    BUILD FAILED
    C:\Program Files (x86)\Android\android-sdk\tools\ant\build.xml:541: Unable to resolve project target 'android-14'
    Total time: 0 seconds

  4. #4
    Clickteam Clickteam

    Join Date
    Jun 2006
    Location
    France
    Posts
    13,092
    Mentioned
    123 Post(s)
    Tagged
    2 Thread(s)
    Run the Android SDK Manager and install the API #14, does this solve the problem?

  5. #5
    Clicker

    Fusion 2.5 DeveloperAndroid Export ModuleHTML5 Export ModuleiOS Export ModuleSWF Export Module
    Fusion 2.5 (Steam)Fusion 2.5 Developer (Steam)Android Export Module (Steam)HTML5 Export Module (Steam)iOS Export Module (Steam)Universal Windows Platform Export Module (Steam)

    Join Date
    Jun 2006
    Location
    Killeen, TEXAS
    Posts
    1,037
    Mentioned
    2 Post(s)
    Tagged
    0 Thread(s)
    Yes. Using the Android SDK intstall manager, Installing Android 4.0 (API#14) solved the issue. It now builds the application OK.

  6. #6
    Clickteam Clickteam

    Join Date
    Jun 2006
    Location
    France
    Posts
    13,092
    Mentioned
    123 Post(s)
    Tagged
    2 Thread(s)
    Great. So there is a mistake in the documentation, sorry for that.

  7. #7
    Clicker Fusion 2.5 DeveloperFusion 2.5+ DLCAndroid Export ModuleMac Export Module
    dsilvers's Avatar
    Join Date
    Jun 2008
    Location
    Boston, MA
    Posts
    523
    Mentioned
    9 Post(s)
    Tagged
    0 Thread(s)
    This worked! Got a quick Hello World test to install just fine on my Galaxy S3. I shall now try to build my #1GAM project...

  8. #8
    Clicker Fusion 2.5 DeveloperFusion 2.5+ DLCAndroid Export ModuleMac Export Module
    dsilvers's Avatar
    Join Date
    Jun 2008
    Location
    Boston, MA
    Posts
    523
    Mentioned
    9 Post(s)
    Tagged
    0 Thread(s)
    IT WORKS! IT WORKS IT WORKS IT WORKS!

  9. #9
    Clicker Fusion 2.5 DeveloperAndroid Export ModuleHTML5 Export ModuleSWF Export Module
    happygreenfrog's Avatar
    Join Date
    May 2011
    Location
    I.L.T.D.O.I.R (I.L.T.D.O.I.R's Location: The Dimension Of Infinite Recursion)
    Posts
    4,307
    Mentioned
    4 Post(s)
    Tagged
    0 Thread(s)
    Quote Originally Posted by dsilvers View Post
    IT WORKS! IT WORKS IT WORKS IT WORKS!
    I'm glad to hear you got it working! Have fun with the Android Runtime!

  10. #10
    Clicker Fusion 2.5 DeveloperFusion 2.5+ DLCAndroid Export ModuleHTML5 Export ModuleiOS Export ModuleUniversal Windows Platform Export ModuleSWF Export ModuleXNA Export ModuleMac Export Module
    Evilized79's Avatar
    Join Date
    Nov 2009
    Location
    Netherlands
    Posts
    882
    Mentioned
    3 Post(s)
    Tagged
    0 Thread(s)
    Installed everything there is, #14 isn't working for me neither is #15
    I removed everything and reinstalled it. get the same message!

    here's what I entered:

    http://dl.dropbox.com/u/35766527/android-15.bmp

    BUILD FAILED
    C:\DOCUME~1\Baprigli\LOCALS~1\Temp\And24.tmp\build .xml:83: Cannot find C:\Program Files\Android\android-sdk\platforms\android-14\tools\ant\build.xml imported from
    C:\DOCUME~1\Baprigli\LOCALS~1\Temp\And24.tmp\build .xml

    Total time: 0 seconds

    is there still something i'm missing?

Page 1 of 3 1 2 3 LastLast

Similar Threads

  1. build application android error.
    By daniele in forum Android Export Module Version 2.0
    Replies: 2
    Last Post: 21st November 2013, 01:27 PM
  2. Android/iOS InputType object build error!!
    By Bipolar_Games in forum Android Export Module Version 2.0
    Replies: 2
    Last Post: 25th September 2013, 02:16 AM
  3. Android Build Error
    By dsilvers in forum Multimedia Fusion 2 - Technical Support
    Replies: 0
    Last Post: 2nd April 2013, 01:51 AM
  4. Trying Android again... getting error 83 on build
    By Tuna in forum Android Export Module Version 2.0
    Replies: 2
    Last Post: 20th January 2013, 04:33 PM
  5. [Build Error] Problems with Android Dialogs Object
    By Arnax in forum Android Export Module Version 2.0
    Replies: 3
    Last Post: 21st December 2011, 04:43 AM

Posting Permissions

  • You may not post new threads
  • You may not post replies
  • You may not post attachments
  • You may not edit your posts
  •