User Tag List

Page 1 of 2 1 2 LastLast
Results 1 to 10 of 17

Thread: error when exporting..

  1. #1
    Clicker Fusion 2.5 DeveloperAndroid Export ModuleiOS Export ModuleSWF Export ModuleXNA Export ModuleUnicode Add-on
    arthurh's Avatar
    Join Date
    Sep 2010
    Posts
    950
    Mentioned
    0 Post(s)
    Tagged
    0 Thread(s)

    Question error when exporting..

    Hi,

    i have just put an active in the frame and export an apk file. i got this :

    Buildfile: C:\DOCUME~1\UTILIS~1\LOCALS~1\Temp\And86.tmp\build .xml

    BUILD FAILED
    C:\DOCUME~1\UTILIS~1\LOCALS~1\Temp\And86.tmp\build .xml:83: Cannot find F:\data\devs\build.xml imported from C:\DOCUME~1\UTILIS~1\LOCALS~1\Temp\And86.tmp\build .xml

    Total time: 0 seconds
    Picked up JAVA_TOOL_OPTIONS: -Xmx256M

    Can you explain me what's wrong ?
    thx

  2. #2
    Clicker Fusion 2.5 DeveloperAndroid Export ModuleiOS Export ModuleSWF Export ModuleXNA Export ModuleUnicode Add-on
    arthurh's Avatar
    Join Date
    Sep 2010
    Posts
    950
    Mentioned
    0 Post(s)
    Tagged
    0 Thread(s)
    Ok i see the problem in the preference/general/exporter's path !

  3. #3
    Clicker Fusion 2.5 DeveloperAndroid Export ModuleiOS Export ModuleSWF Export ModuleXNA Export ModuleUnicode Add-on
    arthurh's Avatar
    Join Date
    Sep 2010
    Posts
    950
    Mentioned
    0 Post(s)
    Tagged
    0 Thread(s)
    I test now with an app i made and i have this error :

    [aapt] C:\DOCUME~1\UTILIS~1\LOCALS~1\Temp\AndA1.tmp\res\v alues\strings.xml:3: error: Apostrophe not preceded by \ (in game)

    BUILD FAILED
    C:\android_sdk\tools\ant\build.xml:647: The following error occurred while executing this line:
    C:\android_sdk\tools\ant\build.xml:688: null returned: 1

    Can you tell me what is wrong ?

    many thanks.

  4. #4
    Clickteam Clickteam
    Jeff's Avatar
    Join Date
    Jun 2006
    Location
    Battle Ground Washington
    Posts
    11,824
    Mentioned
    8 Post(s)
    Tagged
    2 Thread(s)
    Odd -- Do you have an apostrophe in something in the game in a string or in an objects name?

    Can you export out a blank application that works fine?

  5. #5
    Clicker Fusion 2.5 DeveloperAndroid Export ModuleiOS Export ModuleSWF Export ModuleXNA Export ModuleUnicode Add-on
    arthurh's Avatar
    Join Date
    Sep 2010
    Posts
    950
    Mentioned
    0 Post(s)
    Tagged
    0 Thread(s)
    Thanks Jeff.
    I can export a blank app.
    I search the apostrophe...

  6. #6
    Clicker Fusion 2.5 DeveloperAndroid Export ModuleiOS Export ModuleSWF Export ModuleXNA Export ModuleUnicode Add-on
    arthurh's Avatar
    Join Date
    Sep 2010
    Posts
    950
    Mentioned
    0 Post(s)
    Tagged
    0 Thread(s)
    i don't understand : i don't see any apostrophe. There is a way to see the frame number error ? like the ios exporter ?

  7. #7
    Clicker Fusion 2.5 DeveloperAndroid Export ModuleiOS Export ModuleSWF Export ModuleXNA Export ModuleUnicode Add-on
    arthurh's Avatar
    Join Date
    Sep 2010
    Posts
    950
    Mentioned
    0 Post(s)
    Tagged
    0 Thread(s)
    ok... i found it : it was the string of the application name but not the name of the build... I just have 3 errors now :

    [javac] Compiling 386 source files to C:\DOCUME~1\UTILIS~1\LOCALS~1\Temp\And1A8.tmp\bin\ classes
    [javac] C:\DOCUME~1\UTILIS~1\LOCALS~1\Temp\And1A8.tmp\src\ com\mycompany\mygame\Main.java:19: ';' expected
    [javac] package com.mycompany.mygame;
    [javac] ^
    [javac] C:\DOCUME~1\UTILIS~1\LOCALS~1\Temp\And1A8.tmp\gen\ com\mycompany\mygame\BuildConfig.java:2: ';' expected
    [javac] package com.mycompany.mygame;
    [javac] ^
    [javac] C:\DOCUME~1\UTILIS~1\LOCALS~1\Temp\And1A8.tmp\gen\ com\mycompany\mygame\R.java:8: ';' expected
    [javac] package com.mycompany.mygame;
    [javac] ^
    [javac] 3 errors
    [javac] Picked up JAVA_TOOL_OPTIONS: -Xmx256M

    Can you tell me what is wrong ?

    thx

  8. #8
    Clicker Fusion 2.5 DeveloperAndroid Export ModuleiOS Export ModuleSWF Export ModuleXNA Export ModuleUnicode Add-on
    arthurh's Avatar
    Join Date
    Sep 2010
    Posts
    950
    Mentioned
    0 Post(s)
    Tagged
    0 Thread(s)
    i have uninstall the api 14 and re-install, nothing to do : i have the same error. I need a certificat to build an app ?

  9. #9
    Clicker Multimedia Fusion 2Android Export ModuleiOS Export ModuleSWF Export Module

    Join Date
    Oct 2011
    Location
    Melbourne
    Posts
    73
    Mentioned
    0 Post(s)
    Tagged
    0 Thread(s)
    no, you can build in debug mode without a signature file. You only need the signature to build in release mode.

    i'm sorry i cant help you further with the issue though. Did you install exactly the versions of JDK and android SDK which were prescribed in jeff's thread?
    I had this problem at first. You need JDK 6 x86 very specifically.

  10. #10
    Clicker Fusion 2.5 DeveloperAndroid Export ModuleiOS Export ModuleSWF Export ModuleXNA Export ModuleUnicode Add-on
    arthurh's Avatar
    Join Date
    Sep 2010
    Posts
    950
    Mentioned
    0 Post(s)
    Tagged
    0 Thread(s)
    Hi Harry,
    thaks to your response. Here is the information :
    JDK :
    C:\Program Files\Java\jdk1.6.0_45
    Android API 14 installed

    I made something wrong ?

Page 1 of 2 1 2 LastLast

Similar Threads

  1. error while exporting a swf file from a game using the platform movement object
    By Chokito in forum SWF/Flash Export Module Version 2.0
    Replies: 1
    Last Post: 24th December 2013, 03:17 AM
  2. Error while exporting to Flash in MMF2 Dev
    By qenio in forum Multimedia Fusion 2 - Technical Support
    Replies: 1
    Last Post: 10th August 2011, 01:27 PM
  3. error exporting
    By DaveC in forum SWF/Flash Export Module Version 2.0
    Replies: 3
    Last Post: 24th May 2011, 12:35 AM

Posting Permissions

  • You may not post new threads
  • You may not post replies
  • You may not post attachments
  • You may not edit your posts
  •