User Tag List

Page 5 of 29 FirstFirst ... 3 4 5 6 7 15 ... LastLast
Results 41 to 50 of 286

Thread: Build Failed ---- Things to check

  1. #41
    Clicker Fusion 2.5 (Steam)Android Export Module (Steam)
    ChroegFx's Avatar
    Join Date
    Jun 2014
    Location
    Cologne, Germany
    Posts
    4
    Mentioned
    0 Post(s)
    Tagged
    0 Thread(s)
    FVivolo

    yes of course both is installed and the picture shows the path inside the preference
    Screenshot (5).jpg

  2. #42
    Clickteam Clickteam
    Fernando's Avatar
    Join Date
    Dec 2006
    Posts
    5,917
    Mentioned
    116 Post(s)
    Tagged
    2 Thread(s)
    Regards,


    Fernando Vivolo

    ... new things are coming ...

  3. #43
    Clicker Fusion 2.5 (Steam)Android Export Module (Steam)
    ChroegFx's Avatar
    Join Date
    Jun 2014
    Location
    Cologne, Germany
    Posts
    4
    Mentioned
    0 Post(s)
    Tagged
    0 Thread(s)
    Okay I fixed the problem! Reinstall Android SDK and Install "ALL" Packages and new Updates srry for mistakes

  4. #44
    Clicker Fusion 2.5 DeveloperAndroid Export ModuleHTML5 Export ModuleiOS Export ModuleSWF Export ModuleMac Export ModuleUnicode Add-on
    Vantales's Avatar
    Join Date
    Jun 2007
    Location
    Tahiti
    Posts
    249
    Mentioned
    1 Post(s)
    Tagged
    0 Thread(s)
    Hi all,

    i resolved this bug with the motor object
    Hope that can be help someone


    https://www.youtube.com/watch?v=bZ3y...ature=youtu.be

  5. #45
    Clicker

    Fusion 2.5 DeveloperAndroid Export ModuleInstall CreatorPatch Maker

    Join Date
    Feb 2014
    Posts
    6
    Mentioned
    0 Post(s)
    Tagged
    0 Thread(s)
    i have a weird problem with my builds, Galaxy s5 on stock 4.4, nexus 7 on 4.4, problem i build apk fine, it will install, and then open no issues on nexus 7, i then transfer the same apk to galaxy s5, it will get to the install screen, options buttons are then cancel or install, i press install nothing happens doesnt even register or highlight the touch, but the cancel does, but if install and run via adb method of pushing it , it works ? is this an exporter related issue or and s5 issue. all security ie unknown sources is ticked. or is it a signing problem do the apk's now need to be signed before they can be installed on a S5.

    anyone else have this issue its becoming a pain yo test ?

    Android SDK all installed, JDK 1.07 installed otherwise i would get a failed build

  6. #46
    Clickteam Clickteam
    Fernando's Avatar
    Join Date
    Dec 2006
    Posts
    5,917
    Mentioned
    116 Post(s)
    Tagged
    2 Thread(s)
    well if you push or install and works, nothing related to the apk is happening.

    but what could be with installer is that maybe the version number are not correct (if lower than installed it will not install) or the application is running in the background, in this case; go to multi task button and remove from there (swiping the application) and install again to see if possible.
    Regards,


    Fernando Vivolo

    ... new things are coming ...

  7. #47
    Clicker Fusion 2.5 DeveloperAndroid Export Module
    Fusion 2.5 (Steam)Android Export Module (Steam)

    Join Date
    Jan 2014
    Posts
    59
    Mentioned
    0 Post(s)
    Tagged
    0 Thread(s)
    heres a thing that might be helpful.....or not, after trying to build one of my apps (many successful builds alread accomplished no problems) it kept coming up with build failed etc, I reread the whole code several times (everything else is all set correctly since i have been building already.)was driving me nuts.
    I changed the properties of an ini object used on first level it was blanked and set to write ini in application folder etc. i changed this and hey presto build works. so sometimes its the smallest of things that cause the greatest of disasters check your ini paths! maybe

  8. #48
    Clickteam Clickteam
    Fernando's Avatar
    Join Date
    Dec 2006
    Posts
    5,917
    Mentioned
    116 Post(s)
    Tagged
    2 Thread(s)
    hmm but this does not enter in the equation during building process.
    Regards,


    Fernando Vivolo

    ... new things are coming ...

  9. #49
    Forum Moderator

    Fusion 2.5 MacFusion 2.5 DeveloperFusion 2.5+ DLCAndroid Export ModuleHTML5 Export ModuleiOS Export ModuleUniversal Windows Platform Export ModuleSWF Export ModuleMac Export ModuleInstall Creator Pro
    Fusion 2.5 (Steam)Fusion 2.5 Developer (Steam)Android Export Module (Steam)HTML5 Export Module (Steam)iOS Export Module (Steam)
    Perry's Avatar
    Join Date
    Dec 2013
    Location
    Watertown, WI
    Posts
    4,309
    Mentioned
    44 Post(s)
    Tagged
    0 Thread(s)
    weird I just reinstalled my laptop, and getting the same error

    BUILD FAILED
    C:\Users\perry\AppData\Local\Android\android-sdk\tools\ant\build.xml:720: The following error occurred while executing this line:
    C:\Users\perry\AppData\Local\Android\android-sdk\tools\ant\build.xml:734: Compile failed; see the compiler error output for details.

    Will resintall the SDK 1 more time..

  10. #50
    Clicker Fusion 2.5 DeveloperAndroid Export ModuleHTML5 Export ModuleiOS Export ModuleSWF Export ModuleMac Export ModuleUnicode Add-on
    Vantales's Avatar
    Join Date
    Jun 2007
    Location
    Tahiti
    Posts
    249
    Mentioned
    1 Post(s)
    Tagged
    0 Thread(s)
    Hey Perry, sometimes it's not about the SDK.
    Look my video
    https://www.youtube.com/watch?v=bZ3y...ature=youtu.be

Page 5 of 29 FirstFirst ... 3 4 5 6 7 15 ... LastLast

Similar Threads

  1. BUILD FAILED
    By gregoire0 in forum Android Export Module Version 2.0
    Replies: 3
    Last Post: 18th April 2013, 04:05 PM
  2. Build failed
    By Farhan in forum Android Export Module Version 2.0
    Replies: 4
    Last Post: 9th April 2013, 06:09 PM
  3. [RC7] BUILD FAILED
    By Pharanygitis in forum Android Export Module Version 2.0
    Replies: 7
    Last Post: 29th March 2013, 01:44 PM
  4. Build #255 installation failed
    By Czentnar in forum Multimedia Fusion 2 - Technical Support
    Replies: 3
    Last Post: 21st July 2012, 05:55 PM
  5. Beta 29 - Failed Build
    By Kisguri in forum Android Export Module Version 2.0
    Replies: 5
    Last Post: 22nd May 2012, 10:31 PM

Posting Permissions

  • You may not post new threads
  • You may not post replies
  • You may not post attachments
  • You may not edit your posts
  •