User Tag List

Page 1 of 29 1 2 3 11 ... LastLast
Results 1 to 10 of 286

Thread: Build Failed ---- Things to check

  1. #1
    Clickteam Clickteam
    Jeff's Avatar
    Join Date
    Jun 2006
    Location
    Battle Ground Washington
    Posts
    11,822
    Mentioned
    7 Post(s)
    Tagged
    2 Thread(s)

    Build Failed ---- Things to check

    Build Failed ---- Things to check

    Inside Fusion on the preferences screen:

    Path to your Java JDK
    For example mine is -- C:\Program Files (x86)\Java\jdk1.6.0_43

    Path to your Android SDK
    For example mine is -- C:\Program Files (x86)\Android\android-sdk

    Now the next area to look at is in your actual application properties/Android tab.
    what build SDK are you trying to use?

    Capture.JPG

    Above it says build API 14

    You will need to open the Android SDK manager and make sure you have that API installed.

    On my computer that is here:
    C:\Program Files (x86)\Android\android-sdk\SDK Manager.exe
    You might also find a link to it in your Start Menu Programs Folder -- Inside the Android SDK Tools Group

    My advice is to change this to the newest API and download that in the Android SDK manager.

    Then also change it here in Fusion to the same API number. I can't think of a reason why you need to use an older API but maybe there is, but you have to install an API to build anything. Newer APIs would support more features and perhaps have some performance gains.

    ** Don't forget to change the Android Package name inside your application properties under the Android tab to something unique. (Change from com.mycompany.myapplication) to (com.mycompany.gamenamehere) (GameNameHere=The name of your game). Do not include any spaces and no special characters. Just plain letters and numbers.

  2. #2
    Clicker Fusion 2.5 DeveloperAndroid Export Module
    Fusion 2.5 (Steam)Fusion 2.5 Developer (Steam)Android Export Module (Steam)HTML5 Export Module (Steam)iOS Export Module (Steam)Universal Windows Platform Export Module (Steam)
    alperoz49's Avatar
    Join Date
    Feb 2014
    Location
    Turkey
    Posts
    51
    Mentioned
    1 Post(s)
    Tagged
    0 Thread(s)
    it kept giving me "invalid name or syntax" over and over again.

    then i noticed that my API was set to 14 as you wrote and checked SDK Manager and in SDK manager only API 19 was installed.
    I switched API from 14 to 19 and it worked. (Also installed API 14 but did not try with that , probably it'll work)

    thanks

  3. #3
    Clicker Multimedia Fusion 2 DeveloperAndroid Export ModuleSWF Export Module
    FrankyAsh's Avatar
    Join Date
    Dec 2010
    Location
    Cape Town, South Africa
    Posts
    15
    Mentioned
    0 Post(s)
    Tagged
    0 Thread(s)
    When building my application, I don't get an error message. The program just stalls after a while.
    I'm running Multimedia Fusion Developer 2.
    It doesn't give me an option to enter the API.
    Images attachées Images attachées

  4. #4
    Clickteam Clickteam
    Jeff's Avatar
    Join Date
    Jun 2006
    Location
    Battle Ground Washington
    Posts
    11,822
    Mentioned
    7 Post(s)
    Tagged
    2 Thread(s)
    I think you have a very old Android build and need to update that so you can access the API information.

    Fernando release a new beta version of the very lastest you could try out here:

    http://community.clickteam.com/threads/85931-Beta-281-3

  5. #5
    Clicker Fusion 2.5 Developer

    Join Date
    Nov 2006
    Posts
    71
    Mentioned
    0 Post(s)
    Tagged
    0 Thread(s)
    Whenever I try to build my application, I get this message, "Invalid characters or syntax error in application package name." What should I do?

  6. #6
    Clickteam Clickteam
    Fernando's Avatar
    Join Date
    Dec 2006
    Posts
    6,152
    Mentioned
    158 Post(s)
    Tagged
    3 Thread(s)
    please use only ASCII lowercase chars in your package name com.yourselves.yourapplication
    Regards,


    Fernando Vivolo

    ... new things are coming ...

  7. #7
    Clicker Fusion 2.5 Developer

    Join Date
    Nov 2006
    Posts
    71
    Mentioned
    0 Post(s)
    Tagged
    0 Thread(s)
    Thank you very much!

  8. #8
    Clicker Fusion 2.5 DeveloperAndroid Export ModuleHTML5 Export ModuleiOS Export ModuleXNA Export Module

    Join Date
    Jun 2012
    Posts
    129
    Mentioned
    0 Post(s)
    Tagged
    0 Thread(s)
    I'm still doing something wrong. I can't even output a blank project now as an APK, the error is always the same. MMF2 still works perfectly and I can output everything,o I don't understand why Fusion 2 wouldn't be able to export anything. I have all of the latest versions, I just installed it all yesterday. 281.2 for Fusion. 281.1 for Android exporter.

    Buildfile: C:\Users\Scott\AppData\Local\Temp\AndE64E.tmp\buil d.xml

    BUILD FAILED
    C:\Users\Scott\AppData\Local\Temp\AndE64E.tmp\buil d.xml:83: Cannot find C:\Users\Scott\Desktop\tools\ant\build.xml imported from C:\Users\Scott\AppData\Local\Temp\AndE64E.tmp\buil d.xml

    Total time: 0 seconds

  9. #9
    Clickteam Clickteam
    Fernando's Avatar
    Join Date
    Dec 2006
    Posts
    6,152
    Mentioned
    158 Post(s)
    Tagged
    3 Thread(s)
    you have installed java sdk and andoid sdk, right? (yes because you build in mmf2)

    did you set the directory appropriately inside preferences, general, android both directories (java sdk and android sdk)
    Regards,


    Fernando Vivolo

    ... new things are coming ...

  10. #10
    Clicker Fusion 2.5 DeveloperAndroid Export ModuleHTML5 Export ModuleiOS Export ModuleXNA Export Module

    Join Date
    Jun 2012
    Posts
    129
    Mentioned
    0 Post(s)
    Tagged
    0 Thread(s)
    Bingo. The second Android directory wasn't set. After I copied and pasted from MMF2 it worked again. Thank you.

Page 1 of 29 1 2 3 11 ... LastLast

Similar Threads

  1. BUILD FAILED
    By gregoire0 in forum Android Export Module Version 2.0
    Replies: 3
    Last Post: 18th April 2013, 04:05 PM
  2. Build failed
    By Farhan in forum Android Export Module Version 2.0
    Replies: 4
    Last Post: 9th April 2013, 06:09 PM
  3. [RC7] BUILD FAILED
    By Pharanygitis in forum Android Export Module Version 2.0
    Replies: 7
    Last Post: 29th March 2013, 01:44 PM
  4. Build #255 installation failed
    By Czentnar in forum Multimedia Fusion 2 - Technical Support
    Replies: 3
    Last Post: 21st July 2012, 05:55 PM
  5. Beta 29 - Failed Build
    By Kisguri in forum Android Export Module Version 2.0
    Replies: 5
    Last Post: 22nd May 2012, 10:31 PM

Posting Permissions

  • You may not post new threads
  • You may not post replies
  • You may not post attachments
  • You may not edit your posts
  •