User Tag List

Page 15 of 29 FirstFirst ... 5 13 14 15 16 17 25 ... LastLast
Results 141 to 150 of 289

Thread: Build Failed ---- Things to check

  1. #141
    Clicker Fusion 2.5 DeveloperFusion 2.5+ DLCAndroid Export ModuleiOS Export Module
    conceptgame's Avatar
    Join Date
    Apr 2011
    Location
    Switzerland
    Posts
    751
    Mentioned
    14 Post(s)
    Tagged
    0 Thread(s)
    Hi Kijewoku,

    You need to have Android SDKk Tools version 24.0.2 instead of 24.3.2 (you still have 24.3.2, see log). Something broken by last version if you do not have Android Studio.
    If you do not want to downgrade to 24.0.2, try this trick with version 24.3.2:
    Add the following 4 lines to C:\Users\Kijewoku\Documents\Android\android-sdk\tools\ant\build.xml, starting line 484:
    HTML Code:
    <property name="aidl" location="${android.build.tools.dir}/aidl${exe}" />
    <property name="aapt" location="${android.build.tools.dir}/aapt${exe}" />
    <property name="dx" location="${android.build.tools.dir}/dx${bat}" />
    <property name="zipalign" location="${android.build.tools.dir}/zipalign${exe}" />
    Make a backup of build.xml before editing it, just in case.

  2. #142
    Clicker Fusion 2.5 (Steam)Android Export Module (Steam)

    Join Date
    Jun 2015
    Posts
    8
    Mentioned
    0 Post(s)
    Tagged
    0 Thread(s)
    Hey ! Thanks you all ! It's ok !

    (very happy )

  3. #143
    Clicker Multimedia Fusion 2Android Export ModuleiOS Export ModuleSWF Export Module
    Fusion 2.5 (Steam)Android Export Module (Steam)iOS Export Module (Steam)

    Join Date
    Dec 2010
    Posts
    339
    Mentioned
    0 Post(s)
    Tagged
    0 Thread(s)
    Hi everyone, here is my log now

    ---
    Buildfile: C:\Users\user\AppData\Local\Temp\AndBA45.tmp\build .xml

    -set-mode-check:

    -set-debug-files:

    -check-env:
    [checkenv] Android SDK Tools Revision 24.3.3
    [checkenv] Installed at C:\Users\user\AppData\Local\Android\sdk

    -setup:
    [echo] Project Name: RuntimeAndroid
    [gettype] Project Type: Application

    -set-debug-mode:

    -debug-obfuscation-check:

    -pre-build:

    -build-setup:
    [getbuildtools] Using latest Build Tools: 22.0.1
    [echo] Resolving Build Target for RuntimeAndroid...

    BUILD FAILED
    C:\Users\user\AppData\Local\Android\sdk\tools\ant\ build.xml:538: Unable to resolve project target 'android-14'

    Total time: 1 second
    ---

    I am using old mmf2 and I can't change the API from 14 to a different value. And the studio won't give my an option to download ver.14.

    What can I do?

    Thanks a lot.

  4. #144
    Forum Moderator

    Fusion 2.5 MacFusion 2.5 DeveloperFusion 2.5+ DLCAndroid Export ModuleHTML5 Export ModuleiOS Export ModuleMac Export ModuleUniversal Windows Platform Export ModuleSWF Export ModuleInstall Creator Pro
    Fusion 2.5 (Steam)Fusion 2.5 Developer (Steam)Android Export Module (Steam)HTML5 Export Module (Steam)iOS Export Module (Steam)
    Perry's Avatar
    Join Date
    Dec 2013
    Location
    Watertown, WI
    Posts
    4,392
    Mentioned
    58 Post(s)
    Tagged
    0 Thread(s)
    Did you update the SDK's for it ? seems like you need to run the SDK manager for Android. and select the API's

  5. #145
    Clicker

    Fusion 2.5 (Steam)Fusion 2.5 Developer (Steam)Fusion 2.5+ DLC (Steam)Android Export Module (Steam)HTML5 Export Module (Steam)iOS Export Module (Steam)Universal Windows Platform Export Module (Steam)

    Join Date
    Jul 2015
    Posts
    7
    Mentioned
    0 Post(s)
    Tagged
    0 Thread(s)
    haha ~~good!

  6. #146
    Forum Moderator

    Fusion 2.5 MacFusion 2.5 DeveloperFusion 2.5+ DLCAndroid Export ModuleHTML5 Export ModuleiOS Export ModuleMac Export ModuleUniversal Windows Platform Export ModuleSWF Export ModuleInstall Creator Pro
    Fusion 2.5 (Steam)Fusion 2.5 Developer (Steam)Android Export Module (Steam)HTML5 Export Module (Steam)iOS Export Module (Steam)
    Perry's Avatar
    Join Date
    Dec 2013
    Location
    Watertown, WI
    Posts
    4,392
    Mentioned
    58 Post(s)
    Tagged
    0 Thread(s)
    The Max version of the SDK is API 22 for Fusion atm.
    Do NOT download API 23, since that one is not supported as of yet.

  7. #147
    Clicker Fusion 2.5

    Join Date
    Jun 2010
    Posts
    20
    Mentioned
    0 Post(s)
    Tagged
    0 Thread(s)

    Unhappy I'm stuck :(

    Hello all,

    I am having trouble building the application for Android and it seems like i've tried most of the solutions in this thread...
    Below is the error log, can anyone tell me what i'm doing wrong?

    Buildfile: C:\Users\Wouter\AppData\Local\Temp\And4CA1.tmp\bui ld.xml

    -set-mode-check:

    -set-debug-files:

    -check-env:
    [checkenv] Android SDK Tools Revision 24.3.4
    [checkenv] Installed at C:\Program Files (x86)\Android\android-sdk

    -setup:
    [echo] Project Name: RuntimeAndroid
    [gettype] Project Type: Application

    -set-debug-mode:

    -debug-obfuscation-check:

    -pre-build:

    -build-setup:
    [getbuildtools] Using latest Build Tools: 23.0.1
    [echo] Resolving Build Target for RuntimeAndroid...
    [gettarget] Project Target: Android 6.0
    [gettarget] API level: 23
    [echo] ----------
    [echo] Creating output directories if needed...
    [mkdir] Created dir: C:\Users\Wouter\AppData\Local\Temp\And4CA1.tmp\bin
    [mkdir] Created dir: C:\Users\Wouter\AppData\Local\Temp\And4CA1.tmp\bin \res
    [mkdir] Created dir: C:\Users\Wouter\AppData\Local\Temp\And4CA1.tmp\bin \rsObj
    [mkdir] Created dir: C:\Users\Wouter\AppData\Local\Temp\And4CA1.tmp\bin \rsLibs
    [mkdir] Created dir: C:\Users\Wouter\AppData\Local\Temp\And4CA1.tmp\gen
    [mkdir] Created dir: C:\Users\Wouter\AppData\Local\Temp\And4CA1.tmp\bin \classes
    [mkdir] Created dir: C:\Users\Wouter\AppData\Local\Temp\And4CA1.tmp\bin \dexedLibs
    [echo] ----------
    [echo] Resolving Dependencies for RuntimeAndroid...
    [dependency] Library dependencies:
    [dependency] No Libraries
    [dependency]
    [dependency] ------------------
    [echo] ----------
    [echo] Building Libraries with 'debug'...
    [subant] No sub-builds to iterate on

    -code-gen:
    [mergemanifest] Merging AndroidManifest files into one.
    [mergemanifest] Manifest merger disabled. Using project manifest only.
    [echo] Handling aidl files...
    [aidl] No AIDL files to compile.
    [echo] ----------
    [echo] Handling RenderScript files...
    [echo] ----------
    [echo] Handling Resources...
    [aapt] Generating resource IDs...
    [echo] ----------
    [echo] Handling BuildConfig class...
    [buildconfig] Generating BuildConfig class.

    -pre-compile:

    -compile:
    [javac] Compiling 448 source files to C:\Users\Wouter\AppData\Local\Temp\And4CA1.tmp\bin \classes
    [javac] warning: [options] source value 1.5 is obsolete and will be removed in a future release
    [javac] warning: [options] target value 1.5 is obsolete and will be removed in a future release
    [javac] warning: [options] To suppress warnings about obsolete options, use -Xlint:-options.
    [javac] C:\Users\Wouter\AppData\Local\Temp\And4CA1.tmp\src \Runtime\CrashReporter.java:24: error: package org.apache.http does not exist
    [javac] import org.apache.http.HttpResponse;
    [javac] ^
    [javac] C:\Users\Wouter\AppData\Local\Temp\And4CA1.tmp\src \Runtime\CrashReporter.java:25: error: package org.apache.http does not exist
    [javac] import org.apache.http.NameValuePair;
    [javac] ^
    [javac] C:\Users\Wouter\AppData\Local\Temp\And4CA1.tmp\src \Runtime\CrashReporter.java:26: error: package org.apache.http.client.entity does not exist
    [javac] import org.apache.http.client.entity.UrlEncodedFormEntity ;
    [javac] ^
    [javac] C:\Users\Wouter\AppData\Local\Temp\And4CA1.tmp\src \Runtime\CrashReporter.java:27: error: package org.apache.http.client.methods does not exist
    [javac] import org.apache.http.client.methods.HttpPost;
    [javac] ^
    [javac] C:\Users\Wouter\AppData\Local\Temp\And4CA1.tmp\src \Runtime\CrashReporter.java:28: error: package org.apache.http.impl.client does not exist
    [javac] import org.apache.http.impl.client.DefaultHttpClient;
    [javac] ^
    [javac] C:\Users\Wouter\AppData\Local\Temp\And4CA1.tmp\src \Runtime\CrashReporter.java:30: error: cannot find symbol
    [javac] import org.apache.http.params.HttpProtocolParams;
    [javac] ^
    [javac] symbol: class HttpProtocolParams
    [javac] location: package org.apache.http.params
    [javac] C:\Users\Wouter\AppData\Local\Temp\And4CA1.tmp\src \Runtime\CrashReporter.java:63: error: cannot find symbol
    [javac] ArrayList <NameValuePair> postData = new ArrayList <NameValuePair> ();
    [javac] ^
    [javac] symbol: class NameValuePair
    [javac] location: class CrashReporter
    [javac] C:\Users\Wouter\AppData\Local\Temp\And4CA1.tmp\src \Runtime\CrashReporter.java:63: error: cannot find symbol
    [javac] ArrayList <NameValuePair> postData = new ArrayList <NameValuePair> ();
    [javac] ^
    [javac] symbol: class NameValuePair
    [javac] location: class CrashReporter
    [javac] C:\Users\Wouter\AppData\Local\Temp\And4CA1.tmp\src \Runtime\CrashReporter.java:65: error: cannot find symbol
    [javac] postData.add(new NameValuePair()
    [javac] ^
    [javac] symbol: class NameValuePair
    [javac] location: class CrashReporter
    [javac] C:\Users\Wouter\AppData\Local\Temp\And4CA1.tmp\src \Runtime\CrashReporter.java:95: error: cannot find symbol
    [javac] HttpPost post = new HttpPost ("http://bugs.clickteam.com/report.php");
    [javac] ^
    [javac] symbol: class HttpPost
    [javac] location: class CrashReporter
    [javac] C:\Users\Wouter\AppData\Local\Temp\And4CA1.tmp\src \Runtime\CrashReporter.java:95: error: cannot find symbol
    [javac] HttpPost post = new HttpPost ("http://bugs.clickteam.com/report.php");
    [javac] ^
    [javac] symbol: class HttpPost
    [javac] location: class CrashReporter
    [javac] C:\Users\Wouter\AppData\Local\Temp\And4CA1.tmp\src \Runtime\CrashReporter.java:99: error: cannot find symbol
    [javac] { post.setEntity (new UrlEncodedFormEntity (postData));
    [javac] ^
    [javac] symbol: class UrlEncodedFormEntity
    [javac] location: class CrashReporter
    [javac] C:\Users\Wouter\AppData\Local\Temp\And4CA1.tmp\src \Runtime\CrashReporter.java:105: error: cannot find symbol
    [javac] DefaultHttpClient client = new DefaultHttpClient();
    [javac] ^
    [javac] symbol: class DefaultHttpClient
    [javac] location: class CrashReporter
    [javac] C:\Users\Wouter\AppData\Local\Temp\And4CA1.tmp\src \Runtime\CrashReporter.java:105: error: cannot find symbol
    [javac] DefaultHttpClient client = new DefaultHttpClient();
    [javac] ^
    [javac] symbol: class DefaultHttpClient
    [javac] location: class CrashReporter
    [javac] C:\Users\Wouter\AppData\Local\Temp\And4CA1.tmp\src \Runtime\CrashReporter.java:108: error: cannot find symbol
    [javac] HttpProtocolParams.setUseExpectContinue (params, false);
    [javac] ^
    [javac] symbol: variable HttpProtocolParams
    [javac] location: class CrashReporter
    [javac] C:\Users\Wouter\AppData\Local\Temp\And4CA1.tmp\src \Runtime\CrashReporter.java:111: error: cannot find symbol
    [javac] HttpResponse response;
    [javac] ^
    [javac] symbol: class HttpResponse
    [javac] location: class CrashReporter
    [javac] C:\Users\Wouter\AppData\Local\Temp\And4CA1.tmp\src \Runtime\MMFRuntime.java:1645: warning: non-varargs call of varargs method with inexact argument type for last parameter;
    [javac] Method m = c.getDeclaredMethod("disconnect", null);
    [javac] ^
    [javac] cast to Class<?> for a varargs call
    [javac] cast to Class<?>[] for a non-varargs call and to suppress this warning
    [javac] C:\Users\Wouter\AppData\Local\Temp\And4CA1.tmp\src \Runtime\MMFRuntime.java:1646: warning: non-varargs call of varargs method with inexact argument type for last parameter;
    [javac] Object o = m.invoke(null, null);
    [javac] ^
    [javac] cast to Object for a varargs call
    [javac] cast to Object[] for a non-varargs call and to suppress this warning
    [javac] C:\Users\Wouter\AppData\Local\Temp\And4CA1.tmp\src \Runtime\MMFRuntime.java:1660: warning: non-varargs call of varargs method with inexact argument type for last parameter;
    [javac] Method m = c.getDeclaredMethod("connect", null);
    [javac] ^
    [javac] cast to Class<?> for a varargs call
    [javac] cast to Class<?>[] for a non-varargs call and to suppress this warning
    [javac] C:\Users\Wouter\AppData\Local\Temp\And4CA1.tmp\src \Runtime\MMFRuntime.java:1661: warning: non-varargs call of varargs method with inexact argument type for last parameter;
    [javac] Object o = m.invoke(null, null);
    [javac] ^
    [javac] cast to Object for a varargs call
    [javac] cast to Object[] for a non-varargs call and to suppress this warning
    [javac] C:\Users\Wouter\AppData\Local\Temp\And4CA1.tmp\src \Runtime\MMFRuntime.java:1675: warning: non-varargs call of varargs method with inexact argument type for last parameter;
    [javac] Method m = c.getDeclaredMethod("isConnected", null);
    [javac] ^
    [javac] cast to Class<?> for a varargs call
    [javac] cast to Class<?>[] for a non-varargs call and to suppress this warning
    [javac] C:\Users\Wouter\AppData\Local\Temp\And4CA1.tmp\src \Runtime\MMFRuntime.java:1676: warning: non-varargs call of varargs method with inexact argument type for last parameter;
    [javac] Object o = m.invoke(null, null);
    [javac] ^
    [javac] cast to Object for a varargs call
    [javac] cast to Object[] for a non-varargs call and to suppress this warning
    [javac] Note: Some input files use or override a deprecated API.
    [javac] Note: Recompile with -Xlint:deprecation for details.
    [javac] Note: Some input files use unchecked or unsafe operations.
    [javac] Note: Recompile with -Xlint:unchecked for details.
    [javac] 16 errors
    [javac] 9 warnings

    BUILD FAILED
    C:\Program Files (x86)\Android\android-sdk\tools\ant\build.xml:716: The following error occurred while executing this line:
    C:\Program Files (x86)\Android\android-sdk\tools\ant\build.xml:730: Compile failed; see the compiler error output for details.

    Total time: 7 seconds

  8. #148
    Forum Moderator

    Fusion 2.5 MacFusion 2.5 DeveloperFusion 2.5+ DLCAndroid Export ModuleHTML5 Export ModuleiOS Export ModuleMac Export ModuleUniversal Windows Platform Export ModuleSWF Export ModuleInstall Creator Pro
    Fusion 2.5 (Steam)Fusion 2.5 Developer (Steam)Android Export Module (Steam)HTML5 Export Module (Steam)iOS Export Module (Steam)
    Perry's Avatar
    Join Date
    Dec 2013
    Location
    Watertown, WI
    Posts
    4,392
    Mentioned
    58 Post(s)
    Tagged
    0 Thread(s)
    You cannot use api 23.. that's is for android 6. U need to use api 22

  9. #149
    Clicker Fusion 2.5

    Join Date
    Jun 2010
    Posts
    20
    Mentioned
    0 Post(s)
    Tagged
    0 Thread(s)
    I have the same problem with api 22 (i've tried that after noticing an earlier comment here) but I would get the same problem.
    Will post the error log when I get off work

  10. #150
    Forum Moderator

    Fusion 2.5 MacFusion 2.5 DeveloperFusion 2.5+ DLCAndroid Export ModuleHTML5 Export ModuleiOS Export ModuleMac Export ModuleUniversal Windows Platform Export ModuleSWF Export ModuleInstall Creator Pro
    Fusion 2.5 (Steam)Fusion 2.5 Developer (Steam)Android Export Module (Steam)HTML5 Export Module (Steam)iOS Export Module (Steam)
    Perry's Avatar
    Join Date
    Dec 2013
    Location
    Watertown, WI
    Posts
    4,392
    Mentioned
    58 Post(s)
    Tagged
    0 Thread(s)
    Make sure that you have the SDK tools (all the way at the top in the SDK manager) built 22 as well

Page 15 of 29 FirstFirst ... 5 13 14 15 16 17 25 ... LastLast

Similar Threads

  1. BUILD FAILED
    By gregoire0 in forum Android Export Module Version 2.0
    Replies: 3
    Last Post: 18th April 2013, 04:05 PM
  2. Build failed
    By Farhan in forum Android Export Module Version 2.0
    Replies: 4
    Last Post: 9th April 2013, 06:09 PM
  3. [RC7] BUILD FAILED
    By Pharanygitis in forum Android Export Module Version 2.0
    Replies: 7
    Last Post: 29th March 2013, 01:44 PM
  4. Build #255 installation failed
    By Czentnar in forum Multimedia Fusion 2 - Technical Support
    Replies: 3
    Last Post: 21st July 2012, 05:55 PM
  5. Beta 29 - Failed Build
    By Kisguri in forum Android Export Module Version 2.0
    Replies: 5
    Last Post: 22nd May 2012, 10:31 PM

Posting Permissions

  • You may not post new threads
  • You may not post replies
  • You may not post attachments
  • You may not edit your posts
  •