User Tag List

Results 1 to 10 of 10

Thread: build failed (sometimes)

  1. #1
    Clicker Fusion 2.5 (Steam)Fusion 2.5 Developer (Steam)Android Export Module (Steam)
    gagegage926's Avatar
    Join Date
    Mar 2014
    Posts
    71
    Mentioned
    0 Post(s)
    Tagged
    0 Thread(s)

    Question build failed (sometimes)

    Sooooooooo..... I am working on my next app. It's no where being done but I felt like just throwing a quick .apk on my phone just to see how it looked. Hit build pops up a few second later build failed. I check JDK and SDK directories both are correct. I open an older app I built... exported just fine. Messed with API and target android version and some other settings and still no luck. Driving me insane please help?!?!

    here is the output file

    Buildfile: C:\Users\Gage\AppData\Local\Temp\And8B68.tmp\build .xml


    -set-mode-check:


    -set-debug-files:


    -check-env:
    [checkenv] Android SDK Tools Revision 22.6.4
    [checkenv] Installed at C:\Program Files (x86)\Android\android-sdk


    -setup:
    [echo] Project Name: RuntimeAndroid
    [gettype] Project Type: Application


    -set-debug-mode:


    -debug-obfuscation-check:


    -pre-build:


    -build-setup:
    [getbuildtools] Using latest Build Tools: 19.0.3
    [echo] Resolving Build Target for RuntimeAndroid...
    [gettarget] Project Target: Android 4.0
    [gettarget] API level: 14
    [echo] ----------
    [echo] Creating output directories if needed...
    [mkdir] Created dir: C:\Users\Gage\AppData\Local\Temp\And8B68.tmp\bin
    [mkdir] Created dir: C:\Users\Gage\AppData\Local\Temp\And8B68.tmp\bin\r es
    [mkdir] Created dir: C:\Users\Gage\AppData\Local\Temp\And8B68.tmp\bin\r sObj
    [mkdir] Created dir: C:\Users\Gage\AppData\Local\Temp\And8B68.tmp\bin\r sLibs
    [mkdir] Created dir: C:\Users\Gage\AppData\Local\Temp\And8B68.tmp\gen
    [mkdir] Created dir: C:\Users\Gage\AppData\Local\Temp\And8B68.tmp\bin\c lasses
    [mkdir] Created dir: C:\Users\Gage\AppData\Local\Temp\And8B68.tmp\bin\d exedLibs
    [echo] ----------
    [echo] Resolving Dependencies for RuntimeAndroid...
    [dependency] Library dependencies:
    [dependency] No Libraries
    [dependency]
    [dependency] ------------------
    [dependency] API<=15: Adding annotations.jar to the classpath.
    [echo] ----------
    [echo] Building Libraries with 'debug'...
    [subant] No sub-builds to iterate on


    -code-gen:
    [mergemanifest] Merging AndroidManifest files into one.
    [mergemanifest] Manifest merger disabled. Using project manifest only.
    [echo] Handling aidl files...
    [aidl] No AIDL files to compile.
    [echo] ----------
    [echo] Handling RenderScript files...
    [echo] ----------
    [echo] Handling Resources...
    [aapt] Generating resource IDs...
    [echo] ----------
    [echo] Handling BuildConfig class...
    [buildconfig] Generating BuildConfig class.


    -pre-compile:


    -compile:
    [javac] Compiling 434 source files to C:\Users\Gage\AppData\Local\Temp\And8B68.tmp\bin\c lasses
    [javac] C:\Users\Gage\AppData\Local\Temp\And8B68.tmp\src\E xtensions\CRunInputType.java:436: cannot find symbol
    [javac] symbol : class CRunkcedit
    [javac] location: class Extensions.CRunInputType
    [javac] if(ViewExt instanceof CRunkcedit) {
    [javac] ^
    [javac] C:\Users\Gage\AppData\Local\Temp\And8B68.tmp\src\E xtensions\CRunInputType.java:437: cannot find symbol
    [javac] symbol : class CRunkcedit
    [javac] location: class Extensions.CRunInputType
    [javac] CRunkcedit edit = ((CRunkcedit)ViewExt);
    [javac] ^
    [javac] C:\Users\Gage\AppData\Local\Temp\And8B68.tmp\src\E xtensions\CRunInputType.java:437: cannot find symbol
    [javac] symbol : class CRunkcedit
    [javac] location: class Extensions.CRunInputType
    [javac] CRunkcedit edit = ((CRunkcedit)ViewExt);
    [javac] ^
    [javac] Note: Some input files use or override a deprecated API.
    [javac] Note: Recompile with -Xlint:deprecation for details.
    [javac] Note: Some input files use unchecked or unsafe operations.
    [javac] Note: Recompile with -Xlint:unchecked for details.
    [javac] 3 errors


    BUILD FAILED
    C:\Program Files (x86)\Android\android-sdk\tools\ant\build.xml:720: The following error occurred while executing this line:
    C:\Program Files (x86)\Android\android-sdk\tools\ant\build.xml:734: Compile failed; see the compiler error output for details.


    Total time: 10 seconds

    I am confused about the extension parts that are claiming to be failed. Does that mean some of the extensions I have in my app are causing this?

  2. #2
    Clickteam Clickteam
    Jeff's Avatar
    Join Date
    Jun 2006
    Location
    Battle Ground Washington
    Posts
    11,824
    Mentioned
    8 Post(s)
    Tagged
    2 Thread(s)
    I would think its due to an extension.

    What is different between the 2 MFA files?
    Once you narrow it down then Fernando can take a look at the object in question and figure out what is causing the error.

  3. #3
    Clickteam Clickteam
    Fernando's Avatar
    Join Date
    Dec 2006
    Posts
    6,682
    Mentioned
    284 Post(s)
    Tagged
    4 Thread(s)
    what version of the exporter you are using?

    also is good idea to use the latest beta,

    test and let me know!
    Regards,


    Fernando Vivolo

    ... new things are coming ...

  4. #4
    Clicker Fusion 2.5 (Steam)Fusion 2.5 Developer (Steam)Android Export Module (Steam)
    gagegage926's Avatar
    Join Date
    Mar 2014
    Posts
    71
    Mentioned
    0 Post(s)
    Tagged
    0 Thread(s)
    Okay cool, I will look at it later tonight. I only extension that is different that I can remember is the Android Dialog Control.

  5. #5
    Clicker Fusion 2.5 (Steam)Fusion 2.5 Developer (Steam)Android Export Module (Steam)
    gagegage926's Avatar
    Join Date
    Mar 2014
    Posts
    71
    Mentioned
    0 Post(s)
    Tagged
    0 Thread(s)
    I have it on steam so I cant use the betas of exporters I thought. I deleted the Android Dialog Control and it exported just fine. Thanks for the help =3.

  6. #6
    Clickteam Clickteam
    Fernando's Avatar
    Join Date
    Dec 2006
    Posts
    6,682
    Mentioned
    284 Post(s)
    Tagged
    4 Thread(s)
    none of them, please check

    the errors appears from edit object.

    that why i think you have an old version.
    Regards,


    Fernando Vivolo

    ... new things are coming ...

  7. #7
    Clicker Fusion 2.5 (Steam)Fusion 2.5 Developer (Steam)Android Export Module (Steam)
    gagegage926's Avatar
    Join Date
    Mar 2014
    Posts
    71
    Mentioned
    0 Post(s)
    Tagged
    0 Thread(s)
    How would I go about updating the STEAM version for the Android exporter?

  8. #8
    Clickteam Clickteam
    Fernando's Avatar
    Join Date
    Dec 2006
    Posts
    6,682
    Mentioned
    284 Post(s)
    Tagged
    4 Thread(s)
    a version should come out soon.
    Regards,


    Fernando Vivolo

    ... new things are coming ...

  9. #9
    Clicker Fusion 2.5 DeveloperFusion 2.5+ DLCAndroid Export ModuleHTML5 Export ModuleiOS Export ModuleSWF Export Module
    Kimera's Avatar
    Join Date
    Feb 2007
    Location
    Houston, TX
    Posts
    729
    Mentioned
    2 Post(s)
    Tagged
    0 Thread(s)
    I deleted the active object called Etoile and it will build then. Not sure why an active would stop it but that did work.

    EDIT:
    My bad, wrong post I think.

  10. #10
    Clicker Fusion 2.5 DeveloperAndroid Export ModuleHTML5 Export ModuleiOS Export ModuleMac Export ModuleSWF Export ModuleUnicode Add-on
    Vantales's Avatar
    Join Date
    Jun 2007
    Location
    Tahiti
    Posts
    249
    Mentioned
    1 Post(s)
    Tagged
    0 Thread(s)
    Hi all,

    Kimera, the bug is not about the active object (called "Etoile" or anything else) but the bug was about the movement of this active object.
    Look my video for more details
    https://www.youtube.com/watch?v=bZ3y...ature=youtu.be

Similar Threads

  1. BUILD FAILED
    By gregoire0 in forum Android Export Module Version 2.0
    Replies: 3
    Last Post: 18th April 2013, 04:05 PM
  2. Build failed
    By Farhan in forum Android Export Module Version 2.0
    Replies: 4
    Last Post: 9th April 2013, 06:09 PM
  3. [RC7] BUILD FAILED
    By Pharanygitis in forum Android Export Module Version 2.0
    Replies: 7
    Last Post: 29th March 2013, 01:44 PM
  4. Build #255 installation failed
    By Czentnar in forum Multimedia Fusion 2 - Technical Support
    Replies: 3
    Last Post: 21st July 2012, 05:55 PM
  5. Beta 29 - Failed Build
    By Kisguri in forum Android Export Module Version 2.0
    Replies: 5
    Last Post: 22nd May 2012, 10:31 PM

Posting Permissions

  • You may not post new threads
  • You may not post replies
  • You may not post attachments
  • You may not edit your posts
  •