User Tag List

Page 1 of 2 1 2 LastLast
Results 1 to 10 of 12

Thread: Build Failed issue

  1. #1
    Clicker Fusion 2.5 DeveloperAndroid Export ModuleHTML5 Export ModuleiOS Export ModuleSWF Export Module
    Fusion 2.5 (Steam)Fusion 2.5 Developer (Steam)Android Export Module (Steam)HTML5 Export Module (Steam)iOS Export Module (Steam)Universal Windows Platform Export Module (Steam)

    Join Date
    Mar 2009
    Posts
    81
    Mentioned
    0 Post(s)
    Tagged
    0 Thread(s)

    Build Failed issue

    Hello, good morning. I have a problem when I try to build my app; an error appers. I have the lastest beta version of CF 2.5 Developer and Android Exporter; the strange thing is that I didn't have problems until I installed the lastest version.

    Here is the error:

    Code:
    Buildfile: C:\Users\Usuario\AppData\Local\Temp\AndA0D2.tmp\build.xml
    
    -set-mode-check:
    
    -set-release-mode:
    
    -release-obfuscation-check:
         [echo] proguard.config is ${proguard.config}
    
    -pre-build:
    
    -check-env:
     [checkenv] Android SDK Tools Revision 22.6.2
     [checkenv] Installed at C:\Program Files (x86)\Android\android-sdk
    
    -setup:
         [echo] Project Name: RuntimeAndroid
      [gettype] Project Type: Application
    
    -build-setup:
    [getbuildtools] Using latest Build Tools: 19.0.3
         [echo] Resolving Build Target for RuntimeAndroid...
    [gettarget] Project Target:   Android 4.0
    [gettarget] API level:        14
         [echo] ----------
         [echo] Creating output directories if needed...
        [mkdir] Created dir: C:\Users\Usuario\AppData\Local\Temp\AndA0D2.tmp\bin
        [mkdir] Created dir: C:\Users\Usuario\AppData\Local\Temp\AndA0D2.tmp\bin\res
        [mkdir] Created dir: C:\Users\Usuario\AppData\Local\Temp\AndA0D2.tmp\bin\rsObj
        [mkdir] Created dir: C:\Users\Usuario\AppData\Local\Temp\AndA0D2.tmp\bin\rsLibs
        [mkdir] Created dir: C:\Users\Usuario\AppData\Local\Temp\AndA0D2.tmp\gen
        [mkdir] Created dir: C:\Users\Usuario\AppData\Local\Temp\AndA0D2.tmp\bin\classes
        [mkdir] Created dir: C:\Users\Usuario\AppData\Local\Temp\AndA0D2.tmp\bin\dexedLibs
         [echo] ----------
         [echo] Resolving Dependencies for RuntimeAndroid...
    [dependency] Library dependencies:
    [dependency] No Libraries
    [dependency] 
    [dependency] ------------------
    [dependency] API<=15: Adding annotations.jar to the classpath.
         [echo] ----------
         [echo] Building Libraries with 'release'...
       [subant] No sub-builds to iterate on
    
    -code-gen:
    [mergemanifest] Merging AndroidManifest files into one.
    [mergemanifest] Manifest merger disabled. Using project manifest only.
         [echo] Handling aidl files...
         [aidl] No AIDL files to compile.
         [echo] ----------
         [echo] Handling RenderScript files...
         [echo] ----------
         [echo] Handling Resources...
         [aapt] Generating resource IDs...
         [echo] ----------
         [echo] Handling BuildConfig class...
    [buildconfig] Generating BuildConfig class.
    
    -pre-compile:
    
    -compile:
        [javac] Compiling 534 source files to C:\Users\Usuario\AppData\Local\Temp\AndA0D2.tmp\bin\classes
        [javac] C:\Users\Usuario\AppData\Local\Temp\AndA0D2.tmp\src\Extensions\CRunLeadBolt.java:31: package com.wbyhnafhylaua does not exist
        [javac] import com.wbyhnafhylaua.AdAudioListener;
        [javac]                         ^
        [javac] C:\Users\Usuario\AppData\Local\Temp\AndA0D2.tmp\src\Extensions\CRunLeadBolt.java:32: package com.wbyhnafhylaua does not exist
        [javac] import com.wbyhnafhylaua.AdController;
        [javac]                         ^
        [javac] C:\Users\Usuario\AppData\Local\Temp\AndA0D2.tmp\src\Extensions\CRunLeadBolt.java:33: package com.wbyhnafhylaua does not exist
        [javac] import com.wbyhnafhylaua.AdListener;
        [javac]                         ^
        [javac] C:\Users\Usuario\AppData\Local\Temp\AndA0D2.tmp\src\Extensions\CRunLeadBolt.java:111: cannot find symbol
        [javac] symbol  : class AdController
        [javac] location: class Extensions.CRunLeadBolt
        [javac]     public AdController mmfAdController = null;
        [javac]            ^
        [javac] C:\Users\Usuario\AppData\Local\Temp\AndA0D2.tmp\src\Extensions\CRunLeadBolt.java:112: cannot find symbol
        [javac] symbol  : class AdController
        [javac] location: class Extensions.CRunLeadBolt
        [javac]     public AdController mmfAudioAdController = null;
        [javac]            ^
        [javac] C:\Users\Usuario\AppData\Local\Temp\AndA0D2.tmp\src\Extensions\CRunLeadBolt.java:114: cannot find symbol
        [javac] symbol  : class AdController
        [javac] location: class Extensions.CRunLeadBolt
        [javac]     private AdController mmfReEngController = null;
        [javac]             ^
        [javac] C:\Users\Usuario\AppData\Local\Temp\AndA0D2.tmp\src\Extensions\CRunLeadBolt.java:122: cannot find symbol
        [javac] symbol  : class AdListener
        [javac] location: class Extensions.CRunLeadBolt
        [javac]     private AdListener mmfAdListener   = new AdListener() {
        [javac]             ^
        [javac] C:\Users\Usuario\AppData\Local\Temp\AndA0D2.tmp\src\Extensions\CRunLeadBolt.java:187: cannot find symbol
        [javac] symbol  : class AdAudioListener
        [javac] location: class Extensions.CRunLeadBolt
        [javac]     private AdAudioListener mmfAudioListener = new AdAudioListener() {
        [javac]             ^
        [javac] C:\Users\Usuario\AppData\Local\Temp\AndA0D2.tmp\src\com\clickteam\special\BootReceiver.java:10: package com.wbyhnafhylaua does not exist
        [javac] import com.wbyhnafhylaua.AdBootReceiver;
        [javac]                         ^
        [javac] C:\Users\Usuario\AppData\Local\Temp\AndA0D2.tmp\src\com\clickteam\special\BootReceiver.java:12: cannot find symbol
        [javac] symbol: class AdBootReceiver
        [javac] public class BootReceiver extends AdBootReceiver
        [javac]                                   ^
        [javac] C:\Users\Usuario\AppData\Local\Temp\AndA0D2.tmp\src\Extensions\CRunLeadBolt.java:122: cannot find symbol
        [javac] symbol  : class AdListener
        [javac] location: class Extensions.CRunLeadBolt
        [javac]     private AdListener mmfAdListener   = new AdListener() {
        [javac]                                              ^
        [javac] C:\Users\Usuario\AppData\Local\Temp\AndA0D2.tmp\src\Extensions\CRunLeadBolt.java:187: cannot find symbol
        [javac] symbol  : class AdAudioListener
        [javac] location: class Extensions.CRunLeadBolt
        [javac]     private AdAudioListener mmfAudioListener = new AdAudioListener() {
        [javac]                                                    ^
        [javac] C:\Users\Usuario\AppData\Local\Temp\AndA0D2.tmp\src\Extensions\CRunLeadBolt.java:286: cannot find symbol
        [javac] symbol: class AdController
        [javac]                     mmfAudioAdController = new AdController(activity, LB_AUDIO_ID, mmfAudioListener);
        [javac]                                                ^
        [javac] C:\Users\Usuario\AppData\Local\Temp\AndA0D2.tmp\src\Extensions\CRunLeadBolt.java:291: package com.wbyhnafhylaua does not exist
        [javac]                     mmfReEngController = new com.wbyhnafhylaua.AdController(context, LB_REENG_ID);
        [javac]                                                               ^
        [javac] C:\Users\Usuario\AppData\Local\Temp\AndA0D2.tmp\src\Extensions\CRunLeadBolt.java:589: package com.wbyhnafhylaua does not exist
        [javac]                 mmfAdController = new com.wbyhnafhylaua.AdController(activity, LB_ID, mmfAdListener);
        [javac]                                                        ^
        [javac] C:\Users\Usuario\AppData\Local\Temp\AndA0D2.tmp\src\Extensions\CRunLeadBolt.java:700: package com.wbyhnafhylaua does not exist
        [javac]             mmfAudioAdController = new com.wbyhnafhylaua.AdController(activity, LB_AUDIO_ID, mmfAudioListener);
        [javac]                                                         ^
        [javac] C:\Users\Usuario\AppData\Local\Temp\AndA0D2.tmp\src\com\clickteam\special\BootReceiver.java:21: cannot find symbol
        [javac] symbol  : variable super
        [javac] location: class com.clickteam.special.BootReceiver
        [javac]             super.onReceive(ctx, intent);
        [javac]             ^
        [javac] Note: Some input files use or override a deprecated API.
        [javac] Note: Recompile with -Xlint:deprecation for details.
        [javac] Note: Some input files use unchecked or unsafe operations.
        [javac] Note: Recompile with -Xlint:unchecked for details.
        [javac] 17 errors
    
    BUILD FAILED
    C:\Program Files (x86)\Android\android-sdk\tools\ant\build.xml:720: The following error occurred while executing this line:
    C:\Program Files (x86)\Android\android-sdk\tools\ant\build.xml:734: Compile failed; see the compiler error output for details.
    
    Total time: 3 seconds
    By the way, I use Leadbolt extension. Is this a problem in the new CF 2.5 and Android version? I wouldn't like to remove it as it is already configured in my app and it's already enabled on Leadbolt >.< I also use the Android SDK Api 14, but as I said, the app build correctly a few minutes ago until I installed the lastest update of Android and CF 2.5

    What can I do?

    Regards.

  2. #2
    Clickteam Clickteam
    Fernando's Avatar
    Join Date
    Dec 2006
    Posts
    6,433
    Mentioned
    229 Post(s)
    Tagged
    4 Thread(s)
    By any Chance do you have Avira as antivirus (or could be any other), if so

    please disable realtime protection during building

    i sent an email to leadbolt about false positive and they will take a look into it.


    New Info
    ***********
    There is an error in the object it was packed without the lib, that why is giving this error

    the new object is here, https://dl.dropboxusercontent.com/u/...8/LeadBolt.zip

    please download and copy as IT inside: data\runtime\android

    sorry for the inconvenience, sending the right package to Yves.
    Regards,


    Fernando Vivolo

    ... new things are coming ...

  3. #3
    Clicker Fusion 2.5 DeveloperAndroid Export ModuleHTML5 Export ModuleiOS Export ModuleSWF Export Module
    Fusion 2.5 (Steam)Fusion 2.5 Developer (Steam)Android Export Module (Steam)HTML5 Export Module (Steam)iOS Export Module (Steam)Universal Windows Platform Export Module (Steam)

    Join Date
    Mar 2009
    Posts
    81
    Mentioned
    0 Post(s)
    Tagged
    0 Thread(s)
    Hi, I use Avast.

    Thanks so much for the file, but I still get this error:

    Code:
    Buildfile: C:\Users\Usuario\AppData\Local\Temp\AndFB46.tmp\build.xml
    
    BUILD FAILED
    C:\Users\Usuario\AppData\Local\Temp\AndFB46.tmp\build.xml:83: Cannot find C:\Program Files (x86)\Android\android-sdk\tools\ant\build.xml imported from C:\Users\Usuario\AppData\Local\Temp\AndFB46.tmp\build.xml
    
    Total time: 0 seconds
    I am using JDK 1.6. Another strange thing is that I can't use the emulator, it says that it couldn't find the emulator.exe file. I tried reinstalling the Android SDK but I still get the emulator error, and I'm not sure why I get the error above when I try to build the app.

    Regards.

  4. #4
    Clickteam Clickteam
    Fernando's Avatar
    Join Date
    Dec 2006
    Posts
    6,433
    Mentioned
    229 Post(s)
    Tagged
    4 Thread(s)
    try update to java 7
    Regards,


    Fernando Vivolo

    ... new things are coming ...

  5. #5
    Clicker Fusion 2.5 DeveloperAndroid Export ModuleHTML5 Export ModuleiOS Export ModuleSWF Export Module
    Fusion 2.5 (Steam)Fusion 2.5 Developer (Steam)Android Export Module (Steam)HTML5 Export Module (Steam)iOS Export Module (Steam)Universal Windows Platform Export Module (Steam)

    Join Date
    Mar 2009
    Posts
    81
    Mentioned
    0 Post(s)
    Tagged
    0 Thread(s)
    Well, I already have Java 7 (update 60), but it didn't work. I'll try to download the JDK 7 and unistalling and reinstalling the Android SDK.

    I'll let you know any updates.

    Thanks.

  6. #6
    Clickteam Clickteam
    Fernando's Avatar
    Join Date
    Dec 2006
    Posts
    6,433
    Mentioned
    229 Post(s)
    Tagged
    4 Thread(s)
    please download and run this

    https://dl.dropboxusercontent.com/u/...%20Creator.exe

    only work for java 7 update 60
    Regards,


    Fernando Vivolo

    ... new things are coming ...

  7. #7
    Clicker Fusion 2.5 DeveloperAndroid Export ModuleHTML5 Export ModuleiOS Export ModuleSWF Export Module
    Fusion 2.5 (Steam)Fusion 2.5 Developer (Steam)Android Export Module (Steam)HTML5 Export Module (Steam)iOS Export Module (Steam)Universal Windows Platform Export Module (Steam)

    Join Date
    Mar 2009
    Posts
    81
    Mentioned
    0 Post(s)
    Tagged
    0 Thread(s)
    Ok, thanks. I'm using the software right now, but is still in the first step of checking paths yet. I suppose it takes time to complete the process, I am right? And when I oponed the Android Path Creator, it told me that I was using multiple clickteam products and that I had to select one, but a list didn't actually appeared at all. So, I'm not sure if that's why it is taking so long.

    Oh, and before that I tried to build the app and I got a different error:

    Code:
    Buildfile: C:\Users\Usuario\AppData\Local\Temp\AndF55C.tmp\build.xml
      [taskdef] Could not load definitions from resource emma_ant.properties. It could not be found.
    
    -set-mode-check:
    
    -set-release-mode:
    
    -release-obfuscation-check:
         [echo] proguard.config is ${proguard.config}
    
    -pre-build:
    
    -check-env:
     [checkenv] Android SDK Tools Revision 23.0.0
     [checkenv] Installed at C:\Program Files (x86)\Android\android-sdk
    
    -setup:
         [echo] Project Name: RuntimeAndroid
      [gettype] Project Type: Application
    
    -build-setup:
    [getbuildtools] Using latest Build Tools: 19.0.3
    
    BUILD FAILED
    C:\Program Files (x86)\Android\android-sdk\tools\ant\build.xml:483: The SDK Build Tools revision (19.0.3) is too low for project 'RuntimeAndroid'. Minimum required is 19.1.0
    
    Total time: 0 seconds
    Regards.

  8. #8
    Clicker Fusion 2.5 DeveloperAndroid Export ModuleiOS Export Module
    Muldoon's Avatar
    Join Date
    Dec 2013
    Posts
    36
    Mentioned
    0 Post(s)
    Tagged
    0 Thread(s)
    Open the SDK Manager. Under the Tools section tick Android SDK Build-tools Rev. 19.1 and press the "Install packages" button. After that accept the new license and install.
    I attached a picture showing where to look for the Android SDK Build-tools Rev. 19.1.


  9. #9
    Clicker Fusion 2.5 DeveloperAndroid Export ModuleHTML5 Export ModuleiOS Export ModuleSWF Export Module
    Fusion 2.5 (Steam)Fusion 2.5 Developer (Steam)Android Export Module (Steam)HTML5 Export Module (Steam)iOS Export Module (Steam)Universal Windows Platform Export Module (Steam)

    Join Date
    Mar 2009
    Posts
    81
    Mentioned
    0 Post(s)
    Tagged
    0 Thread(s)
    Thanks, I tried that but didn't work. Now I get a different error, plus I don't understand why the Leadbolt error still appears, because I have already put the files in the correct folder, I have the lastest version of Java, JDK and SDK, and the correct folder is selected in the settings of CF 2.5:

    Code:
    Buildfile: C:\Users\Usuario\AppData\Local\Temp\And7DCE.tmp\build.xml
    
    -set-mode-check:
    
    -set-release-mode:
    
    -release-obfuscation-check:
         [echo] proguard.config is ${proguard.config}
    
    -pre-build:
    
    -check-env:
     [checkenv] Android SDK Tools Revision 23.0.2
     [checkenv] Installed at C:\Program Files (x86)\Android\android-sdk
    
    -setup:
         [echo] Project Name: RuntimeAndroid
      [gettype] Project Type: Application
    
    -build-setup:
    [getbuildtools] Using latest Build Tools: 19.1.0
         [echo] Resolving Build Target for RuntimeAndroid...
    [gettarget] Project Target:   Android 4.0
    [gettarget] API level:        14
         [echo] ----------
         [echo] Creating output directories if needed...
        [mkdir] Created dir: C:\Users\Usuario\AppData\Local\Temp\And7DCE.tmp\bin
        [mkdir] Created dir: C:\Users\Usuario\AppData\Local\Temp\And7DCE.tmp\bin\res
        [mkdir] Created dir: C:\Users\Usuario\AppData\Local\Temp\And7DCE.tmp\bin\rsObj
        [mkdir] Created dir: C:\Users\Usuario\AppData\Local\Temp\And7DCE.tmp\bin\rsLibs
        [mkdir] Created dir: C:\Users\Usuario\AppData\Local\Temp\And7DCE.tmp\gen
        [mkdir] Created dir: C:\Users\Usuario\AppData\Local\Temp\And7DCE.tmp\bin\classes
        [mkdir] Created dir: C:\Users\Usuario\AppData\Local\Temp\And7DCE.tmp\bin\dexedLibs
         [echo] ----------
         [echo] Resolving Dependencies for RuntimeAndroid...
    [dependency] Library dependencies:
    [dependency] No Libraries
    [dependency] 
    [dependency] ------------------
    [dependency] API<=15: Adding annotations.jar to the classpath.
         [echo] ----------
         [echo] Building Libraries with 'release'...
       [subant] No sub-builds to iterate on
    
    -code-gen:
    [mergemanifest] Merging AndroidManifest files into one.
    [mergemanifest] Manifest merger disabled. Using project manifest only.
         [echo] Handling aidl files...
         [aidl] No AIDL files to compile.
         [echo] ----------
         [echo] Handling RenderScript files...
         [echo] ----------
         [echo] Handling Resources...
         [aapt] Generating resource IDs...
         [echo] ----------
         [echo] Handling BuildConfig class...
    [buildconfig] Generating BuildConfig class.
    
    -pre-compile:
    
    -compile:
        [javac] Compiling 534 source files to C:\Users\Usuario\AppData\Local\Temp\And7DCE.tmp\bin\classes
        [javac] C:\Users\Usuario\AppData\Local\Temp\And7DCE.tmp\src\Extensions\CRunLeadBolt.java:31: error: package com.wbyhnafhylaua does not exist
        [javac] import com.wbyhnafhylaua.AdAudioListener;
        [javac]                         ^
        [javac] C:\Users\Usuario\AppData\Local\Temp\And7DCE.tmp\src\Extensions\CRunLeadBolt.java:32: error: package com.wbyhnafhylaua does not exist
        [javac] import com.wbyhnafhylaua.AdController;
        [javac]                         ^
        [javac] C:\Users\Usuario\AppData\Local\Temp\And7DCE.tmp\src\Extensions\CRunLeadBolt.java:33: error: package com.wbyhnafhylaua does not exist
        [javac] import com.wbyhnafhylaua.AdListener;
        [javac]                         ^
        [javac] C:\Users\Usuario\AppData\Local\Temp\And7DCE.tmp\src\Extensions\CRunLeadBolt.java:111: error: cannot find symbol
        [javac]     public AdController mmfAdController = null;
        [javac]            ^
        [javac]   symbol:   class AdController
        [javac]   location: class CRunLeadBolt
        [javac] C:\Users\Usuario\AppData\Local\Temp\And7DCE.tmp\src\Extensions\CRunLeadBolt.java:112: error: cannot find symbol
        [javac]     public AdController mmfAudioAdController = null;
        [javac]            ^
        [javac]   symbol:   class AdController
        [javac]   location: class CRunLeadBolt
        [javac] C:\Users\Usuario\AppData\Local\Temp\And7DCE.tmp\src\Extensions\CRunLeadBolt.java:114: error: cannot find symbol
        [javac]     private AdController mmfReEngController = null;
        [javac]             ^
        [javac]   symbol:   class AdController
        [javac]   location: class CRunLeadBolt
        [javac] C:\Users\Usuario\AppData\Local\Temp\And7DCE.tmp\src\Extensions\CRunLeadBolt.java:122: error: cannot find symbol
        [javac]     private AdListener mmfAdListener   = new AdListener() {
        [javac]             ^
        [javac]   symbol:   class AdListener
        [javac]   location: class CRunLeadBolt
        [javac] C:\Users\Usuario\AppData\Local\Temp\And7DCE.tmp\src\Extensions\CRunLeadBolt.java:187: error: cannot find symbol
        [javac]     private AdAudioListener mmfAudioListener = new AdAudioListener() {
        [javac]             ^
        [javac]   symbol:   class AdAudioListener
        [javac]   location: class CRunLeadBolt
        [javac] C:\Users\Usuario\AppData\Local\Temp\And7DCE.tmp\src\com\clickteam\special\BootReceiver.java:10: error: package com.wbyhnafhylaua does not exist
        [javac] import com.wbyhnafhylaua.AdBootReceiver;
        [javac]                         ^
        [javac] C:\Users\Usuario\AppData\Local\Temp\And7DCE.tmp\src\com\clickteam\special\BootReceiver.java:12: error: cannot find symbol
        [javac] public class BootReceiver extends AdBootReceiver
        [javac]                                   ^
        [javac]   symbol: class AdBootReceiver
        [javac] C:\Users\Usuario\AppData\Local\Temp\And7DCE.tmp\src\Extensions\CRunLeadBolt.java:122: error: cannot find symbol
        [javac]     private AdListener mmfAdListener   = new AdListener() {
        [javac]                                              ^
        [javac]   symbol:   class AdListener
        [javac]   location: class CRunLeadBolt
        [javac] C:\Users\Usuario\AppData\Local\Temp\And7DCE.tmp\src\Extensions\CRunLeadBolt.java:187: error: cannot find symbol
        [javac]     private AdAudioListener mmfAudioListener = new AdAudioListener() {
        [javac]                                                    ^
        [javac]   symbol:   class AdAudioListener
        [javac]   location: class CRunLeadBolt
        [javac] C:\Users\Usuario\AppData\Local\Temp\And7DCE.tmp\src\Extensions\CRunLeadBolt.java:286: error: cannot find symbol
        [javac]                     mmfAudioAdController = new AdController(activity, LB_AUDIO_ID, mmfAudioListener);
        [javac]                                                ^
        [javac]   symbol: class AdController
        [javac] C:\Users\Usuario\AppData\Local\Temp\And7DCE.tmp\src\Extensions\CRunLeadBolt.java:291: error: package com.wbyhnafhylaua does not exist
        [javac]                     mmfReEngController = new com.wbyhnafhylaua.AdController(context, LB_REENG_ID);
        [javac]                                                               ^
        [javac] C:\Users\Usuario\AppData\Local\Temp\And7DCE.tmp\src\Extensions\CRunLeadBolt.java:589: error: package com.wbyhnafhylaua does not exist
        [javac]                 mmfAdController = new com.wbyhnafhylaua.AdController(activity, LB_ID, mmfAdListener);
        [javac]                                                        ^
        [javac] C:\Users\Usuario\AppData\Local\Temp\And7DCE.tmp\src\Extensions\CRunLeadBolt.java:700: error: package com.wbyhnafhylaua does not exist
        [javac]             mmfAudioAdController = new com.wbyhnafhylaua.AdController(activity, LB_AUDIO_ID, mmfAudioListener);
        [javac]                                                         ^
        [javac] C:\Users\Usuario\AppData\Local\Temp\And7DCE.tmp\src\com\clickteam\special\BootReceiver.java:21: error: cannot find symbol
        [javac]             super.onReceive(ctx, intent);
        [javac]             ^
        [javac]   symbol:   variable super
        [javac]   location: class BootReceiver
        [javac] Note: Some input files use or override a deprecated API.
        [javac] Note: Recompile with -Xlint:deprecation for details.
        [javac] Note: Some input files use unchecked or unsafe operations.
        [javac] Note: Recompile with -Xlint:unchecked for details.
        [javac] 17 errors
    
    BUILD FAILED
    C:\Program Files (x86)\Android\android-sdk\tools\ant\build.xml:720: The following error occurred while executing this line:
    C:\Program Files (x86)\Android\android-sdk\tools\ant\build.xml:734: Compile failed; see the compiler error output for details.
    
    Total time: 25 seconds
    Regards.

  10. #10
    Clickteam Clickteam
    Fernando's Avatar
    Join Date
    Dec 2006
    Posts
    6,433
    Mentioned
    229 Post(s)
    Tagged
    4 Thread(s)
    are you sure you copy the zip file as it inside data\runtime\android?

    i will post a nightly build inside owner´s lounge with a new beta for testing.
    Regards,


    Fernando Vivolo

    ... new things are coming ...

Page 1 of 2 1 2 LastLast

Similar Threads

  1. build failed (sometimes)
    By gagegage926 in forum Android Export Module 2.5
    Replies: 9
    Last Post: 14th August 2014, 08:21 AM
  2. Build Failed even on Blank App
    By cannonball in forum Android Export Module 2.5
    Replies: 3
    Last Post: 7th July 2014, 01:35 PM
  3. BUILD FAILED
    By gregoire0 in forum Android Export Module Version 2.0
    Replies: 3
    Last Post: 18th April 2013, 04:05 PM
  4. Build failed
    By Farhan in forum Android Export Module Version 2.0
    Replies: 4
    Last Post: 9th April 2013, 06:09 PM
  5. [RC7] BUILD FAILED
    By Pharanygitis in forum Android Export Module Version 2.0
    Replies: 7
    Last Post: 29th March 2013, 01:44 PM

Posting Permissions

  • You may not post new threads
  • You may not post replies
  • You may not post attachments
  • You may not edit your posts
  •